{"text_format":"1","workbook":"xlsx","n_sheets":10,"sheets":["Leads","MailLists","BadList","PrepSheet","FormatMailList","NoteSheet","Letterhead","New Invoice","Invoices","Sheet6"],"not_rendered":{"charts":0,"images":15,"macros":1,"external_links":0,"defined_names":34,"comments":0,"pivot_tables":0},"unopened":[],"bounds":{"document_bytes":16777216,"sheet_cells":100000,"rows_first":2000,"rows_last":500,"rows_between":2000,"halvings":0,"cell_chars":16384,"cell_head_chars":4096},"cells_cut":0,"cells_raw":0,"read":"whole","date_system":"1900"}

{"sheet":"Leads","index":0,"n_rows":2797,"n_cols":26,"rows_kept":2797,"cut":false,"hidden":false,"merged":[]}
[null,null,null,null,null,null,null,null,null,null,null,null,null,null,null,null,null,null,"Hamilton County, TN"]
["Changes",6,null,"Filters:",null,null,null,null,"dblclkON",null,null,null,null,null,null,null,null,null,"Total Leads",2791]
["Last Save","2023-05-09T15:48:19",null,null,null,null,null,null,"ON",null,null,null,null,null,null,"Highlight Act Row?",false,null,"Uncontacted Leads",2176]
["Active Row:",2797,null,null,null,null,null,null,null,null,null,null,null,null,null,null,null,null,"No Contact info",1735]
["Current Search","OpenCorp",null,null,null,null,null,null,null,null,null,null,null,null,null,null,null,null,"Mail Ready",73]
[null,"RecordNo","Row","Contact","CrossRef","Notes","Category","Contact_Made","E-mail1","E-mail2","E-mail3","Phone1","Phone2","Phone3","Address","City","State","Zip","County","No emails","No Phone","No Contact Info","Type","Status","Links","Files"]
[null,20230426142724,{"$f":"ROW()","v":7},"Adebola T Olowe Sr",null,null,"Lead","MailList6","olowea@email.uc.edu","jeaunita@gmail.com","adebola@ureach.com","(513) 290-7766","(513) 923-0011","(513) 221-6112","1549 Blair Ave","Cincinnati","OH","45207","Hamilton County, OH",false,false,false]
[null,20230426142731,{"$f":"ROW()","v":8},"Agnes G Hall",null,null,"Lead","MailList6","","","","(513) 321-0324","(513) 321-0324","(513) 321-0324","2150 Easthill Ave","Cincinnati","OH","45208","Hamilton County, OH",true,false,false]
[null,20230426142738,{"$f":"ROW()","v":9},"Alexander J Hawke","",null,"Lead","MailList6","ahawke@projetech.com","hawkeaj@mail.uc.edu","","(937) 717-6503","(937) 717-6503","(937) 717-6503","2002 Beth Ann Way","Miamisburg","OH","45342","Hamilton County, OH",false,false,false]
[null,20230426142811,{"$f":"ROW()","v":10},"Amy Minor","",null,"Lead","MailList6","amylee413@yahoo.com","amyjolee@comcast.net","","(409) 316-1299","(409) 316-1299","(409) 316-1299","2848 W Simplicity Dr","Tucson","AZ","85741","Hamilton County, OH",false,false,false]
[null,20230426142814,{"$f":"ROW()","v":11},"Beth M Adams","",null,"Lead","MailList6","emt71@aol.com","emt@gci.net","emt71@webtv.com","(610) 597-2733","(717) 489-1724","(484) 217-2143","670 Appenzell Dr","Hummelstown","PA",17036,"Hamilton County, OH",false,false,false]
[null,20230426142816,{"$f":"ROW()","v":12},"Bryan D Bundy","",null,"Lead","MailList6","seminoles1204@gmail.com","bbundy2223@sbcglobal.net",null,"(317) 507-4164","(317) 716-4211","(317) 787-9880","7062 McFarland Rd","Indianapolis","IN","46227","Hamilton County, OH",false,false,false]
[null,20230426142819,{"$f":"ROW()","v":13},"Caleb Seifu","",null,"Lead","MailList6","blackangelfamilybookings@gmail.com","c.seifu@yahoo.com","avenuecincy33@gmail.com","(513) 309-3728","(513) 328-2788","(513) 578-0114","4620 Chalet Dr","Cincinnati","OH","45217","Hamilton County, OH",false,false,false]
[null,20230426142826,{"$f":"ROW()","v":14},"Candace G Stevenson","",null,"Lead",null,null,null,null,"(513) 550-4554","(513) 755-0310","(513) 469-2747","8316 Myrtle Ln #A","Liberty Township","OH","45044","Hamilton County, OH",true,false,false]
[null,20230426142827,{"$f":"ROW()","v":15},"Candace Marie Mott",null,null,"Lead",null,null,null,null,"(719) 268-6658","(719) 533-0238",null,"PO Box 18864","Erlanger","KY","41018","Hamilton County, OH",true,false,false]
[null,20230426142828,{"$f":"ROW()","v":16},"Carliss Payne","",null,"Lead","MailList6","chefcarlisspayne@gmail.com","car-liss@hotmail.com",null,"(513) 290-4774","(513) 931-6002","(513) 351-5626","8540 Sunlight Dr","Cincinnati","OH","45231","Hamilton County, OH",false,false,false]
[null,20230426142829,{"$f":"ROW()","v":17},"Charles E Green","",null,"Lead","MailList6","bobthebobgreen@gmail.com","charlesg3967@gmail.com","runningfox75@gmail.com","(937) 779-2650","(937) 764-1525","(937) 562-1703","69 W Main St","New Vienna","OH","45159","Hamilton County, OH",false,false,false]
[null,20230426142830,{"$f":"ROW()","v":18},"Chico D Chappell","",null,"Lead","MailList6","mrchico40@gmail.com","cchappell002@cinci.rr.com","ms.takia@yahoo.com","(513) 574-0427","(513) 266-9559","(513) 471-0751","2722 Queen City Ave #3F","Cincinnati","OH","45238","Hamilton County, OH",false,false,false]
[null,20230426142831,{"$f":"ROW()","v":19},"Christopher Deveaux","Jennifer Deveaux",null,"Lead","MailList6","perthib@lycos.com","cdeveaux@adelphia.net","thejehn@gmail.com","(419) 771-9254","(419) 899-4147","(614) 517-2110","7213 Quail Run Dr","West Chester","OH","45069","Hamilton County, OH",false,false,false]
[null,20230426142832,{"$f":"ROW()","v":20},"Chuck R Stidham","",null,"Lead","MailList6","marys@bellsouth.net","charlie.stidham@gmail.com","cstidham@comcast.net","(602) 989-7493","(602) 679-3898","(480) 998-8087","10522 E San Salvador Dr","Scottsdale","AZ","85258","Hamilton County, OH",false,false,false]
[null,20230426142833,{"$f":"ROW()","v":21},"Connie H Smith","",null,"Lead","MailList6","caulil@hotmail.com","giorgio@enet.it","adeae341@aol.com","(513) 834-0499","(513) 237-6649","(513) 598-9988","33 Car Berl Dr","Georgetown","OH","45121","Hamilton County, OH",false,false,false]
[null,20230426142834,{"$f":"ROW()","v":22},"Connie Smith","",null,"Lead","MailList6","cj_smith205@yahoo.com","connells@comcast.net","ruconnells50@comcast.net","(216) 990-7256","(216) 570-4704","(216) 438-7315","4871 Banbury Ct #18","Cleveland","OH","44128","Hamilton County, OH",false,false,false]
[null,20230426142835,{"$f":"ROW()","v":23},"Darin Hall","",null,"Lead","MailList6","hunt_briana01@yahoo.com","vhunt31@yahoo.com","darinhunt46@gmail.com","(216) 210-7953","(216) 518-1674","(216) 587-4183","15604 Greendale Rd","Maple Heights","OH","44137","Hamilton County, OH",false,false,false]
[null,20230426142836,{"$f":"ROW()","v":24},"Deanna L Heflin Spells","",null,"Lead","MailList6","deeanna6968@gmail.com","deeannajewell@gmail.com","deeanna6969@gmail.com","(330) 604-6405","(330) 410-1009","(330) 991-0029","14778 Calaboone Rd","Doylestown","OH","44230","Hamilton County, OH",false,false,false]
[null,20230426142837,{"$f":"ROW()","v":25},"Dennis A Denewitt","",null,"Lead","MailList6","dennis.denewitt@worldnet.att.net","zots4zots@gmail.com","","(513) 791-8818","(513) 385-9308","(513) 996-3038","4146 Lansdowne Ave","Cincinnati","OH","45236","Hamilton County, OH",false,false,false]
[null,20230426142838,{"$f":"ROW()","v":26},"Derrick Kassem","",null,"Lead","MailList6","dkassem@kassemrealestate.com","derrick.k@equityteam.com","","(513) 293-7628","(513) 221-0880","(513) 351-5717","2603 Cypress Way","Cincinnati","OH","45212","Hamilton County, OH",false,false,false]
[null,20230426142839,{"$f":"ROW()","v":27},"Diamond Brocks","",null,"Lead","MailList6","diamond_brocks@yahoo.com","","","(513) 407-6338","(513) 205-4157",null,"4212 Allendorf Dr #50","Cincinnati","OH","45209","Hamilton County, OH",false,false,false]
[null,20230426142840,{"$f":"ROW()","v":28},"Dorian Lacourse","",null,"Lead","MailList6","dlacourse3@gmail.com","silvershadow32@yahoo.com","","(513) 382-9689","(513) 248-2339","(513) 877-2005","2158 Oakwood Dr","Milford","OH","45150","Hamilton County, OH",false,false,false]
[null,20230426142841,{"$f":"ROW()","v":29},"Duane Grigsby","",null,"Lead","MailList6","billygrigsby80@yahoo.com","kennethc19@aol.com","","(734) 430-5874","(803) 661-8449","(803) 271-1646","521 E 2nd St","Monroe","MI","48161","Hamilton County, OH",false,false,false]
[null,20230426142842,{"$f":"ROW()","v":30},"Eileen T Vester","",null,"Lead","MailList6","eileen.vester@hotmail.com","fireleen@yahoo.com","eileenffg@gmail.com","(513) 871-4802","(513) 271-9110","(828) 803-5538","3052 Portsmouth Ave #1","Cincinnati","OH","45208","Hamilton County, OH",false,false,false]
[null,20230426142843,{"$f":"ROW()","v":31},"Elliot L Adams","",null,"Lead","MailList6","elliott.adams@hotmail.com","xelliott.sadams54@hotmail.com","","(614) 754-8474","(614) 456-7987","(614) 337-9570","2237 Willamont Ave","Columbus","OH","43219","Hamilton County, OH",false,false,false]
[null,20230426142844,{"$f":"ROW()","v":32},"Ephriam Swafford","",null,"Lead","MailList6","eswaffor@us.ibm.com","","",null,null,null,"4 Warwick Pl","Cincinnati","OH","45246","Hamilton County, OH",false,true,false]
[null,20230426142845,{"$f":"ROW()","v":33},"Eric R Beach","",null,"Lead","MailList6","niceman@thrunet.com","morehemp@hotmail.com","","(513) 520-4279","(513) 502-2943","(513) 524-4367","2034 Madison Rd","Cincinnati","OH","45208","Hamilton County, OH",false,false,false]
[null,20230426142846,{"$f":"ROW()","v":34},"Ernest Fedeli","",null,"Lead","MailList6","fedeli_ei@msn.com","","","(415) 454-0521","(513) 429-2302","(312) 337-3045","7194 Foxview Dr","Cincinnati","OH","45230","Hamilton County, OH",false,false,false]
[null,20230426142847,{"$f":"ROW()","v":35},"Fesum Ogbazion","",null,"Lead",null,"","","","(513) 317-0857","(513) 948-1211","(513) 571-4651","Harrison Ave","Cincinnati","OH","45202","Hamilton County, OH",true,false,false]
[null,20230426142848,{"$f":"ROW()","v":36},"Garnisa M Winbush","",null,"Lead","MailList6","garnisawinbush@yahoo.com","","","(513) 213-4585","(513) 389-0596","(513) 614-6907","3262 Werk Rd","Cincinnati","OH","45211","Hamilton County, OH",false,false,false]
[null,20230426142849,{"$f":"ROW()","v":37},"Hemptations","Eric R Beach",null,"Lead","MailList6","niceman@thrunet.com","morehemp@hotmail.com","hemptations@yahoo.com","(513) 520-4279","(513) 502-2943","(513) 524-4367","2034 Madison Rd","Cincinnati","OH","45208","Hamilton County, OH",false,false,false]
[null,20230426142850,{"$f":"ROW()","v":38},"James R Lupinetti","",null,"Lead",null,"","","","(513) 310-2789","(513) 310-2116","(609) 351-3756","9901 Regatta Dr #308","Cincinnati","OH","45252","Hamilton County, OH",true,false,false]
[null,20230426142851,{"$f":"ROW()","v":39},"Jeffrey String","",null,"Lead","MailList6","billiek777@gmail.com","","","(419) 260-4334","(419) 898-9084","(419) 734-2268","5481 E Bayshore Rd","Lakeside Marblehead","OH","43440","Hamilton County, OH",false,false,false]
[null,20230426142852,{"$f":"ROW()","v":40},"John F Betz","",null,"Lead",null,"","","","(513) 680-0480","(513) 851-3233","(513) 821-2551","653 Cascade Rd","Cincinnati","OH","45240","Hamilton County, OH",true,false,false]
[null,20230426142853,{"$f":"ROW()","v":41},"Judy M Green","",null,"Lead","MailList6","judimgreen@bigfoot.com","judig2819@juno.com","","(937) 879-3197","(832) 499-5235","(832) 506-2174","1337 Graceland Dr","Fairborn","OH","45324","Hamilton County, OH",false,false,false]
[null,20230426142854,{"$f":"ROW()","v":42},"Keisha Scott","",null,"Lead","MailList6","keishabg4@yahoo.com","","","(419) 565-3629","(419) 756-3203","(419) 775-1227","698 Impala Dr","Mansfield","OH","44903","Hamilton County, OH",false,false,false]
[null,20230426142855,{"$f":"ROW()","v":43},"Kelliele Berry","",null,"Lead",null,"","","",null,null,null,"5721 Cheviot Rd #4","Cincinnati","OH","45247","Hamilton County, OH",true,true,false]
[null,20230426142856,{"$f":"ROW()","v":44},"Kendell Hafford","",null,"Lead","MailList6","kenlhafford@gmail.com","zone_15@blackplanet.com","ken@one.net","(513) 633-4227","(703) 969-3766","(202) 230-6590","1338 Waycross Rd","Cincinnati","OH","45240","Hamilton County, OH",false,false,false]
[null,20230426142857,{"$f":"ROW()","v":45},"Kenneth Chenevert","",null,"Lead","MailList6","kenchenii2000@gmail.com","kenchenii2000@yahoo.com","kenchenii2000@msn.com","(813) 728-2604","(502) 541-6826","(813) 443-1305","3285 Renfro Ave","Cincinnati","OH","45211","Hamilton County, OH",false,false,false]
[null,20230426142858,{"$f":"ROW()","v":46},"Kenneth Hawkins","",null,"Lead","MailList6","kdh78r@yahoo.com","hawk@techie.com","ken@boredonearth.com","(216) 849-5694","(440) 748-3014","(216) 312-8496","PO Box 805","North Olmsted","OH","44070","Hamilton County, OH",false,false,false]
[null,20230426142859,{"$f":"ROW()","v":47},"Kenneth L David","",null,"Lead","MailList6","kennethdavis18@yahoo.com","kennybutt43@gmail.com","lazyman1992@hotmail.com","(937) 397-2255","(937) 237-9214","(937) 321-4759","450 Oxford Ave","Dayton","OH","45402","Hamilton County, OH",false,false,false]
[null,20230426142860,{"$f":"ROW()","v":48},"Kenneth Robinson","",null,"Lead","MailList6","krobinson937@yahoo.com","krobinson937@gmail.com","pkrobinson937w55@hotmail.com","(937) 219-7845","(216) 581-1893","(937) 979-1359","318 E Siebenthaler Ave","Dayton","OH","45405","Hamilton County, OH",false,false,false]
[null,20230426142861,{"$f":"ROW()","v":49},"Kenneth W Kunkel","",null,"Lead","MailList6","hkkunkelo79@bellsouth.net","hkkunkel0@bellsouth.net","kkunkels1@bellsouth.net","(513) 253-7114","(513) 741-7960","(513) 521-4487","8593 Kates Way","West Chester","OH","45069","Hamilton County, OH",false,false,false]
[null,20230426142862,{"$f":"ROW()","v":50},"Keyonte Bronson","",null,"Lead","MailList6","kbronson1112@gmail.com","","","(937) 609-8588","(843) 766-5695",null,"2431 Mustang Dr #20","Cincinnati","OH","45211","Hamilton County, OH",false,false,false]
[null,20230426142863,{"$f":"ROW()","v":51},"Kimberly D Coleman","",null,"Lead","MailList6","kimberlykaminsky@gmail.com","hornemarlon@gmail.com","","(479) 866-4602","(479) 224-3006","(479) 419-9364","610 Trailwood Cir","Centerton","AR","72719","Hamilton County, OH",false,false,false]
[null,20230426142864,{"$f":"ROW()","v":52},"Latrisha I Payne","",null,"Lead","MailList6","inez_mitchell@msn.com","latrisha.payne@gmail.com","","(513) 545-0037","(513) 458-6145","(513) 272-0168","3442 Sunbury Ln","Cincinnati","OH","45251","Hamilton County, OH",false,false,false]
[null,20230426142865,{"$f":"ROW()","v":53},"Leslie Aretz","",null,"Lead","MailList6","lesliearetz@gmail.com","lesliearetz@aol.com","lesliearetz@tivejo.com","(513) 907-8243","(513) 367-6341","(812) 537-8427","222 Maxwell Ln","Harrison","OH","45030","Hamilton County, OH",false,false,false]
[null,20230426142866,{"$f":"ROW()","v":54},"Marcus L Cobb","",null,"Lead","MailList6","healthypursuitmedical@gmail.com","integrativemlcmd@gmail.com","","(513) 825-3186","(513) 582-0432","(513) 742-1296","1362 Waycross Rd","Cincinnati","OH","45240","Hamilton County, OH",false,false,false]
[null,20230426142867,{"$f":"ROW()","v":55},"Melinda M Stewart","",null,"Lead","MailList6","genesisdesign@cincic.com","theo134@hotmail.com","","(513) 533-0601","(513) 505-5789","(513) 505-7893","3771 Marburg Ave","Cincinnati","OH","45209","Hamilton County, OH",false,false,false]
[null,20230426142868,{"$f":"ROW()","v":56},"Melissa J France","",null,"Lead","MailList7","melissa.france@gmail.com","melissa.france@hotmail.com","melissa.france@webtv.net","(513) 570-0198","(513) 244-6286","(937) 613-9988","3179 Ferncrest Ct #12","Cincinnati","OH","45211","Hamilton County, OH",false,false,false]
[null,20230426142869,{"$f":"ROW()","v":57},"Michael Hartinger","",null,"Lead",null,"","","","(513) 598-1097","(513) 324-6532",null,"5502 Pine Brook Cir","Cincinnati","OH","45247","Hamilton County, OH",true,false,false]
[null,20230426142870,{"$f":"ROW()","v":58},"Mitch Stevenson","",null,"Lead",null,"","","","(513) 276-1767","(513) 469-2747","(513) 492-7619","8483 Fields Ertel Rd","Cincinnati","OH","45249","Hamilton County, OH",true,false,false]
[null,20230426142871,{"$f":"ROW()","v":59},"Otis Lee Stevens","",null,"Lead","MailList7","speedymaintenance@swohio.twcbc.com","cerinstevens@yahoo.com","","(513) 771-4942","(513) 429-2476","(513) 246-4380","1100 Wabash Ave","Cincinnati","OH","45215","Hamilton County, OH",false,false,false]
[null,20230426142872,{"$f":"ROW()","v":60},"Patricia Stevenson","",null,"Lead","MailList7","mz.stevenson68@gmail.com","keeley.patrick187@gmail.com","patricia.malone@ameritrade.com","(440) 887-1955","(216) 251-4867","(216) 676-7575","13113 Tyler Ave","Cleveland","OH","44111","Hamilton County, OH",false,false,false]
[null,20230426142873,{"$f":"ROW()","v":61},"Paul McMillan","",null,"Lead","MailList7","pmcmillen@angelfire.com","dmcmillen2@woh.rr.com","nurseangel03@gmail.com","(614) 718-9973","(937) 434-9574","(614) 306-1099","5826 Locbury Ln","Dublin","OH","43016","Hamilton County, OH",false,false,false]
[null,20230426142874,{"$f":"ROW()","v":62},"Sabrina Carr","",null,"Lead",null,"","","","(740) 964-0916","(740) 923-5022","(614) 760-0508","1375 Lodge Rd","Norwich","OH","43767","Hamilton County, OH",true,false,false]
[null,20230426142875,{"$f":"ROW()","v":63},"Sarai E Bailey","",null,"Lead",null,"","","","(859) 248-6319","(859) 779-2856","(404) 667-4162","1284 Lockwood Dr SW","Atlanta","GA","30311","Hamilton County, OH",true,false,false]
[null,20230426142876,{"$f":"ROW()","v":64},"Sondra D Hertsenberg","",null,"Lead","MailList7","nurse.herts@gmail.com","","","(513) 375-8597","(513) 349-0224","(513) 487-8618","2327 Eastridge Dr","Hamilton","OH","45011","Hamilton County, OH",false,false,false]
[null,20230426142877,{"$f":"ROW()","v":65},"Stephanie Clay","",null,"Lead","MailList7","stephaniealston10@gmail.com","supplymomma@hotmail.com","","(757) 570-7074","(706) 580-5980","(443) 694-8063","1114 Inner Cir","Brooklyn","MD","21225","Hamilton County, OH",false,false,false]
[null,20230426142878,{"$f":"ROW()","v":66},"Steven C Stewart","",null,"Lead","MailList7","stephenstewart@comcast.net","stephen.stewart3@worldnet.att.net","k.1965@hotmail.com","(316) 209-8010","(316) 733-2616","(210) 682-0973","424 Briarbend Blvd","Powell","OH","43065","Hamilton County, OH",false,false,false]
[null,20230426142879,{"$f":"ROW()","v":67},"Steven E Ii Self","",null,"Lead","MailList7","stealthself13@gmail.com","deadliestdiver@yahoo.com","","(480) 747-5318","(480) 813-2272","(602) 501-4633","7080 Hunley Rd","Cincinnati","OH","45244","Hamilton County, OH",false,false,false]
[null,20230426142880,{"$f":"ROW()","v":68},"Steven Wilson Harris","",null,"Lead","MailList7","sharris1966@hotmail.com","steve.harris@uswest.net","steve.harris@address.com","(850) 255-0336","(850) 424-5118","(850) 660-1448","664 E Shipwreck Rd","Santa Rosa Beach","FL","32459","Hamilton County, OH",false,false,false]
[null,20230426142881,{"$f":"ROW()","v":69},"Stuart I Wilson","",null,"Lead","MailList7","swimstu18@yahoo.com","destinyaquin@yahoo.com","stuart_willison@yahoo.com","(513) 253-6669","(513) 569-9779","(770) 842-0361","4281 Berryhill Ln","Blue Ash","OH","45242","Hamilton County, OH",false,false,false]
[null,20230426142882,{"$f":"ROW()","v":70},"Teare G Jackson","",null,"Lead","MailList7","tearejackson@yahoo.com","","","(513) 389-8833","(513) 825-0707","(513) 541-8511","6655 Newbridge Dr","Cincinnati","OH","45239","Hamilton County, OH",false,false,false]
[null,20230426142883,{"$f":"ROW()","v":71},"Therese R Tobler","William Tobler",null,"Lead","MailList7","toblermd@aol.com","trtobler@aol.com","","(513) 871-4860","(513) 325-4496","(830) 660-7826","2123 Auburn Ave","Cincinnati","OH","45219","Hamilton County, OH",false,false,false]
[null,20230426142884,{"$f":"ROW()","v":72},"Timothy S Martin","",null,"Lead","MailList7","repairmantim1542@gmail.com","rikkim@iwarp.net","timtherepairman@att.net","(586) 883-3433","(586) 218-4902","(513) 910-4050","21830 Highview St","Clinton Township","MI","48036","Hamilton County, OH",false,false,false]
[null,20230426142885,{"$f":"ROW()","v":73},"Tonia Campanello","",null,"Lead",null,"","","","(513) 607-4700","(513) 304-0049","(513) 681-2401","283 Deephaven Dr","Cincinnati","OH","45238","Hamilton County, OH",true,false,false]
[null,20230426142886,{"$f":"ROW()","v":74},"William B Tarrance","",null,"Lead",null,"","","","(513) 874-2800","(513) 221-3119","(513) 579-8855","10048 Harrison Ave","Harrison","OH","45030","Hamilton County, OH",true,false,false]
[null,20230426142887,{"$f":"ROW()","v":75},"William Tobler","Therese R Tobler",null,"Lead","MailList7","toblermd@aol.com","toblermd@compuserve.com","toblermd@hotmail.com","(513) 315-4983","(513) 871-4860","(574) 277-3480","2 Beech Crest Ln","Cincinnati","OH","45206","Hamilton County, OH",false,false,false]
[null,20230426142888,{"$f":"ROW()","v":76},"100 Placement Llc","Michael Paul Adach",null,"Lead","MailList1\nMailList7","Info@100placement.com",null,null,"(313) 826-0563",null,null,"14414 Dexter","Detroit","MI",48238,null,false,false,false]
[null,20230426142889,{"$f":"ROW()","v":77},"1730 HAYDEN INC","ADEL SHOMAN",null,"Lead","MailList7","mahershoman@hotmail.com","","","(440) 454-1849","(440) 734-4689","(440) 539-5513","4097 Lydgate Dr","North Olmsted","OH","44070","Cuyahoga County, OH",false,false,false]
[null,20230426142890,{"$f":"ROW()","v":78},"1st Avenue Package Store","Vu Dang",null,"Lead","MailList5\nMailList7","pdangvu@att.net ",null,null,"(510) 601-9843","(510) 893-0683","(510) 865-7751","2015 1st Avenue North","Birmingham","AL",35206,"Jefferson County, AL",false,false,false]
[null,20230426142891,{"$f":"ROW()","v":79},"4 Points Asset Management","ALICIA E. ZAMBELLI",null,"Lead",null,"","","","(614) 558-6608","(614) 477-2019","(614) 523-1743","300 Spruce St #1","Columbus","OH","43215","Franklin County, OH",true,false,false]
[null,20230426142892,{"$f":"ROW()","v":80},"8 Vikings Trucking Inc"," Ivan A Gonzalez ",null,"Lead","MailList1\nMailList7","signes9@yahoo.com","devilishangel92804@yahoo.com","devilishangel92804@yahoo.com","(773) 581-0969","(714) 341-7520","(714) 224-1404","506 Liberty Ave","South Elgin"," IL",60177,"Cook County, IL",false,false,false]
[null,20230426142893,{"$f":"ROW()","v":81},"818 LLC","",null,"Lead","MailList7","erica8889@bellsouth.com","ebanks89@yahoo.com","","(330) 867-9248","(234) 334-6506","(330) 780-4474","189 Thorpe St","Akron","OH","44304","Summit County, OH",false,false,false]
[null,20230426142894,{"$f":"ROW()","v":82},"9 Mile Rent All Inc","Brian G. Storey, Eugene Storey, Karen L Storey",null,"Lead","MailList5\nMailList7","ninemilerentall@yahoo.com","","","(586) 755-5454",null,null,"3475 East Nine Mile","Warren","MI","48091","Macomb County, MI",false,false,false]
[null,20230426142895,{"$f":"ROW()","v":83},"A Diaz Ramos",null,null,"Lead","MailList1\nMailList7","fedaadela@yahoo.com","adela@feda.com","fedaadela@hotmail.com","(773) 757-9430","(773) 658-4527","(773) 735-4016","4055 W 80th Pl","Chicago","IL",60652,"Cook County, IL",false,false,false]
[null,20230426142896,{"$f":"ROW()","v":84},"A E C Site Solutions LLC","William B Steele",null,"Lead",null,"","","","(256) 533-9115","(256) 990-1484",null,"4020 Medford Dr","Huntsville","AL",35802,"Madison County, AL",true,false,false]
[null,20230426142897,{"$f":"ROW()","v":85},"A Frame Awards Inc","Benjamin J Roof",null,"Lead","MailList5\nMailList7","broof@asicentral.com","broof@ameritech.net","broof@aframeawards.com","(810) 767-8881","(866) 391-8881",null,"3600 S. Dort Hwy Ste. 64B","Flint","MI","48507","Genesee County, MI",false,false,false]
[null,20230426142898,{"$f":"ROW()","v":86},"A G Dreco Inc.","Chermaine O'glesby",null,"Lead","MailList1\nMailList7","chermaineoglesby@yahoo.com","agdreco@aol.com","maine293.co@gmail.com","(334) 727-7500","(334) 415-3350","(334) 275-5491","Po Box 830930","Tuskegee","AL",36083,null,false,false,false]
[null,20230426142899,{"$f":"ROW()","v":87},"AKA Electric Inc","Jason Krish",null,"Lead","MailList7","jbudk6@gmail.com","jason.krish@aol.com","angelaaliz2001@gmail.com","(440) 781-3868","(440) 647-0331","(440) 236-3015","129 W Herrick Ave","Wellington","OH","44090","Loraine County, OH",false,false,false]
[null,20230426142900,{"$f":"ROW()","v":88},"A&A Premier Holdings Inc","Abraham Germain",null,"Lead",null,null,null,null,"(866) 830-8383","(305) 354-8486","(305) 608-8480","8362 Pines Blvd","Pembroke Pines","FL","33024","Broward County, Fl",true,false,false]
[null,20230426142901,{"$f":"ROW()","v":89},"A&L Insurance and Income Tax Inc","Samuel Fatal",null,"Lead","MailList5\nMailList7","sfatal@yahoo.com","debbiefatal@yahoo.com","sfatal@centurytel.net","(954) 297-6540","(954) 234-2399","(954) 785-7698","5575 N State Rd 7","North Lauderdale","FL","33319","Broward County, FL",false,false,false]
[null,20230426142902,{"$f":"ROW()","v":90},"A&S Oil Inc","Md a Uddin",null,"Lead",null,null,null,null,"(954) 515-9390",null,null,"8787 W Oakland Park Blvd","Sunrise","FL","33351","Broward County, FL",true,false,false]
[null,20230426142903,{"$f":"ROW()","v":91},"A-1 Exterminating Company Inc","Samuel P Caputo Jr",null,"Lead","MailList7","vancap@aol.com","","","(304) 622-4259","(304) 623-5247","(304) 623-5347","150 Terra Cotta St","Clarksburg","WV","26301","Harrison County, WV",false,false,false]
[null,20230426142904,{"$f":"ROW()","v":92},"Aaron J Pender","",null,"Lead","MailList5\nMailList7","pendergrass04@mail2world.com","","","(248) 390-1291","(248) 628-3471","(248) 693-6530","332 Crooked Creek Dr","Leonard,","MI",48367,"Oakland County, MI",false,false,false]
[null,20230426142905,{"$f":"ROW()","v":93},"Aaron Milstead",null,"Server rejected email","Lead","MailList1\nMailList7","aaron@milstead.com",null,null,"(803) 606-3384","(803) 738-5376","(803) 732-3964","217 Sutton Way","Irmo","SC",29063,"Lexington County, SC",false,false,false]
[null,20230426142906,{"$f":"ROW()","v":94},"AB Diamond Corp LLC","Randall Diamond",null,"Lead","MailList7","hostmaster@imaginenet.net","randall@nursefinders.com","cfis4me@aol.com","(216) 831-0099","(216) 765-1945","(440) 831-5141","3789 Warrendale Rd","Cleveland","OH","44118","Cuyahoga County, OH",false,false,false]
[null,20230426142907,{"$f":"ROW()","v":95},"Abdul Aziz","",null,"Lead","MailList5\nMailList7","azizabdul10@yahoo.com","aziziabdul10@yahoo.com",null,"(770) 935-6546","(770) 451-4851","(678) 615-3460","3577 Cherokee Rd","Doraville","GA","30340","Cobb County, GA",false,false,false]
[null,20230426142908,{"$f":"ROW()","v":96},"Able Wireless Solutions, Inc.","Randy Tackett ",null,"Lead","MailList1\nMailList7","rt7485@att.com","blue_blazin@att.net",null,"(205) 664-7925","(205) 541-6242","(205) 384-3637","2420 Tahiti Ln","Alabaster","AL",35007,null,false,false,false]
[null,20230426142909,{"$f":"ROW()","v":97},"Absar Haaris","",null,"Lead","MailList5\nMailList7","ahaaris@aol.com","gallardosystems@yahoo.com",null,"(917) 838-9950","(212) 922-1973","(718) 464-9854","113 Gullane Dr","Slingerlands","NY","12159","Albany County, NY",false,false,false]
[null,20230426142910,{"$f":"ROW()","v":98},"Abundant Community Recovery Services","Darryl Dewberry",null,"Lead","MailList1\nMailList7","darryl_dewberry@hotmail.com","abundantcommunityrecoveryserv@gmail.com",null,"(313) 579-8272","(313) 491-2227","(313) 834-0367","20102 Harper Ave",null,null,null,"Wayne County, MI",false,false,false]
[null,20230426142911,{"$f":"ROW()","v":99},"Abundant Works Enrichment Services LLC","Theresa Battles Burton",null,"Lead","MailList7","reeseburton7@yahoo.com","theresa.battles@yahoo.com","battle@uakron.edu","(330) 907-8670","(330) 907-0575","(234) 706-6394","1567 W Exchange St","Akron","OH",44313,"Summit County, OH",false,false,false]
[null,20230426142912,{"$f":"ROW()","v":100},"Academy Answering Service Inc","Daniel J Day",null,"Lead","MailList7","daniel.j.day@worldnet.att.net","kathy.day1@cox.net","kathy.day42@cox.net","(216) 577-0019","(216) 381-1621","(216) 577-1977","4905 Ridgebury Blvd","Lyndhurst","OH",44124,"Cuyahoga County, OH",false,false,false]
[null,20230426142913,{"$f":"ROW()","v":101},"Accurate Exams Inc","Scott Tischler",null,"Lead","MailList7","scott@accurateexams.com","stischler@accurateexams.com","accurateexams@cox.net","(216) 533-9569","(440) 471-4784","(216) 471-4784","29496 Schwartz Rd","Westlake","OH","44145","Cuyahoga County, OH",false,false,false]
[null,20230426142914,{"$f":"ROW()","v":102},"Accurate Land Surveyors Inc","Robert L Thompson",null,"Lead","MailList5\nMailList7","robertlee.thompson@yahoo.com","rob.lee1976@yahoo.com","thompson.rob@yahoo.com","(754) 235-3655","(754) 246-3552","(706) 425-1882","1150 E. Atlantic Blvd.","Pompano Beach","FL","33060","Broward County, FL",false,false,false]
[null,20230426142915,{"$f":"ROW()","v":103},"Michael Ackerman","",null,"Lead","MailList7","zajazpatricia@yahoo.com","","","(804) 245-0355","(804) 639-9208","(231) 448-2812","7930 Hampton Glen Ter","Chesterfield","VA","23832","Loraine County, OH",false,false,false]
[null,20230426142916,{"$f":"ROW()","v":104},"Acme Fire Protection","Jonathan L Jakuszewski",null,"Lead","MailList13","jcjvet@yahoo.com","","","(330) 280-4505","(330) 529-4434","(330) 830-5491","6307 Caribou Dr","Clinton","OH","44216","Cuyahoga County, OH",false,false,false]
[null,20230426142917,{"$f":"ROW()","v":105},"Adam S Parnell ",null,null,"Lead","MailList1\nMailList7","asparnell@gmail.com","xyloboeman@hotmail.com",null,"(206) 501-8818","(503) 364-4646","(503) 507-9958","2014 Fairview Ave #314","Seattle","WA",98121,"Cook County, IL",false,false,false]
[null,20230426142918,{"$f":"ROW()","v":106},"Shenna Adams ","",null,"Lead","MailList7","ms.gonnamakeit@yahoo.com","ssheffield@ameritrade.com","agraham27@gmail.com","(601) 880-9247","(601) 483-6280","(205) 624-4580","641 Huntington Dr","Brandon","MS","39047","Rankin County, MS",false,false,false]
[null,20230426142919,{"$f":"ROW()","v":107},"Adams Trim Designs Inc","Timothy Adams",null,"Lead","MailList7","t.adams@ingaonline.com","cesar49n@yahoo.com","","(601) 845-4739","(601) 932-8746","(601) 845-8198","260 Lowe Cir #24B","Richland","MS","39218","Rankin County, MS",false,false,false]
[null,20230426142920,{"$f":"ROW()","v":108},"Adeptcore Inc"," Denis Zhirovetskiy ",null,"Lead","MailList1\nMailList7","alexzhr@yahoo.com","zhirovetshkiy@optonline.net","alexanderz@gmail.com","(847) 660-0238","(847) 963-1545","(847) 322-5951","900 Mark Ln #119","Wheeling","IL",60090,"Cook County, IL",false,false,false]
[null,20230426142921,{"$f":"ROW()","v":109},"Joshua Adkins","",null,"Lead","MailList7","jadkins72@yahoo.com","jason.r.goldberg@gmail.com","kpjoshua.adkins84@netscape.net","(937) 218-1490","(937) 218-3376","(937) 366-6791","1333 Oakhurst Ct","Lebanon","OH","45036","Meigs County, OH",false,false,false]
[null,20230426142922,{"$f":"ROW()","v":110},"Admiration Inc","Monica Mcbride",null,"Lead","MailList1\nMailList7","monicakmcbride@gmail.com",null,null,"(269) 506-5339","(269) 273-1616","(269) 244-4369","1352 Eastside Dr",null,null,null,"Wayne County, MI",false,false,false]
[null,20230426142923,{"$f":"ROW()","v":111},"Adrian Anesthesia Llc","Adrian Pinnock",null,"Lead",null,null,null,null,"(305) 890-3315","(202) 488-0257","(954) 499-8974","13100 Sw 11th Ct,","Pembroke Pines","FL","33027","Broward County, FL",true,false,false]
[null,20230426142924,{"$f":"ROW()","v":112},"Adrian Boroday","",null,"Lead",null,null,null,null,"(954) 832-9981","(954) 520-8243","(954) 473-9806","1235 N Victoria Park Rd","Fort Lauderdale","FL","33304","Broward County, FL",true,false,false]
[null,20230426142925,{"$f":"ROW()","v":113},"AFC Physicians of Florida LLC","Patrick Deverell Bianchi",null,"Lead",null,null,null,null,"(205) 403-8902",null,null,"3700 Cahaba Beach Rd","Birmingham","AL","35242","Jefferson County, Al",true,false,false]
[null,20230426142926,{"$f":"ROW()","v":114},"Affinity Mechanical Services Inc","Michelle Ryerson",null,"Lead",null,null,null,null,"(973) 419-6571",null,null,"25 Hadowanetz Dr","Ogdensburg","NJ","07439","Sussex County, NJ",true,false,false]
[null,20230426142927,{"$f":"ROW()","v":115},"Aftab Mahmood","",null,"Lead",null,null,null,null,"(224) 558-0828","(847) 705-4985","(847) 359-1844","1551 Plainfield Rd #C1","Joliet","IL","60435","Cook County, IL",true,false,false]
[null,20230426142928,{"$f":"ROW()","v":116},"Agape Worship Center Inc","Britnay Ewald",null,"Lead",null,null,null,null,"(954) 479-4732","(954) 730-8775","(954) 341-2378","2230 N.W. 22Nd St. ","Ft. Lauderdale","Fl","33311","Broward County, FL",true,false,false]
[null,20230426142929,{"$f":"ROW()","v":117},"Agnes Hall","",null,"Lead","MailList8","agnesgodwinhall@gmail.com","","","(404) 630-4007","(404) 486-7016","(513) 321-0324","2150 Easthill Ave","Cincinnati","OH","45208","Hamilton County, OH",false,false,false]
[null,20230426142930,{"$f":"ROW()","v":118},"Chris Collins","",null,"Lead",null,"washiburr@gmail.com","","","(423) 713-8380","(419) 468-3696","(419) 747-6501","1420 Saint Michaels Way","Newport News","VA",23606,"",false,false,false]
[null,20230426142931,{"$f":"ROW()","v":119},"Ahmed Abdikani","",null,"Lead",null,"","","","(612) 788-0121","(612) 781-7212","(612) 827-3059","2433 5th Ave S #1118","Minneapolis","MN","55404","Franklin County, OH",true,false,false]
[null,20230426142932,{"$f":"ROW()","v":120},"Ailton N Barroso","",null,"Lead",null,null,null,null,"(813) 727-9057","(561) 876-4551","(813) 855-3680","704 Buckingham Ave W","Oldsmar","FL","34677","Pinellas County, FL",true,false,false]
[null,20230426142933,{"$f":"ROW()","v":121},"Air Now Heating And Cooling Inc.",null,null,"Lead","MailList1","huntermerritt@hotmail.com","james@airnowhvac.com","merritt@airnowhvac.com","(334) 799-2019","(334) 285-4567","(334) 285-7065","1837 Al Highway 14","Elmore","AL",36025,null,false,false,false]
[null,20230426142934,{"$f":"ROW()","v":122},"Airdusco Inc.","Adam Lancaster",null,"Lead","MailList1","airalanc1@msn.com","dragonkatana@hotmail.com","stephen.lancaster@worldnet.att.net","(901) 854-4479","(901) 380-2909","(901) 380-5909","4739 Mendenhall Rd","Memphis","TN","38141-8202",null,false,false,false]
[null,20230426142935,{"$f":"ROW()","v":123},"AK FA MO INC","",null,"Lead","MailList8","joannerabah@yahoo.com","mrabah092@yahoo.com","joannerabah@hotmail.com","(440) 899-1384","(440) 779-0580","(440) 360-7057","8202 Superior Ave","Cleveland","OH","44103","Cuyahoga County, OH",false,false,false]
[null,20230426142936,{"$f":"ROW()","v":124},"Akosile Clement","",null,"Lead","MailList8","clement42@sbcglobal.net","tiwakosh@yahoo.com","cakosile@ameritrade.com","(614) 657-5814","(614) 751-8884","(614) 759-0659","1642 Brice Rd","Reynoldsburg","OH","43068","Franklin County, OH",false,false,false]
[null,20230426142937,{"$f":"ROW()","v":125},"Akron Erectors","Michael B Humphrey",null,"Lead","MailList8","mhumphrey1111@yahoo.com","tacticaladvisors@neo.rr.com","","(330) 329-1046","(330) 668-3072","(614) 933-0123","3917 Ira Rd","Akron","OH","44333","Summit County, OH",false,false,false]
[null,20230426142938,{"$f":"ROW()","v":126},"Akron Rebar Co","Michael Humphrey II",null,"Lead",null,"","","","(330) 701-2168","(330) 338-0407","(330) 668-3073","2230 S Short Hills Dr","Akron","OH","44333","Summit County, OH",true,false,false]
[null,20230426142939,{"$f":"ROW()","v":127},"Al Havner And Sons Hardwood Floors",null,null,"Lead","MailList1","al@alhavner.com",null,null,"(248) 549-4640","(313) 561-3330",null,"5108 Gertrude St","Dearborn Heights","MI",null,"Wayne County, MI",false,false,false]
[null,20230426142940,{"$f":"ROW()","v":128},"Ala Jabero","",null,"Lead",null,null,null,null,"(248) 534-7715","(248) 661-6660",null,"7458 Woodbriar Ln","West Bloomfield","MI","48322","Oakland County, MI",true,false,false]
[null,20230426142941,{"$f":"ROW()","v":129},"Alabama Lock and Key Co Incorporated","Randy Hall",null,"Lead",null,null,null,null,"(205) 328-1122",null,null,"1800 Green Springs Highway South","Birmingham","AL","35205","Jefferson County, AL",true,false,false]
[null,20230426142942,{"$f":"ROW()","v":130},"Alan Dale Collard ","Thoroughbred Plumbing",null,"Lead","MailList1","collardla@aol.com","acollard158@gmail.com",null,"(502) 496-4330","(812) 923-1869","(502) 749-6317","1412 Larchmont Ave","Louisville","KY",40215,null,false,false,false]
[null,20230426142943,{"$f":"ROW()","v":131},"Alan J Washer ",null,null,"Lead","MailList1","alanwasher@hotmail.com","pmalan@prodigy.net","alexthefallenangel665@gmail.com","(847) 917-7702","(847) 544-0110","(847) 749-1533","9 W Waverly Rd","Arlington Heights","IL",60004,"Cook County, IL",false,false,false]
[null,20230426142944,{"$f":"ROW()","v":132},"Alassane Top","",null,"Lead","MailList8","atop@yahoo.com","","","(216) 789-4844","(216) 470-1521",null,"23952 Banbury Cir","Cleveland","OH","44128","Cuyahoga County, OH",false,false,false]
[null,20230426142945,{"$f":"ROW()","v":133},"Albert C Bulls Construction Inc."," George B Bulls",null,"Lead","MailList1","gbullssr@yahoo.com","george4@ou.edu",null,"(334) 727-1074","(334) 727-7748","(334) 421-0825","204 Howard Rd","Tuskegee Institute","AL",36088,null,false,false,false]
[null,20230426142946,{"$f":"ROW()","v":134},"Alberta Craig ",null,null,"Lead","MailList1","albertacraig94@gmail.com",null,null,"(773) 441-1254","(773) 643-8373","(773) 643-1875","8037 S Colfax Ave","Chicago","IL",60617,"Cook County, IL",false,false,false]
[null,20230426142947,{"$f":"ROW()","v":135},"Liborio Alcauter","",null,"Lead","MailList8","nenems4life@hotmail.com","estrada_0828@yahoo.com","","(614) 891-2277","(614) 475-7785","(225) 687-8931","534 Norton Rd","Columbus","OH","43228","Franklin County, OH",false,false,false]
[null,20230426142948,{"$f":"ROW()","v":136},"Alex  Mera Harb ",null,null,"Lead","MailList1","harbalexa@gmail.com",null,null,"(248) 735-9677","(248) 596-0700","(248) 421-9003","24477 Thatcher Dr","Novi","MI",48375,"Wayne County, MI",false,false,false]
[null,20230426142949,{"$f":"ROW()","v":137},"Alexander David Jr","",null,"Lead","MailList8","dishbobo@yahoo.com","swcamie.alexander91@aol.com","davidalexander1880@yahoo.com","(989) 488-9011","(248) 830-8032","(317) 318-9466","2790 Berkley Rd","Auburndale","FL","33823","Cuyahoga County, OH",false,false,false]
[null,20230426142950,{"$f":"ROW()","v":138},"Kevin Alexandersen","",null,"Lead","MailList8","kca@gsfn.com","carmenmuslim@aol.com","kalexandersen@gsfn.com","(216) 280-7440","(216) 397-9917","(216) 295-6634","3158 Somerset Dr","Shaker Heights","OH","44122","Cuyahoga County, OH",false,false,false]
[null,20230426142951,{"$f":"ROW()","v":139},"Alexs Auto Care Inc",null,null,"Lead","MailList1","klh163@yahoo.com","michael.hider@gmail.com","alaahider@gmail.com","(313) 722-5477","(313) 645-1010","(313) 582-9052","901 S Highland St","Dearborn","MI",48124,"Wayne County, MI",false,false,false]
[null,20230426142952,{"$f":"ROW()","v":140},"Alfaro Miguel A",null,null,"Lead","MailList1","gen8992@roadrunner.com",null,null,"(847) 815-6743","(847) 289-4901","(847) 289-4900","1525 E Chicago St","Elgin","IL",60120,"Cook County, IL",false,false,false]
[null,20230426142953,{"$f":"ROW()","v":141},"Alford Marlon","",null,"Lead",null,null,null,null,"(773) 310-4229","(773) 734-8456","(773) 734-2604","602 E 75th St","Chicago","IL","60619","Cook County, IL",true,false,false]
[null,20230426142954,{"$f":"ROW()","v":142},"Alfred Brancifort","",null,"Lead",null,null,null,null,"(843) 424-4197","(843) 458-1776","(843) 347-9978","3080 Moss Bridge Ln","Myrtle Beach","SC","29579","Horry County, SC",true,false,false]
[null,20230426142955,{"$f":"ROW()","v":143},"Alfreda Polk ",null,null,"Lead","MailList1","josieisok@yahoo.com","x0apierce@bellsouth.net",null,"(773) 379-2390","(773) 379-2219","(773) 417-7218","34 S Mayfield Ave","Chicago","IL",60644,"Cook County, IL",false,false,false]
[null,20230426142956,{"$f":"ROW()","v":144},"Ali Babazadeh","Babazadeh Cab Co, Inc",null,"Lead",null,null,null,null,"(847) 946-4685","(773) 293-2039",null,"700 W Rand Rd #b403","Arlington Heights","IL","60004","Cook County, IL",true,false,false]
[null,20230426142957,{"$f":"ROW()","v":145},"Ali Isaac",null,null,"Lead","MailList1","iali_06@yahoo.com","zekedis@hotmail.com",null,"(815) 650-0749","(773) 971-8670","(630) 400-8411","Po Box 5553","Chicago","IL",60680,"Cook County, IL",false,false,false]
[null,20230426142958,{"$f":"ROW()","v":146},"Alisha D Murray","",null,"Lead",null,null,null,null,"(404) 353-6030","(404) 377-7680","(706) 599-6626","144 Ponce De Leon Ct","Decatur","GA","30030","Cobb County, GA",true,false,false]
[null,20230426142959,{"$f":"ROW()","v":147},"All American Concrete LLC","Alfred Brancifort",null,"Lead","MailList5","labrancifort@yahoo.com","albranci@sbcglobal.net",null,"(843) 424-4197","(843) 458-1776","(843) 347-9978","1361 Stockholder Avenue","Myrtle Beach","SC","29577","Horry County, SC",false,false,false]
[null,20230426142960,{"$f":"ROW()","v":148},"All Custom Glass Inc","Scott Thrun",null,"Lead","MailList1","thruny@aol.com","allcustomglass@aol.com","scottthrun@aol.com","(847) 530-8052","(847) 381-4188","(205) 492-2510","22029 N Pepper Rd","Lake Barrington","IL",60010,"Cook County, IL",false,false,false]
[null,20230426142961,{"$f":"ROW()","v":149},"All N1 Security Services Inc","Rick D Robinson",null,"Lead","MailList5","bmorebrett@gmail.com","rcrobinson04@yahoo.com","rrobinson@alln1security.com","(404) 787-9557","(770) 438-8681","(678) 594-3186","3915 Cascade Rd SW Ste 240","Atlanta","GA","30331","Cobb County, GA",false,false,false]
[null,20230426142962,{"$f":"ROW()","v":150},"Allan J Glass","Jane B Glass",null,"Lead",null,null,null,null,"(828) 526-4717","(772) 283-5647","(561) 283-5647","62 Oak Ln","Highlands","NC","28741","Charleston County, SC",true,false,false]
[null,20230426142963,{"$f":"ROW()","v":151},"Allen C Fairley","",null,"Lead","MailList8","jafairley@gmail.com","","","(228) 475-5620","(228) 235-3171","(228) 217-9667","4201 Coventry Dr","Moss Point","MS","39562","Jackson County, MS",false,false,false]
[null,20230426142964,{"$f":"ROW()","v":152},"Gloria L Allen","",null,"Lead","MailList8","gtucker_04@yahoo.com","gloria-tucker@att.net","gtucke0414@yahoo.com","(810) 238-6020","(810) 238-7708","(810) 513-9491","2164 Asa Rd","Courtland","MS","38620","Madison County, MS",false,false,false]
[null,20230426142965,{"$f":"ROW()","v":153},"Allen Marketing and Associates Inc","Patrick H. Allen, III",null,"Lead","MailList8","patrick@allenmarketing.net","","","(330) 877-2246","(330) 877-1128","(330) 807-3309","11751 Eldorado Cir NE","Hartville","OH","44632","Stark County, OH",false,false,false]
[null,20230426142966,{"$f":"ROW()","v":154},"Allen P Pitts","",null,"Lead","MailList5","hoop@qcnet.net",null,null,"(810) 308-2918","(810) 831-8740","(810) 785-3897","5503 Sheridan St","Detroit","MI","48213","",false,false,false]
[null,20230426142967,{"$f":"ROW()","v":155},"Alliance Industrial Solutions LLC","Sandy Adorni",null,"Lead","MailList8","shandra28@hotmail.com","wonder.bean@yahoo.com","","(330) 958-1763","(330) 958-1760","(330) 626-0642","9811 Smucker Rd","Orrville","OH","44667","Cuyahoga County, OH",false,false,false]
[null,20230426142968,{"$f":"ROW()","v":156},"Allison S Daughn","",null,"Lead","MailList5","adaughn@address.com","sdaughn@gmail.com","allison.daughn@baycare.org","(813) 951-3378","(813) 374-5107","(321) 453-4072","4962 Cypress Trace Dr","Tampa","FL","33624","Hillsborough County, FL",false,false,false]
[null,20230426142969,{"$f":"ROW()","v":157},"Allostatix LLC","Ken Rothe",null,"Lead","MailList8","krothe@cinci.rr.com","","","(513) 221-1852","(513) 213-9224","(513) 213-3922","1776 Mentor Ave Ste 361","Cincinnati","Oh","45212","Montgomery County, OH",false,false,false]
[null,20230426142970,{"$f":"ROW()","v":158},"ALPHA ASSOCIATES INC","Mike Finn",null,"Lead","MailList8","fkmmd@aol.com","fkmmd@comcast.com","","(732) 787-2697","(732) 996-0710","(404) 875-4029","3 Louise Ct","Hazlet","NJ","07730","Monongalia County, VA",false,false,false]
[null,20230426142971,{"$f":"ROW()","v":159},"Als Wings and Things Inc.","John Hibbler",null,"Lead","MailList1","joihibbler05@gmail.com","maragall@aol.com","jhibbler@worldnet.att.net","(901) 643-4039","(901) 614-9098","(646) 623-8995","1806 Lamar Ave","Memphis","TN","38114-1740",null,false,false,false]
[null,20230426142972,{"$f":"ROW()","v":160},"Alston Patricia A","",null,"Lead","MailList8","freshmikey2254@gmail.com","palston@sbcglobal.net","edpat123@gmail.com","(614) 556-0808","(614) 269-8237","(614) 383-7372","3101 E Hudson St","Columbus","OH","43219","Franklin County, OH",false,false,false]
[null,20230426142973,{"$f":"ROW()","v":161},"Alt Medical Device Inc","Nicolas R Pasquariello",null,"Lead","MailList5","nicolas@mdalt.com",null,null,null,null,null,"1942 Harrison St","Hollywood","Fl","33020","Broward County, FL",false,true,false]
[null,20230426142974,{"$f":"ROW()","v":162},"Alvin D Mays","",null,"Lead","MailList5","amays0907@gmail.com","amsmusicsouth@gmail.com","thinkbusiness101@gmail.com","(228) 547-0399","(228) 867-7046","(228) 331-0822","15453 Overlook Dr","Gulfport","MS","39503","Cobb County, GA",false,false,false]
[null,20230426142975,{"$f":"ROW()","v":163},"Alvin F Lin ",null,null,"Lead","MailList1","aflin101@gmail.com","blin696@gmail.com","swimfreak8813@aol.com","(859) 433-5969","(859) 224-3878","(859) 433-5936","2610 Drayton Dr","Louisville","KY",40205,null,false,false,false]
[null,20230426142976,{"$f":"ROW()","v":164},"Amanda Medical Inc","Dominique Jones",null,"Lead","MailList5","dj@amimobility.com","jm@amimobility.com","rj@amimobility.com","(727) 738-1375","(727) 421-9206",null,"3720 Tampa Road","Palm Harbor","FL","34684","Pinellas County, FL",false,false,false]
[null,20230426142977,{"$f":"ROW()","v":165},"Amber L Wilson","",null,"Lead","MailList5","hottgurl4440@adelphia.net","adurbin85@yahoo.com","hottgurl4440@aol.com","(850) 533-0359","(850) 496-8091","(850) 685-5980","1518 Bay Woods Rd","Gulf Breeze","FL","32563","Pinellas County, FL",false,false,false]
[null,20230426142978,{"$f":"ROW()","v":166},"American Patrol Investigation","Mike Hicks",null,"Lead","MailList8","edwardjohnstonpi@yahoo.com","ejohnston@apisecurity.us","","(614) 496-9689","(614) 310-1980","(614) 436-5365","867 High St #D","Worthington","OH","43085","Franklin County, OH",false,false,false]
[null,20230426142979,{"$f":"ROW()","v":167},"American Sentry Security System Inc","Jonathan W Steadman",null,"Lead",null,null,null,null,"(731) 926-6394","(256) 386-7862","(662) 423-5380","385 County Road 807","Cullman","AL",35057,null,true,false,false]
[null,20230426142980,{"$f":"ROW()","v":168},"Amos M Lewis","",null,"Lead","MailList5","melindaofften@gmail.com","lewisbabygirl@aol.com","lewpisbabygirl@aol.com","(601) 845-7416","(601) 845-7328","(601) 914-6770","531 White Rd","Florence","MS","39073","Brevard County, FL",false,false,false]
[null,20230426142981,{"$f":"ROW()","v":169},"Amp Energy","Kevin Rogers",null,"Lead","MailList1","kevin@ampenergyllc.com",null,null,"(256) 548-2646",null,null,"3625 County Road 326","Flat Rock","AL",35966,null,false,false,false]
[null,20230426142982,{"$f":"ROW()","v":170},"Simon Ampadu ","",null,"Lead","MailList8","sampadu@gmail.com","","","(614) 374-3098","(614) 539-5190","(513) 238-5115","1816 Messner Dr","Hilliard","OH","43026","Franklin County, OH",false,false,false]
[null,20230426142983,{"$f":"ROW()","v":171},"Eugene Amponsah","",null,"Lead","MailList8","eugea2006@haoo.com","eugenea021@gmail.com","eugea2006@haoc.com","(614) 806-9073","(614) 322-2061","(614) 294-0982","200 Macdougall Ln","Blacklick","OH","43004","Franklin County, OH",false,false,false]
[null,20230426142984,{"$f":"ROW()","v":172},"Amy Mcmillan","",null,"Lead","MailList8","amysue041081@yahoo.com","amymcmillen@gmail.com","","(330) 324-5077","(330) 476-6038","(330) 863-2977","558 2nd St NW","Carrollton","OH","44615","Hamilton County, OH",false,false,false]
[null,20230426142985,{"$f":"ROW()","v":173},"An Angel For You, dba Visiting Angels Of Sussex County","Lauren Reid ",null,"Lead","MailList5","pianowomn@hotmail.com","raymond_reid@hotmail.com","xalexis7654@hotmail.com","(973) 726-3010","(940) 595-8134","(973) 953-4066","328 Sparta Ave","Sparta","NJ","07871-1112","Sussex County, NJ",false,false,false]
[null,20230426142986,{"$f":"ROW()","v":174},"Ana Reyes","",null,"Lead","MailList5","adboxdirect@yahoo.com","lireyes50@hotmail.com","mreyes1523@yahoo.com","(305) 772-3333","(305) 644-3533","(786) 277-3934","590 E 10th Ave","Hialeah","FL","33010","Volusia County, FL",false,false,false]
[null,20230426142987,{"$f":"ROW()","v":175},"Cleveland Anderson ","",null,"Lead","MailList9","blutifuldove12@yahoo.com","clevelandanderson@cantonschools.net","","(601) 740-0952","(601) 942-7620","(601) 407-6144","376 Boyd St","Canton","MS","39046","Madison County, MS",false,false,false]
[null,20230426142988,{"$f":"ROW()","v":176},"David L Anderson","",null,"Lead","MailList9","mmanderson1365k51@netscape.net","kcandspaz@comcast.net","qmanderson1365j83@netscape.net","(304) 281-6484","(304) 281-8611","(304) 242-5838","PO Box 2198","Wheeling","WV","26003","Harrison County, WV",false,false,false]
[null,20230426142989,{"$f":"ROW()","v":177},"Anderson Kamal Llc",null,null,"Lead","MailList1","hamptonmarshall@hamptonmarshall.com","s.allen@hamptonmarshall.com","sharadanielle@gmail.com","(312) 961-6114","(773) 418-2191","(708) 367-0137","6759 S Bennett Ave","Chicago","IL",60649,"Cook County, IL",false,false,false]
[null,20230426142990,{"$f":"ROW()","v":178},"Virginia K Anderson","",null,"Lead","MailList9","wvrealtor1@yahoo.com","kathi.anderson@yahoo.com","","(304) 476-7396","(304) 782-3680","(304) 624-6565","445 Woodmar Dr","Salem","WV","26426","Harrison County, WV",false,false,false]
[null,20230426142991,{"$f":"ROW()","v":179},"Andnya J Watford","",null,"Lead",null,null,null,null,"(334) 333-9428","(256) 606-9063","(334) 699-1568","258 Melrose Ln","Dothan","AL","36303","Houston County, AL",true,false,false]
[null,20230426142992,{"$f":"ROW()","v":180},"Andran B Amey","",null,"Lead","MailList5","andron@yahoo.com","drewdrew8411@gmail.com",null,"(678) 665-1160","(770) 918-9203","(678) 651-8759","5002 Treecrest Pkwy","Decatur","GA","30035","Rockdale County, GA",false,false,false]
[null,20230426142993,{"$f":"ROW()","v":181},"Andre Walton","","","Lead","MailList1","andredreday30@gmail.com","grantmo@bc.edu","andre_jeremiah08@yahoo.com","(901) 319-1247","(901) 337-7623","(901) 205-3068","7227 Autumn Forrest Dr","Memphis","TN","38125-4557",null,false,false,false]
[null,20230426142994,{"$f":"ROW()","v":182},"Andrea Daguilar","",null,"Lead","MailList5","adaguilar20@gmail.com","xaviersupergx@adelphia.net",null,"(678) 427-7676","(678) 797-9795","(770) 672-0746","538 E Lake Dr","Marietta","GA","30062","Cobb County, GA",false,false,false]
[null,20230426142995,{"$f":"ROW()","v":183},"Andrea M Bacon ",null,null,"Lead","MailList1","ocean1034@aol.com","andrea.kirkland@blackplanet.com","andrea.kirkland@blackplanet.co","(217) 414-5282","(217) 414-5279","(217) 528-1050","8 Stardust Dr","Sherman","IL",62684,"Cook County, IL",false,false,false]
[null,20230426142996,{"$f":"ROW()","v":184},"Andrew Anderson ",null,null,"Lead","MailList1","andersonandrew@comic.com","xandyan@juno.com","andya@mckinstry.com","(727) 798-6550","(561) 537-6533","(561) 577-4555","8205 Belvedere Rd","West Palm Beach","FL",33411,"Cook County, IL",false,false,false]
[null,20230426142997,{"$f":"ROW()","v":185},"Andrew Anderson ",null,null,"Lead","MailList1","aanderson@gmail.com","johnnydangerous@yahoo.com",null,"(217) 280-1035","(309) 829-5865","(239) 691-9173","1921 N Midway Ave","Normal","IL",61761,"Cook County, IL",false,false,false]
[null,20230426142998,{"$f":"ROW()","v":186},"Andrew Brown","",null,"Lead","MailList5","www.andreaab@umich.edu","andreaabrown@gmail.com","andreaab@umich.edu","(734) 717-7192","(734) 316-2331","(734) 699-2764","13777 Sauer Dr","Gregory","MI","48137","Genesee County, MI",false,false,false]
[null,20230426142999,{"$f":"ROW()","v":187},"Andrew C Burrell PA","",null,"Lead","MailList9","drewdrew101@gmail.com","","","(228) 328-0120","(228) 896-4016","(228) 831-4429","10753 Plantation Ln","Gulfport","MS","39503","Harrison County, MS",false,false,false]
[null,20230426143000,{"$f":"ROW()","v":188},"Andrew C Sturtz ",null,null,"Lead",null,null,null,null,"(773) 857-7655","(309) 862-3149","(708) 354-6507","4354 N Ashland Ave #310","Chicago","IL",60613,"Cook County, IL",true,false,false]
[null,20230426143001,{"$f":"ROW()","v":189},"Andrew G Meyer ",null,null,"Lead","MailList1","andrew.myer@gmail.com","blink0298@aol.com","meyerseven@aol.com","(773) 646-2761","(317) 886-7622","(773) 620-8881","12712 S Escanaba Ave","Chicago","IL",60633,"Cook County, IL",false,false,false]
[null,20230426143002,{"$f":"ROW()","v":190},"Andrew H Katherine L Leutheuser ",null,null,"Lead","MailList1","andyleutheuser2@gmail.com","andyleutheuser7@gmail.com",null,"(734) 834-6222","(734) 904-1506","(734) 429-4046","Po Box 9022","Warren","MI",48090,"Wayne County, MI",false,false,false]
[null,20230426143003,{"$f":"ROW()","v":191},"Andrew M Brown Jr","",null,"Lead","MailList9","mikebrown558@yahoo.com","jessica@dcontinuum.com",null,"(231) 539-8175","(231) 526-1409","(860) 478-0696","6715 Maple Dr","Pellston","MI","49769","Genesee County, MI",false,false,false]
[null,20230426143004,{"$f":"ROW()","v":192},"Andrew M Strouse","",null,"Lead","MailList5","strouse.james@yahoo.com","andrew.strouse@yahoo.com",null,"(727) 409-2468","(727) 475-8706","(727) 772-7686","4986 Ridgemoor Cir","Palm Harbor","FL","34685","Pinellas County, FL",false,false,false]
[null,20230426143005,{"$f":"ROW()","v":193},"Andrew Ramsey","",null,"Lead","MailList1","efd583@msn.com","overcomersholdings@gmail.com","nbbc2004@gmail.com","(205) 267-8393","(901) 340-6499","(901) 347-3688","3413 Kings Arms St","Memphis","TN","38115-3518",null,false,false,false]
[null,20230426143006,{"$f":"ROW()","v":194},"Andrew Salerno ",null,null,"Lead","MailList1","abmks123@yahoo.com","msalerno914@yahoo.com",null,"(732) 942-8462","(973) 778-6641","(609) 306-4499","58 Concord Cir","Howell","NJ",7731,"Cook County, IL",false,false,false]
[null,20230426143007,{"$f":"ROW()","v":195},"Andrzej Fonfara ",null,null,"Lead",null,null,null,null,"(708) 336-9995",null,null,"10126 Seymour Ave","Schiller Park","IL",60176,"Cook County, IL",true,false,false]
[null,20230426143008,{"$f":"ROW()","v":196},"Angel Accents Preschool and Daycare LLC","",null,"Lead","MailList9","eksteigerk3@bellsouth.net","g5ksteiger@bellsouth.net","j_steiger@sbcglobal.net","(440) 915-9922","(330) 835-4018","(330) 659-3037","3935 Humphrey Rd","Richfield","OH","44286","Summit County, OH",false,false,false]
[null,20230426143009,{"$f":"ROW()","v":197},"Angel Fabelo ",null,null,"Lead","MailList5\nMailList1","afpapitofabelo@gmail.com","angelfabelo@ymail.com",null,"(773) 715-0353","(708) 652-8514","(773) 588-7349","3636 S Central Ave","Cicero","IL",60804,"Cook County, IL",false,false,false]
[null,20230426143010,{"$f":"ROW()","v":198},"Angel L Delgado",null,null,"Lead","MailList5\nMailList1\nMailList9\nMailList13","lalodelgado7@gmail.com","angeldorado@hotmail.com","angeldorado76@yahoo.com","(773) 699-6289","(773) 866-2816","(773) 486-8518","3310 George St","Franklin Park","IL",60131,"Cook County, IL",false,false,false]
[null,20230426143012,{"$f":"ROW()","v":199},"Angela D Jansen","",null,"Lead","MailList5","angi7070@yahoo.com","sissarickabaugh@gmail.com",null,"(618) 304-1839","(618) 624-5458","(618) 304-4183","1957 Georgia Cir N","Clearwater","FL","33760","Pinellas County, FL",false,false,false]
[null,20230426143013,{"$f":"ROW()","v":200},"Angela J Lewis","",null,"Lead","MailList1","alewis2@msn.com","chisyittle@yahoo.com","sassybutterfly@yahoo.com","(301) 237-5651","(240) 462-7912","(301) 574-0063","6476 Wells Farms CV","Memphis","TN",38135,null,false,false,false]
[null,20230426143014,{"$f":"ROW()","v":201},"Angela L Walker ",null,null,"Lead","MailList1","adam23@ameritrade.com","awalker49047@gmail.com","tanrw@msn.com","(269) 240-0790","(269) 462-9027","(269) 783-1297","61065 Thompson Rd","Niles","MI",49120,null,false,false,false]
[null,20230426143015,{"$f":"ROW()","v":202},"Angus Electric LLC","Tyson Burt",null,"Lead","MailList9","tysonburt@hotmail.com","melannburt@icloud.com",null,"(810) 743-0969","(810) 743-2442","(810) 691-4928","1428 McEwen St","Burton","MI","48509","Genesee County, MI",false,false,false]
[null,20230426143016,{"$f":"ROW()","v":203},"ANH Contracting Inc","",null,"Lead","MailList9","anhcontractinginc@gmail.com","greatwhitehvacr@yahoo.com",null,"(586) 945-2298","(586) 751-3055","(586) 445-2871","14530 E. 11 Mile Rd.","Warren","MI","48089","Macomb County, MI",false,false,false]
[null,20230426143017,{"$f":"ROW()","v":204},"Anita Damiani","",null,"Lead",null,null,null,null,"(201) 265-0575",null,null,"1012 Arlington Rd","New Milford","NJ","07646","Sussex County, NJ",true,false,false]
[null,20230426143018,{"$f":"ROW()","v":205},"ANM Services LLC","Derrick Dabbs",null,"Lead","MailList9","ddmusic04@hotmail.com","","","(214) 395-2431","(214) 930-0637","(214) 371-5851","5549 Amite Dr","Marrero","LA","70072","Rankin County, MS",false,false,false]
[null,20230426143019,{"$f":"ROW()","v":206},"Anne F Bleecker","",null,"Lead","MailList9","ableecker@bleeckerlawfirm.com","afbleecker@bleeckerlawfirm.com",null,"(843) 442-1370","(843) 571-2725","(843) 571-2894","PO Box 30245","Charleston","SC","29417","Charleston County, SC",false,false,false]
[null,20230426143020,{"$f":"ROW()","v":207},"Anne Lowry ",null,null,"Lead","MailList1","ojl100@yahoo.com",null,null,"(515) 962-7026","(815) 439-0569","(319) 391-4649","165 Versailles","Cincinnati","OH",45240,"Cook County, IL",false,false,false]
[null,20230426143021,{"$f":"ROW()","v":208},"Anointed Helpers Home Care LLC","Erin Mcclorrine",null,"Lead","MailList9","mserin84@gmail.com","","","(937) 329-5315","(937) 274-7619","(931) 837-0088","1718 Knob Creek Dr","Dayton","OH","45417","Montgomery County, OH",false,false,false]
[null,20230426143022,{"$f":"ROW()","v":209},"Anointed Word Christian Ministries Inc","Ocie Reese, Jr.",null,"Lead","MailList9","willfain@hotmail.com","kfain1@bellsouth.net","tlamar2@comcast.net","(404) 964-0765",null,null,"Po Box 1568","Mableton","Ga","30126","Cobb County, GA",false,false,false]
[null,20230426143023,{"$f":"ROW()","v":210},"Anthony  Christina M Cole ",null,null,"Lead","MailList2","mpchristina.gutierrez39@juno.com","h0christina.gutierrez@juno.com","christina.gutierrezu9@juno.com","(313) 304-4431","(313) 971-5030","(313) 304-4430","2333 6th St","Wyandotte","MI",48192,null,false,false,false]
[null,20230426143024,{"$f":"ROW()","v":211},"Anthony Byrd","",null,"Lead","MailList2","abyrd52@yahoo.com",null,null,"(901) 870-0260","(901) 291-2888","(662) 887-9075","3319 Snow Ridge Cv","Memphis","TN",38115,null,false,false,false]
[null,20230426143025,{"$f":"ROW()","v":212},"Anthony Denito","",null,"Lead","MailList9","adenito@excite.com",null,null,"(305) 251-4694","(786) 293-6271","(305) 253-5694","10650 SW 157th Ct","Miami","FL","33196","Miami-Dade County, FL",false,false,false]
[null,20230426143026,{"$f":"ROW()","v":213},"Anthony Freeman","",null,"Lead","MailList9","harveyfreeman@worldnet.att.net","harveyfreeman@att.net","anthonyfreeman2239@yahoo.com","(229) 244-9305","(229) 245-0033","(229) 469-6586","209 S Fry St","Valdosta","GA","31601","Cobb County, GA",false,false,false]
[null,20230426143027,{"$f":"ROW()","v":214},"Anthony Gucciardo","Mildred J Vasquez",null,"Lead","MailList9","mildgucc@outlook.com","janeleeb28@gmail.com",null,"(585) 889-2434","(585) 330-1577","(585) 458-3757","18 Andony Ln","Rochester","NY","14624","Albany County, NY",false,false,false]
[null,20230426143028,{"$f":"ROW()","v":215},"Anthony Larrain ",null,null,"Lead","MailList2","larrainanthony@gmail.com","tonylaads@gmail.com","tpl60643@yahoo.com","(773) 445-4022","(312) 450-1306","(773) 970-4903","5050 W Wilson Ave","Chicago","IL",60630,"Cook County, IL",false,false,false]
[null,20230426143029,{"$f":"ROW()","v":216},"Anthony Pedicini ",null,null,"Lead","MailList2","tinapedicini13@twc.com","colonialdesigns@bellsouth.net","apedi14050@aol.com","(502) 909-6124","(502) 876-8109","(912) 354-2121","3414 Imperator Ln #103","Louisville","KY",40245,null,false,false,false]
[null,20230426143030,{"$f":"ROW()","v":217},"Anthony Sarradet","",null,"Lead","MailList9","asarradet@worldnet.att.net","frankendad@bellsouth.net",null,"(251) 661-6614","(251) 666-7829","(334) 661-6614","5401 Dogwood Ct","Mobile","AL","36693","Mobile County, AL",false,false,false]
[null,20230426143031,{"$f":"ROW()","v":218},"Anthony Williams ",null,null,"Lead","MailList2","anthonysolomon@worldnet.att.net","mortgage_solomon@yahoo.com","anthonysr2018@gmail.com","(405) 869-0162","(405) 520-4023","(405) 201-9581","214 E 2nd St","Mineral","IL",61344,"Cook County, IL",false,false,false]
[null,20230426143032,{"$f":"ROW()","v":219},"Antiwuan Satterfield ",null,"opened mrs.satty518@gmail.com","Lead","MailList2","mrs.satty518@gmail.com",null,null,"(502) 417-9610","(502) 821-0294","(502) 434-7163","7116 Alma June Way","Louisville","KY",40228,"Jefferson County, KY",false,false,false]
[null,20230426143033,{"$f":"ROW()","v":220},"Antoine D Davis ",null,null,"Lead","MailList2","a.davis31718@gmail.com","anthonydavis40@starspath.com","nthonydavis773@starspath.com","(708) 510-5072","(708) 536-8958","(708) 265-5530","1609 216th Pl","Sauk Village","IL",60411,"Cook County, IL",false,false,false]
[null,20230426143034,{"$f":"ROW()","v":221},"Antonio Johnson","",null,"Lead","MailList9","antonio.johnson@msn.com","tonyjohnson381975@gmail.com","a.t.johnson1975@gmail.com","(904) 376-5451","(904) 422-0154","(904) 235-0375","3939 Carriage House Ct #G","Atlanta","GA","30344","Cobb County, GA",false,false,false]
[null,20230426143035,{"$f":"ROW()","v":222},"Antonio L Johnson ",null,null,"Lead","MailList2","antsr180@gmail.com","anthonyjohnson@rochester.rr.com","anthony.johnsonn8@mchsi.com","(574) 596-7965","(574) 293-3117","(574) 226-9399","1000 W Mishawaka Rd #29","Elkhart","IN",46517,"Cook County, IL",false,false,false]
[null,20230426143036,{"$f":"ROW()","v":223},"Aquadry Waterproofing LLC"," LARRY MAXSON",null,"Lead","MailList9","cmaxson121@yahoo.com","larrymaxson@worldnet.att.net",null,"(678) 354-1059","(678) 787-7932","(678) 445-8932","144 Kelli Clark Court Southeast","Cartersville","GA","30121","Cobb County, GA",false,false,false]
[null,20230426143037,{"$f":"ROW()","v":224},"Mattie F Arbogast","",null,"Lead",null,"","","","(937) 885-2841","(843) 240-6746","(937) 885-2438","850 E Lytle 5 Points Rd","Dayton","OH","45458","Montgomery County, OH",true,false,false]
[null,20230426143038,{"$f":"ROW()","v":225},"Arch City Hauling LLC","Jonathan McGee",null,"Lead","MailList9","myhead2thesky@aol.com","","","(614) 537-8153","(614) 235-7605","(614) 330-4389","3125 CLERMONT RD","COLUMBUS","H,","43227","Franklin County, OH",false,false,false]
[null,20230426143039,{"$f":"ROW()","v":226},"Argent Antiques LLC","Andrew M Parker",null,"Lead","MailList2","argentasilvercom@bellsouth.net",null,null,"(205) 871-4221",null,null,"2949 18th St South","Homewood","AL","35209","Jefferson County, AL",false,false,false]
[null,20230426143040,{"$f":"ROW()","v":227},"Argent Antiques, Llc","Andrew M Parker",null,"Lead","MailList2","argentasilvercom@bellsouth.net","drew@argentantiques.com",null,"(205) 871-4221",null,null,"2949 18th St S","Birmingham","AL",35209,null,false,false,false]
[null,20230426143041,{"$f":"ROW()","v":228},"Jose N Arias","",null,"Lead",null,"","","","(614) 599-0730","(614) 205-8908","(205) 902-2631","4136 Chandler Dr","Columbus","OH","43213","Franklin County, OH",true,false,false]
[null,20230426143042,{"$f":"ROW()","v":229},"Armando Guevara","",null,"Lead","MailList9","m1234lorente@gmail.com","rosa_lorente@yahoo.com",null,"(770) 876-5537","(770) 562-3015","(229) 551-0019","165 Enterprise Dr","Temple","GA","30179","Miami-Dade County, FL",false,false,false]
[null,20230426143043,{"$f":"ROW()","v":230},"Arnisca D Gibbons Wilson","",null,"Lead","MailList9","deseanwilson87@gmail.com","mswil2k@msn.com",null,"(770) 841-4798","(770) 745-7728","(706) 682-5207","257 Heathridge Ln SE","Mableton","GA","30126","Cobb County, GA",false,false,false]
[null,20230426143044,{"$f":"ROW()","v":231},"Amy Arnot","",null,"Lead","MailList9","amylburleson@hotmail.com","","","(601) 291-1010","(601) 898-8039","(601) 952-0708","115 Stillhouse Creek Dr","Madison","MS","39110","Madison County, MS",false,false,false]
[null,20230426143045,{"$f":"ROW()","v":232},"Arocha and Jaquez DMD","Max Arocha & Karla Jaquez",null,"Lead","MailList9","marochadmd@gmail.com","kymiguelina.arocha46@verizon.net",null,"(954) 370-1235","(954) 483-6752",null,"1125 S University Dr","Plantation","FL","33324","Broward County, FL",false,false,false]
[null,20230426143046,{"$f":"ROW()","v":233},"Richard J Arrigo ","",null,"Lead","MailList9","rarrigo@insight.rr.com","","","(614) 562-6688","(614) 396-8581","(614) 891-6886","7875 Prairieview Dr","Columbus","OH","43235","Franklin County, OH",false,false,false]
[null,20230426143047,{"$f":"ROW()","v":234},"Arthur G Hollis ",null,"Opened arthollis@yahoo.com","Lead","MailList2","aghollis@capital22.com","arthollis@yahoo.com","nvm.art.hollis@hotmail.com","(312) 310-2100","(216) 496-5436","(847) 681-1321","707 W Gordon Ter","Chicago","IL",60613,"Cook County, IL",false,false,false]
[null,20230426143048,{"$f":"ROW()","v":235},"Arthur Holmes","",null,"Lead","MailList9","arthurholmes@tds.net",null,null,"(954) 294-3896","(954) 639-7400","(305) 437-8368","15054 SW 54th St","Miramar","FL","33027","Broward County, FL",false,false,false]
[null,20230426143049,{"$f":"ROW()","v":236},"Artistic Renovations of Ohio LLC"," Anthony Perrin ",null,"Lead","MailList9","ken@artisticreno.com","tonygriffie@hotmail.com","sue@artisticreno.com","(216) 342-9943","(216) 520-0838","(216) 832-8064","12333 Ridge Road Unit 1B","North Royalton","OH","44133","Cuyahoga County, OH",false,false,false]
[null,20230426143050,{"$f":"ROW()","v":237},"Arturo Jauregui P C",null,"Opened arjauregui@aol.com","Lead","MailList2","arjauregui@aol.com",null,null,"(312) 781-9103","(773) 481-1659","(773) 481-9311","5934 N Forest Glen Ave","Chicago","IL",60646,"Cook County, IL",false,false,false]
[null,20230426143051,{"$f":"ROW()","v":238},"Ascex LLC","Kevin Laster",null,"Lead","MailList13","kevin.laster@ascexco.com","","","(864) 432-2645","(803) 754-1008","(803) 932-7314","4241 Orchard Park Blvd","Spartanburg","SC","29303","Charleston County, SC",false,false,false]
[null,20230426143052,{"$f":"ROW()","v":239},"Ashley Demetra",null,"clicked to website from oashley96@gmail.com","Lead","MailList2","oashley96@gmail.com",null,null,"(310) 308-8312","(703) 414-3703","(773) 701-6201","3540 S Dearborn St","Chicago","IL",60609,"Cook County, IL",false,false,false]
[null,20230426143053,{"$f":"ROW()","v":240},"Ashley Demetra ",null,null,"Lead","MailList2","crysashley@comcast.net","dashley61@att.net","oashley96@gmail.com","(773) 814-9636","(312) 504-3214","(312) 353-9163","38 Graymoor Ln","Olympia Fields","IL",60461,"Cook County, IL",false,false,false]
[null,20230426143054,{"$f":"ROW()","v":241},"Ashley E Golden","",null,"Lead","MailList9","misssuccess20@yahoo.com",null,null,"(248) 893-7887","(313) 875-0150","(248) 864-3270","PO Box 14514","Detroit","MI","48214","Oakland County, MI",false,false,false]
[null,20230426143055,{"$f":"ROW()","v":242},"Ashley N Wiggs","",null,"Lead","MailList9","awiggs8@gmail.com",null,null,"(256) 665-4289","(256) 603-4913","(334) 663-7306","123 Properzi Way SW","Huntsville","AL","35824","Madison County, AL",false,false,false]
[null,20230426143056,{"$f":"ROW()","v":243},"Ashlon Smith","",null,"Lead","MailList9","charleswaters423@gmail.com",null,null,"(251) 214-8604","(251) 478-5021","(251) 470-6234","1754 Riverside Dr","Mobile","AL","36605","Mobile County, AL",false,false,false]
[null,20230426143057,{"$f":"ROW()","v":244},"Askia Inc","Alioune Gueye",null,"Lead","MailList13","fatouisgreat@gmail.com","","","(513) 254-3553","(513) 821-2633","(917) 821-2633","10200 Lochcrest Dr","Cincinnati","OH","45231","Hamilton County, OH",false,false,false]
[null,20230426143059,{"$f":"ROW()","v":245},"David Audino ","",null,"Lead",null,"","","","(614) 817-1070","(330) 420-0901",null,"23743 Big Pine Rd","South Bloomingville","OH","43152","Franklin County, OH",true,true,false]
[null,20230426143060,{"$f":"ROW()","v":246},"David Audino","",null,"Lead","MailList13","t.audino@comcast.net","","","(847) 712-2249","(847) 698-9577","(847) 698-7137","200 Higgins Rd","Park Ridge","IL","60068","Franklin County, OH",false,false,false]
[null,20230426143061,{"$f":"ROW()","v":247},"Angel August","",null,"Lead","MailList13","aaugusto1@netzero.net","taaugustg48@netzero.net","","(205) 836-0683","(205) 836-6322",null,"3753 Creek Side Way","Trussville","AL","35173","Jefferson County, AL",false,true,false]
[null,20230426143062,{"$f":"ROW()","v":248},"Susan L Augustine","",null,"Lead","MailList13","susan@schoolspiritproducts.com","susan@wearecreative.com","susan.augustine@gmail.com","(440) 835-4360","(440) 899-5470",null,"1249 Bonnieview Ave","Lakewood","OH","44107","Cuyahoga County, OH",false,true,false]
[null,20230426143063,{"$f":"ROW()","v":249},"Aurora Apacible ",null,null,"Lead","MailList2","aapacible@localnet.com","auring1935@yahoo.com","niceguy_kev@hotmail.com","(630) 699-2093","(630) 487-1455","(630) 261-1892","126 E Bonnie Brae Ave","Mount Prospect","IL",60056,"Cook County, IL",false,false,false]
[null,20230426143064,{"$f":"ROW()","v":250},"Austins Womack Exterminators Inc","Marty Austin","","Lead","MailList2","tonyaustin@webtv.net","info@nobuggs.com",null,"(901) 685-5464","(901) 483-5300","(901) 755-6492","1458 S Perkins Rd","Memphis","TN",38117,null,false,false,false]
[null,20230426143065,{"$f":"ROW()","v":251},"Ava M Teverbaugh ",null,null,"Lead","MailList2","avateverbaugh@yahoo.com","avateverbaugh@hotmail.com","avateverbaugh@gmail.com","(312) 788-4286","(773) 891-4042","(708) 724-9853","16615 Parkside Ave","South Holland","IL",60473,"Cook County, IL",false,false,false]
[null,20230426143066,{"$f":"ROW()","v":252},"Avanti Poured Walls Inc","Mario Polsinelli",null,"Lead","MailList13","mandlpolsinelli@comcast.net","zagafil@hotmail.com","dvpolsinelli@sbcglobal.net","(586) 731-1400","(810) 459-5667","(248) 650-8165","12501 23 Mile Rd","Shelby Township","MI","48315","Macomb County, MI",false,false,false]
[null,20230426143067,{"$f":"ROW()","v":253},"Ayana K Jackson","",null,"Lead",null,"","","","(314) 458-3392","(314) 749-7191","(314) 361-1994","13301 E Outer Dr","Detroit","MI","48224","Macomb County, MI",true,false,false]
[null,20230426143068,{"$f":"ROW()","v":254},"Ayisha Diaz","",null,"Lead",null,"","","","(402) 215-6293","(201) 482-4792",null,"19029 SW 24th St","Miramar","FL","33029","Broward County, FL",true,false,false]
[null,20230426143069,{"$f":"ROW()","v":255},"B and B Towing LLC","","","Lead",null,null,null,null,9014524101,"","","2574 Summer Ave","Memphis","TN",38112,null,true,false,false]
[null,20230426143070,{"$f":"ROW()","v":256},"B and B Enterprises LLC","Scott Culverhouse",null,"Lead","MailList13","sculverhouse4@gmail.com","aculverhouse4@yahoo.com","","(205) 410-5784","(205) 629-5818","(205) 655-8505","5184 Cruise St","Trussville","AL","35173","Jefferson County, AL",false,false,false]
[null,20230426143071,{"$f":"ROW()","v":257},"Backyard Pros, Llc","Jonathan D Mitchell","Returned undeliverable as addressed","Lead","MailList2","jonathan@backyardpros.net","backyardpros@yahoo.com",null,"(205) 622-3562","(205) 622-3233","(205) 387-2849","1752 Mitchell Mountain Rd","Berry","AL",35546,null,false,false,false]
[null,20230426143072,{"$f":"ROW()","v":258},"Bailey Telecommunications L L C","John Bailey",null,"Lead","MailList2","john_bailey@hotmail.com","johnbailey@comcast.net","cjacsyt@prodigy.net","(248) 473-0176","(248) 924-3101","(248) 910-7519","49799 Parkside Dr","Northville","MI",48168,"Wayne County, MI",false,false,false]
[null,20230426143073,{"$f":"ROW()","v":259},"William D Bair","",null,"Lead","MailList13","billandsheribair10@att.net","ryannrio298@aol.com","","(330) 866-9532","(330) 447-8513","(330) 309-0500","7077 Grovedell St SE","Waynesburg","OH","44688","Stark County, OH",false,false,false]
[null,20230426143074,{"$f":"ROW()","v":260},"Mae Baker","",null,"Lead","MailList13","maebaker1102@yahoo.com","","","(216) 471-8412","(216) 862-3911","(216) 898-2690","19350 Puritas Ave #130","Cleveland","OH","44135","Montgomery County, OH",false,false,false]
[null,20230426143075,{"$f":"ROW()","v":261},"Baking By Beth Ltd","Elizabeth R Welch",null,"Lead","MailList2","beth.welch@yahoo.com","kjbeth.welch86@yahoo.com ","kjbeth.welch86@yahoo.com","(847) 302-7598","(847) 328-3670","(847) 328-7598"," 3424 Park Pl","Evanston","IL",60201,"Cook County, IL",false,false,false]
[null,20230426143076,{"$f":"ROW()","v":262},"Scott H Ballou","",null,"Lead",null,"","","","(216) 469-4364","(440) 933-9605","(216) 861-1177","901 N Birch Rd #D8","Fort Lauderdale","FL","33304","Loraine County, OH",true,false,false]
[null,20230426143077,{"$f":"ROW()","v":263},"James H Banks","",null,"Lead","MailList13","burkey.jamessm@hotmail.com","banksjs@netscape.com","burkey.jssm@hotmail.com","(740) 622-0270","(740) 545-7874","(740) 622-7882","332 S 9th St","Coshocton","OH","43812","Franklin County, OH",false,false,false]
[null,20230426143078,{"$f":"ROW()","v":264},"Banner Broach And Machine LLC","Patrick Brainard",null,"Lead","MailList13","pbrainard5@msn.com","pbrainard5@aol.com","","(248) 885-4535","(586) 925-1253","(248) 548-2579","12978 E Ten Mile Rd","Warren","Mi","48089","Macomb County, MI",false,false,false]
[null,20230426143079,{"$f":"ROW()","v":265},"Baptist Church Of The Tree Of Life Inc","Arie Bast, Kelly P Kosmin,Richard Lane",null,"Lead",null,"","","","(954) 729-5408","(904) 940-2502","(305) 968-9229","405 GOLFWAY WEST DRIVE","ST AUGUSTINE","FL","32095","Broward County, FL",true,false,false]
[null,20230426143080,{"$f":"ROW()","v":266},"Barbara Bouknight","",null,"Lead","MailList13","bebouknight@yahoo.com","","","(810) 733-7076","(313) 861-1274","(810) 241-4850","1184 River Valley Dr #5","Flint","MI","48532","Genesee County, MI",false,false,false]
[null,20230426143081,{"$f":"ROW()","v":267},"Barbara Cannady ",null,null,"Lead","MailList2","bcannady@sbcglobal.net","robx2mar@yahoo.com","ibarbara.cannady25@worldnet.att.net","(773) 920-0688","(773) 966-3685","(872) 244-3061","7415 S Colfax Ave #103","Chicago","IL",60649,"Cook County, IL",false,false,false]
[null,20230426143082,{"$f":"ROW()","v":268},"Barbara Jarrell ",null,null,"Lead",null,null,null,null,"(502) 384-1598","(270) 212-3116","(502) 896-8075","220 Masonic Home Dr #201","Masonic Home","KY",40041,null,true,false,false]
[null,20230426143083,{"$f":"ROW()","v":269},"Barbara S Woodall","",null,"Lead","MailList13","gadwoodall@yahoo.com","","","(678) 206-8922","(770) 474-3755","(770) 474-3215","120 Circle Dr","Hampton","GA","30228","Cobb County, GA",false,false,false]
[null,20230426143084,{"$f":"ROW()","v":270},"Barbara Server ",null,null,"Lead",null,null,null,null,"(847) 729-4696","(312) 266-1966","(847) 251-5344","8839 N Greenwood Ave","Niles","IL",60714,"Cook County, IL",true,false,false]
[null,20230426143085,{"$f":"ROW()","v":271},"CAREN BARNES","",null,"Lead","MailList13","cmbarnes68@gmail.com","cbarnes@unmc.edu","","(402) 890-2105","(402) 797-2129","(402) 421-7072","5957 Advent Cir","Trussville","AL","35173","Jefferson County, AL",false,false,false]
[null,20230426143086,{"$f":"ROW()","v":272},"Barriger Electric"," Thomas Barriger",null,"Lead","MailList13","wlsc6t@aol.com","","","(419) 727-1500","(419) 726-0611","(419) 727-0969","4425 Stickney Ave","Toledo","OH","43612","Lucas County, OH",false,false,false]
[null,20230426143087,{"$f":"ROW()","v":273},"James M Barton","",null,"Lead","MailList13","daniellbarton@gmail.com","xqjames.barton@earthlink.net","","(317) 417-4070","(770) 427-8692","(678) 574-7997","PO Box 2178","Pascagoula","MS","39569","Harrison County, MS",false,false,false]
[null,20230426143088,{"$f":"ROW()","v":274},"Basha Karim Shamsi","",null,"Lead","MailList13","akagirlstuff@msn.com","karimshamsibasha@aol.com","karimshamsibasha@gmail.com","(205) 281-5208","(205) 296-1622","(205) 870-1250","1842 Parkside Cir","Birmingham","AL","35209","Jefferson County, AL",false,false,false]
[null,20230426143089,{"$f":"ROW()","v":275},"Mohammed Bassini","",null,"Lead","MailList13","sarad5377@aol.com","","","(513) 759-9172","(513) 608-5582","(513) 373-9966","6721 Cherry Leaf Ct","Mason","OH","45040","Butler County, OH",false,false,false]
[null,20230426143090,{"$f":"ROW()","v":276},"Battens Paint and Body Inc."," Edward Mock ",null,"Lead","MailList2","brookmock@icloud.com",null,null,"(334) 347-1610","(334) 393-0465",null,"1252 Geneva Hwy","Enterprise","AL",36330,null,false,false,false]
[null,20230426143091,{"$f":"ROW()","v":277},"Bay At Cranbrook Health And An Llc ",null,null,"Lead",null,null,null,null,"(313) 366-2900",null,null,"165 N Village Ave Ste 126","Rockville Centre","NY",11570,null,true,false,false]
[null,20230426143092,{"$f":"ROW()","v":278},"Bay Cabinet Shop Inc","Dan J Klonk",null,"Lead","MailList13","dindas01@hotmail.com","","","(440) 871-3570","(440) 892-0179","(440) 781-9367","27003 Knickerbocker Rd","Cleveland","OH","44140","Cuyahoga County, OH",false,false,false]
[null,20230426143093,{"$f":"ROW()","v":279},"Gail L Bayer","",null,"Lead","MailList13","gbayer@bayerproperties.com","","","(205) 967-1354","(205) 967-7699",null,"4284 Old Brook Trl","Mountain Brk","AL","35243","Jefferson County, AL",false,false,false]
[null,20230426143094,{"$f":"ROW()","v":280},"Bear Creek Trucking Inc"," Albert Deason ",null,"Lead","MailList13","adeason@ameritrade.com","adeason1@ameritrade.com","","(205) 361-1079","(205) 926-9519","(205) 225-0203","116 Elam Acres ","Brent","AL","35034","Bibb County, AL",false,false,false]
[null,20230426143095,{"$f":"ROW()","v":281},"Oliver H Beaven","",null,"Lead","MailList13","mail@marigoldinfosys.com","ohioaviator64@gmail.com","","(937) 238-3644","(937) 350-5676","(937) 293-4212","2453 Crew Cir","Dayton","OH","45439","Montgomery County, OH",false,false,false]
[null,20230426143096,{"$f":"ROW()","v":282},"Todd R Becker","",null,"Lead","MailList13","melissascala@gmail.com","","","(205) 283-2626","(205) 870-0508","(205) 824-8998","1644 Canterbury Cir","Vestavia","AL","35243","Jefferson County, AL",false,false,false]
[null,20230426143097,{"$f":"ROW()","v":283},"Barbara Beckley","",null,"Lead","MailList13","bbeckley1967@yahoo.com","","","(513) 829-9877","(513) 874-3732","(513) 256-8192","1117 Goodman Ave","Hamilton","OH","45013","Montgomery County, OH",false,false,false]
[null,20230426143098,{"$f":"ROW()","v":284},"Becky M Gamble","",null,"Lead","MailList13","amble@lfc.edu","","","(262) 909-4903","(262) 909-4904","(262) 886-0120","1540 N Butterfield Rd","Libertyville","IL","60048","Genesee County, MI",false,false,false]
[null,20230426143099,{"$f":"ROW()","v":285},"BEDI RAVINDER","",null,"Lead","MailList13","rkbedi567@gmail.com","","","(267) 844-7162","(559) 275-4974","(559) 834-5157","440 N Lansdowne Ave","Drexel Hill","PA","19026","Madison County, MS",false,false,false]
[null,20230426143100,{"$f":"ROW()","v":286},"Daniel J Beers II","",null,"Lead","MailList13","djbeers3@gmail.com","djbeers@costsharingsolutions.com","dbeers20@gmail.com","(330) 495-9442","(330) 415-2482","(330) 854-9813","4724 Butterbridge Rd","North Lawrence","OH",44666,"Stark County, OH",false,false,false]
[null,20230426143101,{"$f":"ROW()","v":287},"RONALD S BEERS","",null,"Lead","MailList13","rsbsouth@netzero.net","","","(863) 452-5968","(863) 664-0178","(330) 854-0540","2451 State Road 17 S #21","Avon Park","FL","33825","Stark County, OH",false,false,false]
[null,20230426143102,{"$f":"ROW()","v":288},"BEH Properties Inc","Brent E Harmon",null,"Lead","MailList13","gameover.jo@gmail.com","brentharmon@bellsouth.net","","(828) 246-2455","(828) 454-5179","(910) 201-1108","3766 Annandale Drive","Myrtle Beach","SC","29577","Horry County, SC",false,false,false]
[null,20230426143103,{"$f":"ROW()","v":289},"Douglas D Behrens","",null,"Lead","MailList13","gndouglas.behrens35@aol.com","","","(330) 338-7777","(330) 864-5634","(330) 865-0174","1351 S Cleveland Massillon Rd","Copley","OH","44321","Summit County, OH",false,false,false]
[null,20230426143104,{"$f":"ROW()","v":290},"Seriehl C Belton","",null,"Lead",null,"","","","(601) 894-4082",null,null,"1038 Hansen Rd","Hazlehurst","MS","39083","Copiah County, MS",true,false,false]
[null,20230426143105,{"$f":"ROW()","v":291},"Benjamin W Biddle","",null,"Lead",null,"","","","(410) 849-8488","(202) 625-1273","(202) 667-7718","31 State St","Charleston","SC","29401","Charleston County, SC",true,false,false]
[null,20230426143106,{"$f":"ROW()","v":292},"Bennie D Harris ",null,null,"Lead","MailList2","bigronlee43@gmail.com","bensworld@carolina.rr.com","bensworld9@ec.rr.com","(612) 718-1883","(218) 682-2703","(815) 651-8039","3285 Green Forest Ln Nw","Longville","MN",56655,null,false,false,false]
[null,20230426143107,{"$f":"ROW()","v":293},"Bento Davie LLC","Johnny Tung",null,"Lead","MailList13","jimmycat89@aol.com","","","(352) 222-8293","(407) 999-8989","(352) 372-7600","PO Box 3831 ","Orlando","FL","32802","Broward County, FL",false,false,false]
[null,20230426143108,{"$f":"ROW()","v":294},"Bermet Wolfe","",null,"Lead",null,"","","","(212) 229-0028","(914) 713-4707",null,"3520 Dr Martin Luther King Jr St N","Saint Petersburg","FL","33704","Pinellas County, FL",true,false,false]
[null,20230426143109,{"$f":"ROW()","v":295},"Bermuda Inc","",null,"Lead",null,"","","","(843) 249-6163",null,null,"4492 Water Front Ave","Little River","SC","29566","Horry County, SC",true,false,false]
[null,20230426143110,{"$f":"ROW()","v":296},"Todd Berrien ","",null,"Lead","MailList13","harry.mccune@juno.com","kmccune@columbus.rr.com","kmccune@msn.com","(614) 882-6157","(216) 271-5230","(614) 337-0660","8333 Greyhawk Cir","Columbus","OH","43240","Franklin County, OH",false,false,false]
[null,20230426143111,{"$f":"ROW()","v":297},"Betke Concrete Contractors Inc",null,null,"Lead",null,null,null,null,"(847) 776-0063",null,null,"429 W Kenilworth Ave ","Palatine","IL",60067,"Cook County, IL",true,false,false]
[null,20230426143112,{"$f":"ROW()","v":298},"Bhavana Anand","",null,"Lead","MailList13","bhavana.anand@yahoo.com","p8bhavana.anand@epix.net","wwbhavana.anand27@aol.com","(334) 333-2097","(203) 246-8135","(334) 479-0630","41 Woodmere Dr","Dothan","AL","36305","Houston County, AL",false,false,false]
[null,20230426143113,{"$f":"ROW()","v":299},"Big Dog Demolition SE LLC","Renisha Campbell",null,"Lead","MailList13","renisha_small@yahoo.com","","","(770) 680-4949","(843) 773-9866","(843) 319-9549","980 Cipriana Dr Unit A1 ","Myrtle Beach","SC","29572","Horry County, SC",false,false,false]
[null,20230426143114,{"$f":"ROW()","v":300},"Big Greeks Gyro LLC","Michael J Sarris",null,"Lead","MailList13","msarris@angelfire.com","mmsarrisf37@angelfire.com","msarrislp98@angelfire.com","(216) 701-2020","(440) 473-9958","(440) 646-8232","6629 Mayfield Rd","Mayfield Hts","OH","44124","Cuyahoga County, OH",false,false,false]
[null,20230426143115,{"$f":"ROW()","v":301},"John S Billhimer","",null,"Lead","MailList13","interproohio@yahoo.com","idletime@bellsouth.net","","(937) 310-1280","(937) 219-6433","(937) 429-1558","PO Box 299","Bellbrook","OH","45305","Montgomery County, OH",false,false,false]
[null,20230426143116,{"$f":"ROW()","v":302},"Billy Boyd. Jr",null,"","Lead","MailList2","george.boyd@webtv.net","ranbyd@bellsouth.net",null,"(601) 992-2372","(601) 734-2958","(601) 260-5366","1111 Old Hearthstone Cir E","Collierville","TN",38017,null,false,false,false]
[null,20230426143117,{"$f":"ROW()","v":303},"Birmingham Dance Theatre Inc","Joni Scofield",null,"Lead","MailList13","inoj@bellsouth.net","inoj@comcast.net","joniscofield@gmail.com","(205) 822-3012","(205) 369-0111","(205) 822-1787","1694 Montgomery Hwy Ste 200","Hoover","Al","35216","Jefferson County, AL",false,false,false]
[null,20230426143118,{"$f":"ROW()","v":304},"Black Crystal Consulting LLC","Dave Miller",null,"Lead","MailList13","davedbm@gmail.com","drivercub1@yahoo.com","ange2838@comcast.com","(267) 288-5772","(215) 377-1425","(215) 396-0956","6330 N Andrews Ave Ste 10","Fort Lauderdale","FL","33309","Broward County, FL",false,false,false]
[null,20230426143119,{"$f":"ROW()","v":305},"Edward Black ","",null,"Lead","MailList13","hedwar55d.black@att.net","kedkward.black@att.net","edward.blackl4@att.net","(216) 773-2536","(216) 355-0263","(216) 732-8823","1379 Belle Ave #9","Cleveland","OH","44107","Franklin County, OH",false,false,false]
[null,20230426143120,{"$f":"ROW()","v":306},"Blackwood Grp Llc","Jose A. Duarte",null,"Lead",null,null,null,null,"773.799.8095",null,null,"1535 N Lawndale Ave","Chicago","IL",60651,"Cook County, IL",true,false,false]
[null,20230426143121,{"$f":"ROW()","v":307},"Blue Sky Enterprises Inc","Robert Coburn, Amy Coburn",null,"Lead","MailList13","nursesparks@aol.com","","","(304) 842-6989","(304) 842-0199",null,"212 Newton St","Bridgeport","WV","26330","Harrison County, WV",false,false,false]
[null,20230426143122,{"$f":"ROW()","v":308},"Bme Trucking Inc","Brian Enell",null,"Lead","MailList2","brianenell@yahoo.com","brianenell@windstream.net","victoriaenell@yahoo.com","(803) 518-5594","(803) 957-7022","(803) 957-4380","348 Kenwood Dr","Lexington","SC",29072,"Lexington County, SC",false,false,false]
[null,20230426143123,{"$f":"ROW()","v":309},"Michael Boczek ","",null,"Lead","MailList13","mboczek@gmail.com","bozer22@aol.com","bozer@webtv.net","(216) 287-8854","(312) 474-9303","(740) 594-7344","6835 Greenbrier Dr","Brecksville","OH","44141","Cuyahoga County, OH",false,false,false]
[null,20230426143124,{"$f":"ROW()","v":310},"Bolin Reeves Florist Inc","Jamie R Reeves ",null,"Lead","MailList13","jamie.bolinreeves@bellsouth.net","jamie.bolinreeves@gmail.com","","(205) 324-8521","(205) 980-0095","(205) 877-7782","344 6th Ave SW","Birmingham","AL","35211\r\n","Jefferson County, AL",false,false,false]
[null,20230426143125,{"$f":"ROW()","v":311},"Mark Bolton ","",null,"Lead","MailList13","federalhcs@gmail.com","markboltonmd@hotmail.com","sboltonrn@hotmail.com","(740) 403-6687","(614) 313-6112","(614) 722-4329","2415 Swisher Creek Dr","Blacklick","OH","43004","Franklin County, OH",false,false,false]
[null,20230426143126,{"$f":"ROW()","v":312},"Bolts and Quarters Quilt Shop","Brian McCoy",null,"Lead","MailList13","theredneckquilter@yahoo.com","","","(304) 428-4933",null,null,"2595 Dupont Rd ","Parkersburg","WV","26101","Wood County, WV",false,false,false]
[null,20230426143127,{"$f":"ROW()","v":313},"Pete Bonner ","",null,"Lead","MailList13","pecospete@attb1.com","","","(216) 385-7301","(740) 765-9097","(740) 765-5442","1481 Summerwood Dr","Broadview Heights","OH","44147","Franklin County, OH",false,false,false]
[null,20230426143128,{"$f":"ROW()","v":314},"Bonnie Randle ",null,null,"Lead",null,null,null,null,"(773) 624-3170",null,null,"20 E 117th St","Chicago","IL",60628,"Cook County, IL",true,false,false]
[null,20230426143129,{"$f":"ROW()","v":315},"Suzanne O Boozer","",null,"Lead","MailList13","sbrowning@redfieldgroup.com","sweetapplefarm1@att.net","","(256) 390-3539","(256) 547-2152","(256) 393-5993","860 Sweet Apple Rd","Pell City","AL","35128","Jefferson County, AL",false,false,false]
[null,20230426143130,{"$f":"ROW()","v":316},"Trent R Boozer","",null,"Lead","MailList13","angelrn22@aol.com","","","(205) 789-6271","(205) 873-0767","(205) 870-1847","4169 Highlands Cir","Birmingham","AL","35213","Jefferson County, AL",false,false,false]
[null,20230426143131,{"$f":"ROW()","v":317},"Borden Family Electrical Inc.","Joseph Borden",null,"Lead","MailList2","jodynsusan@netscape.com","susbord@gmail.com",null,"(256) 736-4760","(256) 737-5049","(256) 737-2381","8748 Co Road 1435","Vinemont","AL",35179,null,false,false,false]
[null,20230426143132,{"$f":"ROW()","v":318},"Boris O Roman ",null,"opened broman1970@hotmail.com","Lead","MailList2","resengan1970@outlook.com","broman1970@hotmail.com","josemshuman@hotmail.com","(502) 356-1344","(862) 232-1800","(502) 245-4887","1828 Rutherford Ave","Louisville","KY",40205,"Jefferson County, KY",false,false,false]
[null,20230426143133,{"$f":"ROW()","v":319},"Bosch Marine Yacht Services LLC","Ockert Bosch",null,"Lead",null,"","","","(954) 376-0432",null,null,"757 SE 17TH St 922","Fort Lauderdale","FL","33316","Broward County, FL",true,false,false]
[null,20230426143134,{"$f":"ROW()","v":320},"Don Bosco Fc International Corp ","",null,"Lead",null,"","","",null,null,null,"3999 Hallandale Beach Blvd","Hollywood","L ","33023","Broward County, FL",true,true,false]
[null,20230426143135,{"$f":"ROW()","v":321},"Christi Bourne ","",null,"Lead","MailList13","crystalbenge@netzero.net","crysbenge77@gmail.com","benge_crystal77@hotmail.com","(513) 878-4978","(931) 787-6913","(602) 616-8259","35 Cherry Branch Rd","Crossville","TN","38571","Franklin County, OH",false,false,false]
[null,20230426143136,{"$f":"ROW()","v":322},"Jonathan R Bowers ","",null,"Lead","MailList13","sjonathan.bowersk50@aol.com","jonathan.bowersoy20@aol.com","","(740) 974-2669","(740) 653-9691","(740) 503-6644","4001 Harlem Rd","New Albany","OH","43054","Franklin County, OH",false,false,false]
[null,20230426143137,{"$f":"ROW()","v":323},"Boyce A Frye, Jr","",null,"Lead",null,null,null,null,null,null,null,"1820 Old Aberdeen Road","Columbus","MS","","",true,true,false]
[null,20230426143138,{"$f":"ROW()","v":324},"Murtle Boykin Lighton","",null,"Lead","MailList13","mwlighton@yahoo.com","myrtle@mailcity.com","boykinl575@aol.com","(419) 724-6631","(419) 304-3769","(419) 222-4474","1675 W Bancroft St","Toledo","OH","43606","Lucas County, OH",false,false,false]
[null,20230426143139,{"$f":"ROW()","v":325},"John Bracy","",null,"Lead","MailList15","john.bracey@juno.com","tentwofifty.cb@gmail.com","john.bracey@gmail.com","(614) 569-1170","(614) 353-2733","(614) 274-9391","7773 Hamilton St","Omaha","NE","68114","Loraine County, OH",false,false,false]
[null,20230426143140,{"$f":"ROW()","v":326},"Bradford Animal Care Etc","Barry C Holden",null,"Lead","MailList14","ferrarella28@yahoo.com","bonnieh@bellsouth.net","sbabylonix@comcast.net","(843) 884-3200","(843) 886-8469","(843) 886-5844","1662 Savannah Hwy 135","Charleston","SC","29407","Charleston County, SC",false,false,false]
[null,20230426143141,{"$f":"ROW()","v":327},"Bradley Nardick ",null,null,"Lead",null,null,null,null,"(847) 480-3022","(847) 480-1957",null,"1560 N Sandburg Ter #601j","Chicago","IL",60610,"Cook County, IL",true,false,false]
[null,20230426143142,{"$f":"ROW()","v":328},"RONISHIA M BRADLEY","",null,"Lead","MailList15","ronishiab@yahoo.com","","","(216) 862-5422","(216) 456-1116","(216) 394-4259","135 Huron St","Elyria","OH","44035","Loraine County, OH",false,false,false]
[null,20230426143143,{"$f":"ROW()","v":329},"RONISHIA M BRADLEY","Stanley Brantley",null,"Lead","MailList2","brantley_development@yahoo.com",null,null,"(734) 722-7398","(810) 610-0427","(248) 739-2590","43621 S Timberview Dr","Van Buren Twp","MI",48111,"Wayne County, MI",false,false,false]
[null,20230426143144,{"$f":"ROW()","v":330},"ELI BRAXTON ","",null,"Lead","MailList14","gwendk@yahoo.com","elibrax@yahoo.com","elibraxton@hotmail.com","(205) 428-5410","(205) 503-3880","(205) 249-7103","4352 Bell Hill Rd","Bessemer","AL","35022","Jefferson County, AL",false,false,false]
[null,20230426143145,{"$f":"ROW()","v":331},"GWENDELYN D BRAXTON ","",null,"Lead","MailList15","gwendk@yahoo.com","elibrax@yahoo.com","","(205) 503-3880","(205) 966-7101","(205) 849-8427","4352 Bell Hill Rd","Bessemer","AL","35022","Jefferson County, AL",false,false,false]
[null,20230426143146,{"$f":"ROW()","v":332},"Brenda D Mccall","",null,"Lead","MailList14","bmccall612@gmail.com","bmccall-ross@tivo.com","bmccallross@tivo.com","(347) 979-6221","(718) 442-3498","(910) 738-3651","3310 Justin Way SE","Conyers","GA","30013","Rockdale County, GA",false,false,false]
[null,20230426143147,{"$f":"ROW()","v":333},"Brenda S Cooks","",null,"Lead","MailList14","womanofpower1@comcast.net","bobbycooks@gmail.com","","(954) 391-7232","(754) 204-5452","(754) 204-5452","445 Markham St SW #D13","Atlanta","GA","30313","Broward County, FL",false,false,false]
[null,20230426143148,{"$f":"ROW()","v":334},"Brenisha T Joyner","",null,"Lead",null,"","","","(901) 571-7685","(662) 781-8137","(662) 548-5720","5791 Plum Valley Dr","Memphis","TN","38141","DeSoto County, MS",true,false,false]
[null,20230426143149,{"$f":"ROW()","v":335},"BRENT L CRUMPTON PC","",null,"Lead","MailList14","coxl@att.net","","","(205) 933-7853","(205) 323-9268","(205) 250-0010","1120 28th Pl S","Birmingham","AL","35205","Jefferson County, AL",false,false,false]
[null,20230426143150,{"$f":"ROW()","v":336},"Brian F Benn \n Maren A",null,null,"Lead","MailList2","bbenn45@gmail.com","brian@bergconstruction.com","mbenn@live.com","(734) 483-1481","(734) 589-8632","(734) 504-9085","7730 N Lilley Rd","Canton","MI",48187,null,false,false,false]
[null,20230426143151,{"$f":"ROW()","v":337},"Brian G. Storey","9 Mile Rent All Inc",null,"Lead","MailList9","briangstorey@juno.com","ems6415@gmail.com","|genestorey01@yahoo.com","(586) 757-6055","(586) 480-3232","(586) 997-1293",null,null,null,null,"Macomb County, MI",false,false,false]
[null,20230426143152,{"$f":"ROW()","v":338},"Brian L Syas","",null,"Lead","MailList14","brianlsyas@aol.com","dxbrianlsyas19@aol.com","","(619) 789-8481","(714) 990-2591","(951) 696-0635","1919 Orvid St","North Charleston","SC","29405","Charleston County, SC",false,false,false]
[null,20230426143153,{"$f":"ROW()","v":339},"Brian P Anzel ",null,"Opened emilia_a_bg@yahoo.com","Lead","MailList2","emilia_a_bg@yahoo.com",null,null,"(312) 642-1093","(815) 609-2124","(312) 320-4756","401 E Ontario St","Chicago","IL",60611,"Cook County, IL",false,false,false]
[null,20230426143154,{"$f":"ROW()","v":340},"Brian W Patterson ",null,null,"Lead",null,null,null,null,"(502) 216-9530","(502) 592-3094","(502) 239-0149","2634 Rockford Ln","Louisville","KY",40216,null,true,false,false]
[null,20230426143155,{"$f":"ROW()","v":341},"William W Bridge III","",null,"Lead",null,"wwbridgeiii@sbcglobal.net","","","(440) 336-0035","(614) 818-9622",null,"5605 Westerville Rd #C","Westerville","OH","43081","Cuyahoga County, OH",false,false,false]
[null,20230426143156,{"$f":"ROW()","v":342},"Brighton Christian Memorial LLC","Roderick A Hatch, Kenneth S Scott",null,"Lead","MailList14","frankbelk@att.net","","","(205) 337-7677","(205) 425-3577","(205) 425-3998","4400 BESSEMER SUPER HWY","BESSEMER","AL","35020","Jefferson County, AL",false,false,false]
[null,20230426143157,{"$f":"ROW()","v":343},"Britini C Brown","",null,"Lead",null,"","","","(727) 768-2666","(217) 728-4704","(815) 928-8247","524 N Grant St","Sullivan","IL","61951","Pinellas County, FL",true,false,false]
[null,20230426143158,{"$f":"ROW()","v":344},"Brittany M Easton","",null,"Lead","MailList14","britters2289@yahoo.com","","","(248) 910-0355","(248) 561-2645","(248) 670-3258","6840 Roby","Waterford","MI","48327","Oakland County, MI",false,false,false]
[null,20230426143159,{"$f":"ROW()","v":345},"Brittany M Henry","",null,"Lead","MailList14","bmichellecopeland@gmail.com","prettygirlglam@gmail.com","copela48@msu.edu","(313) 310-3896","(313) 835-9417","(313) 310-3897","21905 Hampshire Ct","Southfield","MI","48076","Oakland County, MI",false,false,false]
[null,20230426143160,{"$f":"ROW()","v":346},"Brittany M Jordan ",null,"Rtnd Rtnd Opened braxtonsmommy0914@yahoo.com","Lead","MailList2","braxtonsmommy0914@yahoo.com",null,null,"(618) 759-2703","(270) 331-5768","(701) 776-5154","1297 Grand Chain Rd","Grand Chain","IL",62941,"Cook County, IL",false,false,false]
[null,20230426143161,{"$f":"ROW()","v":347},"Brittany Stenger","",null,"Lead",null,"","","","(561) 401-6828","(561) 575-3141","(805) 665-8936","15358 97th Dr N","Jupiter","FL","33478","Volusia County, FL",true,false,false]
[null,20230426143162,{"$f":"ROW()","v":348},"Brock Kowske ",null,null,"Lead","MailList2","brockek@hotmail.com",null,null,"(312) 730-4160","(312) 944-8442","(312) 944-4484","3205 W Division St #401","Chicago","IL",60651,"Cook County, IL",false,false,false]
[null,20230426143163,{"$f":"ROW()","v":349},"Brook Street Enterprises Llc","Rick E. Hughes",null,"Lead","MailList2","hughes.richard@gmail.com","rickehughes@gmail.com",null,"(502) 558-8533","(270) 737-8018","(859) 309-1068","1809 Claremoor Dr","Louisville","KY",40223,null,false,false,false]
[null,20230426143164,{"$f":"ROW()","v":350},"Aric Brooks","",null,"Lead",null,"","","",null,null,null,"2138 Crossbridge Blvd","Byram","MS","39272","Rankin County, MS",true,true,false]
[null,20230426143165,{"$f":"ROW()","v":351},"Brooks Electrical Installation Inc."," Jeff Brooks  ",null,"Lead","MailList9","jehxsickxuhx@comcast.net","jeff@brookselectricalinc.net","16190570@dummy.com","(256) 859-6333","(256) 430-5078","(256) 882-5040","109 Dominion Cir","Huntsville","AL",35811,null,false,false,false]
[null,20230426143166,{"$f":"ROW()","v":352},"Brooks Services LLC","Angela Brooks",null,"Lead","MailList14","brooks8493@gmail.com","angelabrooks54@gmail.com","","(256) 565-9365","(256) 773-9666","(256) 773-3448","370 Lee Rd 222","Smiths Station","Al","36877","Jefferson County, AL",false,false,false]
[null,20230426143167,{"$f":"ROW()","v":353},"Deena E Brown","",null,"Lead",null,"","","","(702) 489-1194",null,null,"1023 Leland Ave","Dayton","OH","45402","Montgomery County, OH",true,false,false]
[null,20230426143168,{"$f":"ROW()","v":354},"Brown Electrical LLC","Sean Brown",null,"Lead","MailList14","BrownElectricalLLC@yahoo.com","","","(843) 593-5598",null,null,"977 Portabella Lane","Charleston","SC","29412","Charleston County, SC",false,false,false]
[null,20230426143169,{"$f":"ROW()","v":355},"Martin K Brown","",null,"Lead",null,"","","","(404) 667-3004","(770) 941-5280","(864) 260-0049","1460 Memory Ln SE","Smyrna","GA","30080","Montgomery County, OH",true,false,false]
[null,20230426143170,{"$f":"ROW()","v":356},"Richard A Brown","",null,"Lead","MailList15","rexbrown@gmail.com","brynabrown@yahoo.com","","(863) 967-1032","(863) 307-6833","(863) 968-1297","2424 Thornhill Rd","Auburndale","FL","33823","Madison County, MS",false,false,false]
[null,20230426143171,{"$f":"ROW()","v":357},"Brown Sales Associates Inc","Ben H Brown",null,"Lead","MailList14","a1candrsv@aol.com","arleyou@att.net","","(205) 381-0593","(205) 991-7600","(205) 995-5083","","2711 19TH PLACE SOUTH BIRMINGHAM","AL","35209","Jefferson County, AL",false,false,false]
[null,20230426143173,{"$f":"ROW()","v":358},"Todd E Brown","",null,"Lead","MailList15","chucknkim1973@juno.com","kbrown53@aol.com","","(330) 565-3967","(330) 792-3654","(330) 793-6088","5630 Yorktown Ln","Austintown","OH","44515","Stark County, OH",false,false,false]
[null,20230426143174,{"$f":"ROW()","v":359},"Christine Brown","",null,"Lead","MailList14","mustangbrown081@gmail.com","christiford2018@gmail.com","christiford2015@gmail.com","(740) 763-4878","(740) 405-2354","(740) 975-1754","691 W Main St","Newark","OH","43055","Summit County, OH",false,false,false]
[null,20230426143175,{"$f":"ROW()","v":360},"Bruce E Bowers","",null,"Lead","MailList14","brucebowers@rocketmail.com","","","(404) 429-7113","(770) 971-5402","(404) 504-5902","2250 Chadds Creek Dr","Marietta","GA","30062","Cobb County, GA",false,false,false]
[null,20230426143176,{"$f":"ROW()","v":361},"Bruna Marketing Group Inc","Jean Bruna",null,"Lead","MailList14","jeanbruna@gmail.com","brunaalexis@ymail.com","jbruna1@gmail.com","(954) 825-6552","(954) 934-2525","(954) 724-0559","4240 NW 12TH STREET","LAUDERHILL","FL","33313","Broward County, FL",false,false,false]
[null,20230426143177,{"$f":"ROW()","v":362},"Bryan Craig ",null,null,"Lead","MailList2","bcraig@burlingbuilders.com",null,null,"(708) 403-8448","(708) 925-2843","(708) 704-4469","1409 N Maplewood Ave","Chicago","IL",60622,"Cook County, IL",false,false,false]
[null,20230426143178,{"$f":"ROW()","v":363},"Bryan Mills","",null,"Lead","MailList14","kwaldenm@aol.com","dalorean_mills@yahoo.com","","(321) 352-9987","(727) 366-2851","(727) 446-7875","2601 Summit Creek Dr","Stone Mountain","GA","30083","Broward County, FL",false,false,false]
[null,20230426143179,{"$f":"ROW()","v":364},"BSH Accountants Inc","Bonnie S Henderson",null,"Lead","MailList14","bonniebsh@bellsouth.net","","","(919) 359-8995","(919) 274-1907","(919) 779-9615","200 Hwy 70 East","Garner","NC","27529","Horry County, SC",false,false,false]
[null,20230426143180,{"$f":"ROW()","v":365},"Bugs Burger Bug Killers Inc","",null,"Lead","MailList14","andy@bugsburger.com","","","(305) 992-1650","(305) 865-3611","(305) 322-2922","7876 SW 89th Ln","Miami","FL","33156","Miami-Dade County, FL",false,false,false]
[null,20230426143182,{"$f":"ROW()","v":366},"Bujar Inc","Spresa Mamuslari",null,"Lead","MailList2","shpresam@yahoo.com",null,null,"(586) 873-5118","(586) 412-3577","(313) 882-1044","39200 Sunderland Dr","Clinton Township","MI",48038,"Wayne County, MI",false,false,false]
[null,20230426143183,{"$f":"ROW()","v":367},"Bukola M Bello ",null,null,"Lead","MailList2","almondjoy16@hotmail.com","almondjoy16@sbcglobal.net",null,"(217) 766-6869","(209) 373-8366","(217) 332-3075","728 W 15th St","Chicago","IL",60607,"Cook County, IL",false,false,false]
[null,20230426143184,{"$f":"ROW()","v":368},"Vajava L Burch","",null,"Lead","MailList15","javablue60@gmail.com","jjavaburchs66@yahoo.com","","(205) 266-9009","(205) 422-8115","(205) 424-0341","391 Fernbrook Ave","Birmingham","AL","35215","Jefferson County, AL",false,false,false]
[null,20230426143185,{"$f":"ROW()","v":369},"Remeswar J Burgess","",null,"Lead","MailList15","remeswar_burgess@yahoo.com","","","(601) 454-5203","(601) 922-6374","(601) 469-9931","1227 Pin Oak Dr #E04","Flowood","MS","39232","Madison County, MS",false,false,false]
[null,20230426143186,{"$f":"ROW()","v":370},"Jeffrey D Burns","",null,"Lead","MailList15","jeffrey.burns@netzero.net","","","(216) 630-7395","(208) 890-2345","(231) 970-0188","9269 Potter Rd","Bear Lake","MI","49614","Butler County, OH",false,false,false]
[null,20230426143187,{"$f":"ROW()","v":371},"Burns Ross",null,null,"Lead","MailList2","dumb-ed@stupid.com","pentiumone133@gmail.com","wross36@hotmail.com","(847) 854-6645","(224) 333-0883","(815) 854-6645","32913 Bordeaux Ave","Paw Paw","MI",49079,"Cook County, IL",false,false,false]
[null,20230426143188,{"$f":"ROW()","v":372},"Burris Drywall Inc","Jerry A Burris",null,"Lead","MailList14","jerry.burris@yahoo.com","","","(330) 875-4880","(234) 571-3880","(704) 463-5374","2732 Graybill Rd","Uniontown","OH","44685","Stark County, OH",false,false,false]
[null,20230426143189,{"$f":"ROW()","v":373},"Bus Service Faith","Henry M & Patricia Faith",null,"Lead",null,"","","","(251) 599-0385","(251) 653-4429",null,"2 North Jackson St Ste 605","Montgomery","Al","36104","Mobile County, AL",true,false,false]
[null,20230426143190,{"$f":"ROW()","v":374},"Brian Butcher ","",null,"Lead","MailList14","brian.butcher@gmail.com","butcherbj@aol.com","pdbrian.butcher91@gmail.com","(330) 676-1143","(330) 699-1938","(330) 699-9084","1515 Parsons Dr","Kent","OH","44240","Franklin County, OH",false,false,false]
[null,20230426143191,{"$f":"ROW()","v":375},"Jeffrey A Byer","",null,"Lead","MailList15","jdbyers@comcast.net","jdbyers@southernco.com","","(205) 664-9094","(205) 563-9094","(205) 492-8406","1682 Highway 1","Bessemer","AL","35022","Jefferson County, AL",false,false,false]
[null,20230426143192,{"$f":"ROW()","v":376},"C and J Lawn Experts Inc","",null,"Lead","MailList14","boosha@cjlawnexperts.net","","","(205) 855-4280",null,null,"1430 Gasden Hwy","Birmingham","AL","36535","Jefferson County, AL",false,false,false]
[null,20230426143193,{"$f":"ROW()","v":377},"C and L DIESEL INC","Charles D Freeman, Lee B Jennings",null,"Lead","MailList14","mamadeb1953@aol.com","","","(601) 951-3001","(601) 847-4613","(601) 845-8795","947 Simpson Highway 149","Magee","MS","39111","Rankin County, MS",false,false,false]
[null,20230426143194,{"$f":"ROW()","v":378},"Luna-C Holdings ","Daniel Rouse",null,"Lead","MailList15","dsr270@email.com","dandbfire@hotmail.com","","(252) 946-4007","(252) 215-8818","(252) 946-0661","830 44th Ave N Ste H3","Myrtle beach","C,","29577","Horry County, SC",false,false,false]
[null,20230426143195,{"$f":"ROW()","v":379},"Calbert Design Group LLC","Rebecca Kaye Calbert",null,"Lead","MailList14","rebeccac1348@email.msn.com","rkcalbert@comcast.net","zachary.calbert@gmail.com","(770) 218-1244","(404) 434-9531","(770) 485-9236","683 Day Lily Ct NW","Acworth","GA","30102","Cobb County, GA",false,false,false]
[null,20230426143196,{"$f":"ROW()","v":380},"Calvin Strong","",null,"Lead","MailList14","strongbcalvin@yahoo.com","","","(301) 375-8732","(518) 372-3970",null,"2604 Dakota St","Bryans Road","MD","20616","Albany County, NY",false,true,false]
[null,20230426143197,{"$f":"ROW()","v":381},"Calvita J Frederick ",null,null,"Lead","MailList2","csowell@redflex.com",null,null,"(773) 538-6010","(312) 922-0002","(708) 657-4445","2415 W Palmer St","Chicago","IL",60647,"Cook County, IL",false,false,false]
[null,20230426143198,{"$f":"ROW()","v":382},"DANIEL  CAMPBELL","",null,"Lead","MailList14","dec.campbell@gmail.com","dec.campbell@yahoo.com","camzthe1@earthlink.net","(770) 405-8310","(770) 966-4380",null,"1786 Mackinaw Pl SE","Smyrna","GA","30080","Montgomery County, OH",false,true,false]
[null,20230426143199,{"$f":"ROW()","v":383},"JAMES P CAMPBELL","",null,"Lead","MailList15","ashleymariecampbell@gmail.com","jcampb6718@aol.com","ether322@sbcglobal.net","(615) 401-9156","(330) 677-3204",null,"3243 Dark Woods Dr","Franklin","TN","37064","Cuyahoga County, OH",false,true,false]
[null,20230426143200,{"$f":"ROW()","v":384},"Sharon D Cannon","",null,"Lead","MailList15","thickmadame26@gmail.com","77chriscannon@gmail.com","","(662) 265-5984","(662) 265-0088",null,"120 Greenbriar Ct","Lima","OH","45804","Franklin County, OH",false,true,false]
[null,20230426143201,{"$f":"ROW()","v":385},"MICHAEL A CANTRELL","",null,"Lead","MailList15","cantrellfarms@hotmail.com","","","(740) 226-1015","(910) 436-4130",null,"216 Patrick Ave","Jackson","OH","45640","Cuyahoga County, OH",false,true,false]
[null,20230426143202,{"$f":"ROW()","v":386},"Capital C Masonry Llc","Christian Jay Minor",null,"Lead","MailList14","chrisjayminor@gmail.com","","","(614) 622-4251","(614) 846-4405",null,"69 N 21ST ST","COLUMBUS","OH","43203","Franklin County, OH",false,true,false]
[null,20230426143203,{"$f":"ROW()","v":387},"Capital Liquor Inc","Raghda Butros",null,"Lead",null,null,null,null,"(248) 420-2500","(248) 842-4853","(703) 751-3737","12220 Schaefer","Detroit","MI",48217,"Wayne County, MI",true,false,false]
[null,20230426143204,{"$f":"ROW()","v":388},"Rebecca L Capps","",null,"Lead",null,"","","","(205) 884-7724","(205) 338-6963",null,"109 Bridge Dr","Birmingham","AL","35242","Jefferson County, AL",true,true,false]
[null,20230426143205,{"$f":"ROW()","v":389},"Michael R Capuano","",null,"Lead","MailList15","mike.capuano@tcountytitle.com","mcapuano@columbus.rr.com","","(614) 851-4467","(937) 451-9018",null,"1528 Guilford Rd","Columbus","OH","43221","Franklin County, OH",false,true,false]
[null,20230426143206,{"$f":"ROW()","v":390},"Cara E Dunning ",null,"Opened caradunning1@gmail.com","Lead","MailList2","caradunning1@gmail.com","cdunning@hotmail.com","carad@go.com","(407) 298-4296","(813) 454-2367","(813) 971-9195","101 Spade Leaf Blvd #911","Hendersonville","TN",37075,"Cook County, IL",false,false,false]
[null,20230426143207,{"$f":"ROW()","v":391},"Sam G Caras","",null,"Lead","MailList15","samcaras@caraslaw.com","sam_caras@day-intl.com","",null,null,null,"130 W 2nd St #310","Dayton","OH","45402","Montgomery County, OH",false,true,false]
[null,20230426143208,{"$f":"ROW()","v":392},"Omar Cardenas MD PA","",null,"Lead","MailList15","omarcardenas@hotmail.com","ocardenasmd91@gmail.com","ocardenas@bigfoot.com","(813) 994-7748","(813) 907-6983",null,"2101 Curry Rd","Lutz","l,","33549","Hillsborough County, FL",false,true,false]
[null,20230426143209,{"$f":"ROW()","v":393},"Cardinal Land and Services LLC","Erik Mccall",null,"Lead","MailList14","ejm2011@gmail.com","jasonmccall@gmail.com","","(304) 842-5930","(304) 842-4092",null,"775 W PIKE ST","CLARKSBURG","WV","26301","Harrison County, WV",false,true,false]
[null,20230426143210,{"$f":"ROW()","v":394},"Cardr Inc","Jennifer M Massey",null,"Lead","MailList14","massey.jm@gmail.com","irjmassey40@beginat.com","","(770) 971-4466","(770) 485-7701",null,"2050 Lower Roswell Road","Marietta","GA","30068","Cobb County, GA",false,true,false]
[null,20230426143211,{"$f":"ROW()","v":395},"Carey A Fowler","",null,"Lead","MailList14","fowler@nixfowler.com","lorifowler15@gmail.com","","(770) 424-6977","(404) 862-6246",null,"Huse Watson Rd","Oakdale","TN","37829","Cobb County, GA",false,true,false]
[null,20230426143212,{"$f":"ROW()","v":396},"Carey M Dowdle ",null,null,"Lead","MailList2","cdowdle@ameritrade.com","carey@dowdle.net",null,"(847) 687-3512","(847) 480-1372","(217) 224-1397","2326 Crabtree Ln","Northbrook","IL",60062,"Cook County, IL",false,false,false]
[null,20230426143213,{"$f":"ROW()","v":397},"Cargo Express Intercontinental","Gilberto a Altuve",null,"Lead","MailList14","grbenedict@worldnet.att.net","gialtuve@cs.com","imeldaven@hotmail.com","(000) 000-0078",null,null,"7563 NW 112th Pl","Medley","FL","33178","Miami-Dade County, FL",false,true,false]
[null,20230426143214,{"$f":"ROW()","v":398},"Carin Johnson","",null,"Lead","MailList14","lamcla@aol.com","carina.robinson@erols.com","robinsoncarina@yahoo.com","(216) 832-0918","(216) 235-2412",null,"687 Shadow Lake Dr","Lithonia","GA","30058","Cobb County, GA",false,true,false]
[null,20230426143215,{"$f":"ROW()","v":399},"Carina E Holmgren","",null,"Lead",null,"","","","(954) 763-2205","(954) 802-8008","(954) 828-1510","1633 NW 5th Ave","Fort Lauderdale","FL","33311","Broward County, FL",true,true,false]
[null,20230426143216,{"$f":"ROW()","v":400},"Carl C Chrouch","",null,"Lead",null,"","","","(586) 843-7856","(586) 457-7700","(586) 634-8966","5244 Copley Square Rd","Grand Blanc","MI","48439","Genesee County, MI",true,true,false]
[null,20230426143217,{"$f":"ROW()","v":401},"Carl E Volz ",null,null,"Lead","MailList2","montecarl@hotmail.com","montecarl@comcast.net","lindseyvolz123@gmail.com","(708) 579-0053","(847) 253-8620","(708) 822-4204","804 S Deborah Ln","Mount Prospect","IL",60056,"Cook County, IL",false,false,false]
[null,20230426143218,{"$f":"ROW()","v":402},"Carl Harris ",null,null,"Lead","MailList2","suzannearmin@gmail.com","carlaha@attb1.com","carla.m.harris123@gmail.com","(708) 328-8474","(331) 645-2043","(224) 244-0999","8807 44th Pl","Brookfield","IL",60513,"Cook County, IL",false,false,false]
[null,20230426143219,{"$f":"ROW()","v":403},"Carl T Walsh II","",null,"Lead",null,"cwalsh@tampabay.rr.com","qhcwalsh11@tampabay.rr.com","","(231) 537-2573","(231) 537-2331","(253) 537-4340","6765 Paradise Trl","Carp Lake","MI","49718","Oakland County, MI",false,true,false]
[null,20230426143220,{"$f":"ROW()","v":404},"Carl W Johnson ",null,null,"Lead","MailList3","antkblonde@msn.com","bijohnson@trane.com","jodepisces@aol.com","(770) 358-6529","(678) 359-1096","(770) 853-8313","Po Box 252","Barnesville","GA",30204,"Cook County, IL",false,false,false]
[null,20230426143221,{"$f":"ROW()","v":405},"Carla S Mackey ",null,null,"Lead","MailList3","cmcis100@yahoo.com","v.j333@yahoo.com","carla.mackey@aol.com","\n(502) 541-0940 - Wireless\n(502) 968-7849 - Landline\n(270) 273-3647 - Landline\n",null,null,null,"1206 State Route 136 E\nCalhoun KY 42327 ",null,null,"Wayne County, MI",false,false,false]
[null,20230426143222,{"$f":"ROW()","v":406},"Carlos Granados ",null,null,"Lead","MailList3","granados@comcast.net","cangranados@gmail.com","michael_granados90@yahoo.com","(773) 817-3369","(708) 652-9436","(312) 261-2004","1309 East Ave","Berwyn","IL",60402,"Cook County, IL",false,false,false]
[null,20230426143223,{"$f":"ROW()","v":407},"Carmen D Wheeler","",null,"Lead",null,"bbqwidow@aol.com","cdwheeler7466@aol.com","","(901) 351-3649","(601) 342-9291","(662) 342-9291","5598 Pinetree Loop E","Southaven","MS","38672","DeSoto County, MS",false,true,false]
[null,20230426143224,{"$f":"ROW()","v":408},"Carmencita Hicks","",null,"Lead",null,"cameliahicks@yahoo.com","","","(251) 554-8505","(251) 843-2295","(678) 372-4363","409 Greighmoor Ct","Loganville","GA","30052","Houston County, AL",false,true,false]
[null,20230426143225,{"$f":"ROW()","v":409},"Carmetrius Willingham","",null,"Lead",null,"","","","(662) 638-3810",null,null,"38 County Road 2003","Oxford","MS","38655","DeSoto County, MS",true,true,false]
[null,20230426143226,{"$f":"ROW()","v":410},"Carol Heathcock","",null,"Lead",null,null,"","","(205) 487-8859","(205) 487-0044",null,"6824 County Road 24","Eldridge","AL","35554","Mobile County, AL",true,true,false]
[null,20230426143227,{"$f":"ROW()","v":411},"Carol L Adams","",null,"Lead",null,"caroll346@aol.com","caroll346@tds.net","chuckadams1955@yahoo.com","(810) 422-5225","(810) 631-2392","(205) 715-2140","1409 N Packard Ave","Burton","MI","48509","Macomb County, MI",false,false,false]
[null,20230426143228,{"$f":"ROW()","v":412},"Carol Lovejoy","",null,"Lead",null,"","","","(207) 795-1010","(843) 915-2004","(207) 241-0701","3409 High Hill Dr","Little River","SC","29566","Charleston County, SC",true,true,false]
[null,20230426143229,{"$f":"ROW()","v":413},"Carol M Vibbert ",null,null,"Lead","MailList3","nathanvang105@gmail.com","carolvibbert@yahoo.com","csmith01@bellarmine.edu","(502) 235-2023","(502) 224-8134","(502) 608-6980","12301 Center Grove Ln #101","Louisville","KY",40223,"Jefferson County, KY",false,false,false]
[null,20230426143230,{"$f":"ROW()","v":414},"Carolina Homeworks An LLC","Jessica S Volinski",null,"Lead",null,"gorccar@yahoo.com","gs8823@sccoast.net","gs1@sccoast.net","(843) 465-1933","(843) 995-1779","(843) 347-8823","1501 Knotty Branch Rd","Conway","SC","29527","Horry County, SC",false,true,false]
[null,20230426143231,{"$f":"ROW()","v":415},"Carolyn C Greene ","Isaac Greene ",null,"Lead","MailList3","carolyn.greene@msn.com","greenec@scdhhs.gov","smalltara@yahoo.com","(803) 533-0539","(573) 382-1478","(803) 707-0280","2221 Battleford Rd #c","Columbia","SC",29210,"Lexington County, SC",false,false,false]
[null,20230426143232,{"$f":"ROW()","v":416},"Carolyn D McDonald","Goes By Carolyn Blades - 208 N Hill St\nLenoir City, TN 37771 ","Carolyn D Blades\n6672 2018/19 $30,430","Lead",null,null,null,null," (865) 712-4018","(865) 995-0756","(865) 986-6426","1632 Pendleton Dr","Friendsville","TN",37737,null,true,false,false]
[null,20230426143233,{"$f":"ROW()","v":417},"CARRIERO DEAN","",null,"Lead",null,"","","","(216) 642-0000","(541) 357-5934","(541) 988-4309","6813 Great Oaks Pkwy","Independence","OH","44131","Cuyahoga County, OH",true,true,false]
[null,20230426143234,{"$f":"ROW()","v":418},"Jose M Carrillo","",null,"Lead",null,"jfccarrillo@yahoo.com","jfccarrillo@satx.rr.com","","(915) 591-0728","(915) 590-1659","(713) 808-9387","4655 W Washington St","Indianapolis","IN","46241","Cuyahoga County, OH",false,true,false]
[null,20230426143235,{"$f":"ROW()","v":419},"Carrolls Truck and Repair Inc","Jerry C Carroll, Christopher Carroll",null,"Lead",null,"ccarrol@comcast.net","truckdoc4sale@aol.com","","(205) 368-8009","(205) 790-5406","(205) 790-3090","977 BIBBVILLE RD","WOODSTOCK","AL","35188","Bibb County, AL",false,true,false]
[null,20230426143236,{"$f":"ROW()","v":420},"Carter Convenience Group LLC","David Carter",null,"Lead",null,"davidcarter417@yahoo.com","","","(804) 787-0308","(412) 829-0937","(412) 896-5252","374 Laredo Drive","Hoover","Al","35226","Jefferson County, AL",false,true,false]
[null,20230426143237,{"$f":"ROW()","v":421},"Cary E Fechter","",null,"Lead",null,"","","","(843) 224-0442","(843) 763-8555","(843) 556-3802","7786 Discovery Rd","North Charleston","SC","29420","Charleston County, SC",true,true,false]
[null,20230426143238,{"$f":"ROW()","v":422},"Catherine C Fasano","",null,"Lead",null,"cathyfas@gmail.com","","","(973) 945-0565","(732) 667-5016","(973) 334-5919","10 Wallkill Rd","Sparta","NJ","07871","Sussex County, NJ",false,true,false]
[null,20230426143239,{"$f":"ROW()","v":423},"Catherine Denewitt","",null,"Lead",null,"cdenewitt@gmail.com","","","(513) 791-8818","(513) 385-9308","(513) 996-3038","4146 Lansdowne Ave","Cincinnati","OH","45236","Hamilton County, OH",false,true,false]
[null,20230426143240,{"$f":"ROW()","v":424},"Kathleen M Caulkins ","",null,"Lead",null,"kcaulkins@address.com","kmcaulkins@yahoo.com","","(603) 595-1552","(508) 842-7521","(508) 320-2279","2004 Shadowood Ct","Hoover","AL","35244\r\n","Jefferson County, AL",false,true,false]
[null,20230426143241,{"$f":"ROW()","v":425},"Robert M Caulkins","",null,"Lead",null,"ffaelan@hotmail.com","rcaulkins@yahoo.com","","(603) 595-1552","(915) 626-5614",null,"2004 Shadowood Ct","Hoover","AL","35244","Jefferson County, AL",false,true,false]
[null,20230426143242,{"$f":"ROW()","v":426},"CC Inc","Donald Ray Gibson ",null,"Lead",null,"rolltyde760@gmail.com","netwrk619sd@yahoo.com","ssimpson@webtv.net","(205) 742-8264","(205) 372-2898","(760) 534-3947","1066 Lassiter Rd","Silas","AL","36919","Mobile County, AL",false,true,false]
[null,20230426143243,{"$f":"ROW()","v":427},"CCCs LLC","Calvin Whitfield",null,"Lead",null,"","","","(843) 200-5224","(832) 707-1651","(313) 245-1807","102 Graduate Ln","Ladson","Sc","29456","Charleston County, SC",true,true,false]
[null,20230426143244,{"$f":"ROW()","v":428},"CEC DRYWALL LLC","Erika J Turner",null,"Lead",null,"cecdrywall@hotmail.com","urbizoe@yahoo.com","","(205) 821-2154","(205) 841-0786","(205) 502-7567","1240 Waverly St","Birmingham","AL","35217","Jefferson County, AL",false,true,false]
[null,20230426143245,{"$f":"ROW()","v":429},"Cecil M Springer ",null,null,"Lead","MailList3","onestudioc@live.com",null,null,"(248) 917-4355","(248) 262-1320","(248) 842-8935","18234 Oak Dr","Detroit","MI",48221,"Wayne County, MI",false,false,false]
[null,20230426143246,{"$f":"ROW()","v":430},"Cedric Ward","",null,"Lead",null,"toniward_85@hotmail.com","antoinetteward@angelfire.com","jpatchison1@earthlink.net","(678) 704-9737","(770) 471-6446","(678) 422-7177","6522 Katie Ln","Morrow","GA","30260","Rockdale County, GA",false,true,false]
[null,20230426143247,{"$f":"ROW()","v":431},"Celeste Solomon ",null,null,"Lead","MailList3","solomon_celeste@yahoo.com","calvinsolomon88@gmail.com","calvin-james@blackplanet.com","(734) 469-1695","(313) 467-4634","(313) 836-1384","8049 Fremont St","Westland","MI",48185,null,false,false,false]
[null,20230426143249,{"$f":"ROW()","v":432},"Center For Prosthetics Inc","Russell Keith Riley",null,"Lead","MailList3","keith8824@aol.com","moneytrain1985@gmail.com","riley312@aol.com","(803) 926-9020","(803) 600-6961","(803) 754-9863","811 Sunset Blvd","West Columbia","SC",29169,"Lexington County, SC",false,false,false]
[null,20230426143250,{"$f":"ROW()","v":433},"Westcoast Center ","Phyllis A Chester, Ray Chester",null,"Lead",null,"repdock@hotmail.com","","","(941) 587-3651","(941) 356-3005","(941) 587-0477","1104 North Martin Luther King Jr Ave","Clearwater","Fl","33755","Pinellas County, FL",false,true,false]
[null,20230426143251,{"$f":"ROW()","v":434},"Cerseal R Johnson","",null,"Lead",null,"cerseal2003@yahoo.com","thickgul1979@gmail.com","sharda171986@yahoo.com","(334) 349-2702","(334) 875-9751","(334) 872-4299","2000 Church St","Selma","AL","36701","Dallas County, AL",false,true,false]
[null,20230426143252,{"$f":"ROW()","v":435},"Cg Services Corporation","Cindy R Johnson ","","Lead","MailList3","mrmagic101@comcast.net","amjohnson865@gmail.com","cindy_r_johnson@whirlpool.com","(865) 482-6091","(865) 272-3796","(865) 242-6217","102 Trenton Dr","Oak Ridge","TN",37830,null,false,false,false]
[null,20230426143253,{"$f":"ROW()","v":436},"CHA Holdings Inc",null,null,"Lead",null,null,null,null,null,null,null,null,null,null,null,"Albany County, NY",true,true,true]
[null,20230426143254,{"$f":"ROW()","v":437},"Chandra Kyles","",null,"Lead",null,"kylesimports@att.net","chankyles@gmail.com","donnawhite7@aol.com","(251) 472-7121","(251) 604-5462","(251) 340-6348","6136 Overlook Rd","Mobile","AL","36618","Mobile County, AL",false,true,false]
[null,20230426143255,{"$f":"ROW()","v":438},"Parks African Methodist Episcopal Chapel","",null,"Lead",null,"","","",null,null,null,"1110 Montana Street","Dothan","AL","36303","Houston County, AL",true,true,false]
[null,20230426143256,{"$f":"ROW()","v":439},"Charles A Davenport","",null,"Lead",null,"tiny4742@hotmail.com","gshoho@aol.com","davenportcharles@bellsouth.com","(931) 637-2461","(480) 226-6198","(931) 762-9835","1501 Wiles Ln","Lewisburg","TN","37091","Pinellas County, FL",false,true,false]
[null,20230426143257,{"$f":"ROW()","v":440},"Charles B and Mary E Nussbaum","","1040 1 2 /3 1 / 20 1 9 xxx -x.x -- 11/0 8/2021 12/08/2031 30817.96","Lead","MailList3","acd3dad@yahoo.com","charlesnussbu@live.com",null,"(865) 777-4127","(865) 777-4128","(865) 406-0810","4525 Chota Hls","Louisville","TN",37777,null,false,false,false]
[null,20230426143258,{"$f":"ROW()","v":441},"Charles Crane","",null,"Lead",null,"chcrane@aol.com","chcrane@geocities.com","annacrane@comcast.net","(313) 823-1997","(313) 823-8883","(313) 909-0106","772 Whittier Rd","Grosse Pointe Park","MI","48230","Oakland County, MI",false,true,false]
[null,20230426143259,{"$f":"ROW()","v":442},"Charles E Hammond","",null,"Lead","MailList3","chammond@gmail.com","jirish7@msn.com","hammondtransportation@yahoo.com","(424) 731-2146","(901) 370-6551","(901) 649-1834","6874 Kirby Brooks Dr","Memphis","TN",38115,null,false,false,false]
[null,20230426143260,{"$f":"ROW()","v":443},"Charles Ferrell","",null,"Lead",null,"h25157@aol.com","admin@onewebhosting.com","hummer5157@aol.com","(248) 535-6650","(248) 363-3722","(256) 787-8903","3291 Oakleaf Dr","West Bloomfield","MI","48324","Oakland County, MI",false,true,false]
[null,20230426143261,{"$f":"ROW()","v":444},"Charles Holley ",null,null,"Lead","MailList3","howardknn@hotmail.com","char510hwd@gmail.com",null,"(773) 354-1874","(773) 638-5927","(773) 826-0695","1626 Estate Cir","Naperville","IL",60565,"Cook County, IL",false,false,false]
[null,20230426143262,{"$f":"ROW()","v":445},"Charles Hwang","",null,"Lead",null,"ybcharles.hwang49@juno.com","h.charles@fidelityproperties.net","global@commercialworldwide.com","(407) 226-2288","(407) 226-1555","(407) 257-2610","8635 Commodity Cir #100","Orlando","FL","32819","Volusia County, FL",false,true,false]
[null,20230426143263,{"$f":"ROW()","v":446},"Charles Isham","",null,"Lead",null,"","","","(404) 543-5859","(770) 684-4777","(706) 405-9385","148 Cason Rd","Cedartown","GA","30125","Cobb County, GA",true,true,false]
[null,20230426143264,{"$f":"ROW()","v":447},"Charles J Fare","",null,"Lead",null,"charlesfare123@gmail.com","","","(810) 610-8557","(810) 252-3658","(810) 288-2773","1206 Bel Air Dr","Flint","MI","48507","Genesee County, MI",false,true,false]
[null,20230426143265,{"$f":"ROW()","v":448},"Charles P Nutley ",null,null,"Lead","MailList3","charlesnutley@yahoo.com","shadyshade@adelphia.com",null,"(630) 853-0475","(630) 422-7423","(630) 766-7166","2554 Briar Trl #205","Schaumburg","IL",60173,"Cook County, IL",false,false,false]
[null,20230426143266,{"$f":"ROW()","v":449},"Charles R Porter ",null,null,"Lead","MailList3","brian.kucha1@ccity.com","karen.porter@gmail.com",null,"(618) 931-5392","(618) 910-3890","(618) 521-1239","4833 Danielle Ct","Granite City","IL",62040,"Cook County, IL",false,false,false]
[null,20230426143268,{"$f":"ROW()","v":450},"Charleston Ship Inc","Leonard R Cannon",null,"Lead",null,"rcannon@megadock.us","","","(843) 870-0058","(843) 886-0984","(843) 849-6142","700 Deauville Dr","Punta Gorda","FL","33950","Charleston County, SC",false,true,false]
[null,20230426143270,{"$f":"ROW()","v":451},"Charlie E Aiken III ","",null,"Lead",null,"chink4tg@yahoo.com","joeannaiken@yahoo.com","","(843) 875-4304","(843) 261-0611","(843) 873-1701","313 Forest Cir","Summerville","SC","29483","Charleston County, SC",false,true,false]
[null,20230426143272,{"$f":"ROW()","v":452},"Charlie E Aiken III","",null,"Lead",null,null,null,null,null,null,null,"300 Holly Hills Road Apt 204","Columbus","MS","39705","",true,true,false]
[null,20230426143273,{"$f":"ROW()","v":453},"Charolette Morrison","","","Lead","MailList3","unamujer519@aol.com",null,null,"(631) 605-1052","(631) 874-0647","(631) 281-4101","12 Briana Court","East Moriches","Ny",11940,null,false,false,false]
[null,20230426143274,{"$f":"ROW()","v":454},"Chase C Dearman","",null,"Lead",null,"","","","(251) 648-7997","(251) 648-1281","(601) 853-8829","181 Nutmeg Rd","Canton","MS","39046","Mobile County, AL",true,true,false]
[null,20230426143275,{"$f":"ROW()","v":455},"Chanetta L Chavers","",null,"Lead",null,"cnenechavers@yahoo.com","jchaversppm@bellsouth.net","","(205) 925-1252","(205) 426-3224","(205) 780-9088","PO Box 28074","Birmingham","AL","35228","Jefferson County, AL",false,true,false]
[null,20230426143276,{"$f":"ROW()","v":456},"Danielle Cheeks ","",null,"Lead",null,"","","","(614) 330-6119","(614) 837-1983","(614) 604-9721","6357 Upperridge Dr","Canal Winchester","OH","43110","Franklin County, OH",true,true,false]
[null,20230426143277,{"$f":"ROW()","v":457},"Henry Cheeks Jr","",null,"Lead",null,"cheekshen55@gmail.com","kocheekshjm21@yahoo.com","ulcheekshjm95@yahoo.com","(614) 316-3263","(614) 530-3679","(614) 986-7248","6357 Upperridge Dr","Canal Winchester","OH","43110","Franklin County, OH",false,true,false]
[null,20230426143278,{"$f":"ROW()","v":458},"Cody Cheesebrough","",null,"Lead",null,"","","","(304) 371-3022","(304) 842-8362",null,"524 Louise Ave","Morgantown","WV","26505","Monongalia County, VA",true,true,false]
[null,20230426143279,{"$f":"ROW()","v":459},"Chef Ron Catering Services","Ronald Cook",null,"Lead",null,"chefron1@live.com","","","(205) 966-1337","(205) 428-5508","(205) 481-5653","4423 Buttercup Lane","Bessemer","AL","35022","Jefferson County, AL",false,true,false]
[null,20230426143280,{"$f":"ROW()","v":460},"Chepri Llc","Peter Alivartes",null,"Lead",null,"shortcake9@hotmail.com","","","(614) 307-1496","(614) 447-1199","(614) 291-4976","3250 W Market St Ste 205","Fairlawn","Oh","44333","Franklin County, OH",false,true,false]
[null,20230426143281,{"$f":"ROW()","v":461},"Cherry F Dudley ",null,null,"Lead","MailList3","cherryalwaysbless@gmail.com",null,null,"(313) 875-4677","(313) 931-0091","(313) 790-2343","1463 Virginia Park St","Detroit","MI",48206,null,false,false,false]
[null,20230426143282,{"$f":"ROW()","v":462},"Cheryl A Landis","",null,"Lead",null,"watermark1350@att.net","watermark@adelphia.net","cheryl.landis@dell.com","(814) 868-9989","(321) 383-8636","(513) 376-6308","4661 Nader Ln","Titusville","FL","32780","Brevard County, FL",false,true,false]
[null,20230426143283,{"$f":"ROW()","v":463},"Cheryl Estilo ",null,null,"Lead","MailList3","cheryl@estilo.net",null,null,"(708) 425-5185","(773) 586-4695","(708) 297-1707","9231 Pembrooke Ln","Orland Park","IL",60462,"Cook County, IL",false,false,false]
[null,20230426143284,{"$f":"ROW()","v":464},"Cheryl S James","",null,"Lead",null,"nystasia@hotmail.com","akirianian@adelphia.net","dontaskcj@lycos.com","(248) 361-5596","(248) 361-5590","(301) 465-8506","29939 Flushing Dr","Chesterfield","MI","48051","Macomb County, MI",false,true,false]
[null,20230426143285,{"$f":"ROW()","v":465},"Chester Rivers","",null,"Lead",null,"","","","(251) 944-8783","(251) 944-8286",null,"80 Mowa Ave","Mc Intosh","AL","36553","Mobile County, AL",true,true,false]
[null,20230426143286,{"$f":"ROW()","v":466},"Chimaera Group LLC","Sean Hodges",null,"Lead",null,"ginnycairo@gmail.com","seanahodges@yahoo.com","","(404) 394-9890","(404) 629-0348","(678) 574-0386","1318 Fallsbrook Terrace","Acworth","GA","30101","Cobb County, GA",false,true,false]
[null,20230426143287,{"$f":"ROW()","v":467},"China Dragon FW Inc","Fang Wang",null,"Lead",null,"","","","(216) 551-8782","(440) 232-5911","(513) 293-4803","87 B Northfield Rd","Bedford","Oh","44056","Cuyahoga County, OH",true,true,false]
[null,20230426143288,{"$f":"ROW()","v":468},"Christiaan D Mealey","",null,"Lead",null,"chris.mealey@gmail.com","","","(404) 969-2501","(470) 233-9827","(843) 303-3685","3378 Lansbury Village Dr #6","Atlanta","GA","30341","Charleston County, SC",false,true,false]
[null,20230426143289,{"$f":"ROW()","v":469},"Christian A Coloma","",null,"Lead",null,"christiancoloma@hotmail.com","deniscolon@aol.com","","(305) 496-4725","(305) 538-0558","(305) 538-0874","90 Alton Rd #2108","Miami Beach","FL","33139","Broward County, FL",false,true,false]
[null,20230426143290,{"$f":"ROW()","v":470},"Christian Tour Co LLC","",null,"Lead",null,"","","","(216) 751-8183",null,null,"21625 Chagrin Blvd UNIT 210","Cleveland","OH","44122","Cuyahoga County, OH",true,true,false]
[null,20230426143291,{"$f":"ROW()","v":471},"Christie Coursey","",null,"Lead",null,"","","","(404) 454-9715","(404) 275-7151","(770) 537-0170","1077 Angel Ln","Powder Springs","GA","30127","Cobb County, GA",true,true,false]
[null,20230426143292,{"$f":"ROW()","v":472},"Christien B Louviere","",null,"Lead",null,"chloelovari@aol.com","connexxions@gmail.com","nogent1@aol.com","(678) 862-5554","(225) 767-3082","(770) 432-4139","4559 Gateway Ct SE","Smyrna","GA","30080","Cobb County, GA",false,true,false]
[null,20230426143293,{"$f":"ROW()","v":473},"Christine A Duffy ",null,null,"Lead","MailList3","jonathan.levy@earthlink.net",null,null,"(847) 424-9445","(773) 848-1219","(847) 424-0453","1705 Brummel St","Evanston","IL",60202,"Cook County, IL",false,false,false]
[null,20230426143294,{"$f":"ROW()","v":474},"Christine Hulsman","",null,"Lead",null,"t_hulsman@msn.com","","","(973) 770-1724","(973) 219-3963","(973) 770-2764","20 Milton Ave","Stanhope","NJ","07874","Sussex County, NJ",false,true,false]
[null,20230426143295,{"$f":"ROW()","v":475},"Christoph Company Inc",null,null,"Lead",null,null,null,null,null,null,null,null,null,null,null,"Charleston County, SC",true,true,true]
[null,20230426143296,{"$f":"ROW()","v":476},"Christopher B Steinmetz ",null,null,"Lead","MailList3","chris@stonecutterrecords.com",null,null,"(312) 451-7576","(312) 644-7576","(312) 644-3992","1000 W Cullerton St","Chicago","IL",60608,"Cook County, IL",false,false,false]
[null,20230426143297,{"$f":"ROW()","v":477},"Christopher Cardasis ",null,null,"Lead","MailList3","ccardasis@twmi.rr.com",null,null,"(248) 231-9760","(248) 477-4851","(734) 427-8455","29854 Bobrich St","Livonia","MI",48152,null,false,false,false]
[null,20230426143298,{"$f":"ROW()","v":478},"Christopher D Crabtree ",null,null,"Lead","MailList3","csdlcv@hotmail.com",null,null,"(586) 202-0264","(248) 740-7694","(248) 740-2737","91820 County Road 652","Marcellus","MI",49067,"Wayne County, MI",false,false,false]
[null,20230426143299,{"$f":"ROW()","v":479},"Christopher Garner ",null,null,"Lead","MailList3","mommy_102605@yahoo.com","teejay2442@yahoo.com","dna92966@gmail.com","(224) 730-0843","(847) 746-5509","(847) 246-3107","2301 Emmaus Ave","Zion","IL",60099,"Cook County, IL",false,false,false]
[null,20230426143300,{"$f":"ROW()","v":480},"Christopher H King ",null,null,"Lead","MailList3","christopherking@netscape.net","seak@iquest.net",null,"(317) 714-1238","(219) 884-6345","(317) 293-8549","1230 N Elmwood Ave","Oak Park","IL",60302,"Cook County, IL",false,false,false]
[null,20230426143301,{"$f":"ROW()","v":481},"Christopher Hall ",null,null,"Lead",null,null,null,null,null,null,null,null,null,null,null,"Volusia County, FL",true,true,true]
[null,20230426143302,{"$f":"ROW()","v":482},"Christopher Hulsman ",null,null,"Lead",null,null,null,null,null,null,null,null,null,null,null,"Sussex County, NJ",true,true,true]
[null,20230426143303,{"$f":"ROW()","v":483},"Christopher J Blanco ",null,null,"Lead",null,null,null,null,null,null,null,null,null,null,null,"Miami-Dade County, FL",true,true,true]
[null,20230426143305,{"$f":"ROW()","v":484},"Christopher J Cammarata ",null,null,"Lead",null,null,null,null,null,null,null,null,null,null,null,"Pinellas County, FL",true,true,true]
[null,20230426143306,{"$f":"ROW()","v":485},"Christopher J Flechler ",null,null,"Lead","MailList3","flechlerchris@gmail.com","cjef2349@gmail.com","cjef2349@gmail.com","(502) 449-9022","(502) 618-3617","(502) 708-7980"," 2400 Magazine St Apt 1| Ky"," Ky",null,null,"Jefferson County, KY",false,false,false]
[null,20230426143307,{"$f":"ROW()","v":486},"Christopher Jr Smith ",null,null,"Lead",null,null,null,null,null,null,null,null,null,null,null,"Charleston County, SC",true,true,true]
[null,20230426143308,{"$f":"ROW()","v":487},"Christopher M Cosley ",null,null,"Lead","MailList3","cosleylaw@msn.com",null,null,"(847) 809-0625","(847) 394-3200","(847) 398-2234","3400 Wellington Ct #309","Rolling Meadows","IL",60008,"Cook County, IL",false,false,false]
[null,20230426143309,{"$f":"ROW()","v":488},"Christopher M Jossell ",null,null,"Lead",null,null,null,null,"(773) 629-6038","(773) 445-5130","(312) 731-5444","1418 Westchester Blvd","Westchester","IL",60154,"Cook County, IL",true,false,false]
[null,20230426143310,{"$f":"ROW()","v":489},"Christopher M Tolbert ",null,null,"Lead",null,null,null,null,null,null,null,null,null,null,null,"Brevard County, FL",true,true,true]
[null,20230426143311,{"$f":"ROW()","v":490},"Christopher M Young ",null,null,"Lead",null,null,null,null,null,null,null,null,null,null,null,"Broward County, FL",true,true,true]
[null,20230426143312,{"$f":"ROW()","v":491},"Christopher Pappan ",null,null,"Lead",null,null,null,null,null,null,null,null,null,null,null,"Sussex County, NJ",true,true,true]
[null,20230426143313,{"$f":"ROW()","v":492},"CHRISTOPHER REX WATWOOD LLC",null,null,"Lead",null,null,null,null,null,null,null,null,null,null,null,"Jefferson County, AL",true,true,true]
[null,20230426143314,{"$f":"ROW()","v":493},"Christopher S Datri ",null,null,"Lead","MailList3","motoboy543@yahoo.com",null,null,"(815) 370-0502","(815) 530-6289","(773) 485-4245","1260 S Elmhurst Rd #208","Mount Prospect","IL",60056,"Cook County, IL",false,false,false]
[null,20230426143315,{"$f":"ROW()","v":494},"Christopher Woods","","","Lead","MailList3","wdn6woog46@aol.com","dn6woo@aol.com","cswoods73@yahoo.com","(901) 365-3619","(901) 346-2959","(901) 361-8298","860 Pendleton St","Memphis","TN",38114,null,false,false,false]
[null,20230426143316,{"$f":"ROW()","v":495},"Christy M Glass ",null,null,"Lead",null,null,null,null,null,null,null,null,null,null,null,"Charleston County, SC",true,true,true]
[null,20230426143317,{"$f":"ROW()","v":496},"Church Of God Of Holiness Of Christ Inc",null,null,"Lead",null,null,null,null,null,null,null,null,null,null,null,"Miami-Dade County, FL",true,true,true]
[null,20230426143319,{"$f":"ROW()","v":497},"Cierra Petties ",null,null,"Lead","MailList3","cierrapetties@yahoo.com",null,null,"(269) 348-6709","(269) 779-0682","(269) 779-8561","24317 Pine Grove Ct","Farmington Hills","MI",48335,null,false,false,false]
[null,20230426143320,{"$f":"ROW()","v":498},"Citi Property Management Firm\r\n","Don Lilly",null,"Lead","MailList3","don_lilly@att.net","bokamash91@gmail.com",null,"(734) 377-9578","(734) 953-1635","(586) 790-6675","30710 Parkwood St","Westland","MI",48186,null,false,false,false]
[null,20230426143321,{"$f":"ROW()","v":499},"CJ CONVENIENCE INC",null,null,"Lead",null,null,null,null,null,null,null,null,null,null,null,"Stark County, OH",true,true,true]
[null,20230426143322,{"$f":"ROW()","v":500},"Cladd Healthcare LLC",null,null,"Lead",null,null,null,null,null,null,null,null,null,null,null,"Miami-Dade County, FL",true,true,true]
[null,20230426143324,{"$f":"ROW()","v":501},"Clarence H Jeck ",null,null,"Lead",null,null,null,null,null,null,null,null,null,null,null,"Broward County, FL",true,true,true]
[null,20230426143325,{"$f":"ROW()","v":502},"Clarence L Thomas ",null,null,"Lead","MailList3","xocthomas@aol.com",null,null,"(773) 343-4286","(773) 471-4380","(773) 490-4096","8040 S Trumbull Ave","Chicago","IL",60652,"Cook County, IL",false,false,false]
[null,20230426143326,{"$f":"ROW()","v":503},"CLARKSON PHILLIP E",null,null,"Lead",null,null,null,null,null,null,null,null,null,null,null,"Rankin County, MS",true,true,true]
[null,20230426143327,{"$f":"ROW()","v":504},"Claudia Criollo",null,null,"Lead",null,null,null,null,"(773) 977-9113","(773) 385-6731","(773) 385-6733","5221 W Schubert Ave","Chicago","IL",60639,"Cook County, IL",true,false,false]
[null,20230426143328,{"$f":"ROW()","v":505},"Claudia Criollo ",null,null,"Lead",null,null,null,null,"(773) 385-6731",null,null,"537 N Springfield Ave","Chicago","IL",60624,"Cook County, IL",true,false,false]
[null,20230426143329,{"$f":"ROW()","v":506},"Clay H Dalton","","30 2016/17/18/19 - $86,465.09","Lead","MailList3","daltonc@alltell.net","claydalton01@comcast.net",null,"(770) 815-5451","(770) 479-1143","(217) 454-1071","105 Oakwind Pkwy","Canton","GA",30114,null,false,false,false]
[null,20230426143330,{"$f":"ROW()","v":507},"CLEARY, EMMETT P",null,null,"Lead",null,null,null,null,null,null,null,null,null,null,null,"Loraine County, OH",true,true,true]
[null,20230426143331,{"$f":"ROW()","v":508},"Clint J Kern ",null,null,"Lead",null,null,null,null,null,null,null,null,null,null,null,"Charleston County, SC",true,true,true]
[null,20230426143332,{"$f":"ROW()","v":509},"Clint O Glenn ",null,null,"Lead",null,null,null,null,null,null,null,null,null,null,null,"Broward County, FL",true,true,true]
[null,20230426143333,{"$f":"ROW()","v":510},"Clinton T Thomas ",null,null,"Lead",null,null,null,null,null,null,null,null,null,null,null,"Oakland County, MI",true,true,true]
[null,20230426143334,{"$f":"ROW()","v":511},"Club Ethio Llc",null,null,"Lead",null,null,null,null,null,null,null,null,null,null,null,"Franklin County, OH",true,true,true]
[null,20230426143335,{"$f":"ROW()","v":512},"Clyde Schap ",null,null,"Lead","MailList3","clydschap@aol.com",null,null,"(773) 763-5449","(847) 763-5449","(864) 719-0316","6215 N Leroy Ave","Chicago","IL",60646,"Cook County, IL",false,false,false]
[null,20230426143336,{"$f":"ROW()","v":513},"COAST CYCLES INC",null,null,"Lead",null,null,null,null,null,null,null,null,null,null,null,"Harrison County, MS",true,true,true]
[null,20230426143337,{"$f":"ROW()","v":514},"Coastal Sports Cards LLC",null,null,"Lead",null,null,null,null,null,null,null,null,null,null,null,"Horry County, SC",true,true,true]
[null,20230426143338,{"$f":"ROW()","v":515},"COLEMAN MARK A",null,null,"Lead",null,null,null,null,null,null,null,null,null,null,null,"Jefferson County, AL",true,true,true]
[null,20230426143339,{"$f":"ROW()","v":516},"COLEMAN VALORIA",null,null,"Lead",null,null,null,null,null,null,null,null,null,null,null,"Jefferson County, AL",true,true,true]
[null,20230426143340,{"$f":"ROW()","v":517},"Colonial Cleaners LLC",null,null,"Lead",null,null,null,null,null,null,null,null,null,null,null,"Albany County, NY",true,true,true]
[null,20230426143341,{"$f":"ROW()","v":518},"COMMUNITY LINKAGE SERVICES OF OHIO",null,null,"Lead",null,null,null,null,null,null,null,null,null,null,null,"Lucas County, OH",true,true,true]
[null,20230426143342,{"$f":"ROW()","v":519},"Compassion Care Center Planet Wellness System Llc",null,null,"Lead",null,null,null,null,null,null,null,null,null,null,null,"Franklin County, OH",true,true,true]
[null,20230426143343,{"$f":"ROW()","v":520},"COMPLETE AIR SERVICE INC",null,null,"Lead",null,null,null,null,null,null,null,null,null,null,null,"Hamilton County, OH",true,true,true]
[null,20230426143344,{"$f":"ROW()","v":521},"Complete Comfort Llc","",null,"Lead","MailList3","Completecomfortllc@gmail.com",null,null,"(502) 494-2289",null,null," 3131 S 2nd Str Ste 211 ","Louisville","KY",40208,null,false,false,false]
[null,20230426143345,{"$f":"ROW()","v":522},"Complete Edi Solutions",null,null,"Lead",null,null,null,null,null,null,null,null,null,null,null,"Charleston County, SC",true,true,true]
[null,20230426143346,{"$f":"ROW()","v":523},"Comprehensive Industrial Services, Inc.","Kevin Bishop","","Lead","MailList3","kevinbishop@gmail.com",null,null,"(865) 693-5914","(423) 562-7587","(520) 444-1565","13 The Cors","Aiken","SC",29803,null,false,false,false]
[null,20230426143347,{"$f":"ROW()","v":524},"Compustation","James Scaffe",null,"Lead","MailList3","james@scaffe.com","r.scaffe@gmail.com",null,"(803) 446-6977","(803) 358-2385","(803) 755-9414","104 Pine Tree Dr","Lexington","SC",29073,"Lexington County, SC",false,false,false]
[null,20230426143348,{"$f":"ROW()","v":525},"Concepts Landscape and Design Total ",null,null,"Lead",null,null,null,null,null,null,null,null,null,null,null,"Sussex County, NJ",true,true,true]
[null,20230426143349,{"$f":"ROW()","v":526},"Confection Connection Llc","Heitzman Bakery",null,"Lead",null,null,null,null,"(920) 296-7725",null,null,"3333 Bardstown Rd Ste 1","Louisville","y,","40218","Jefferson County, KY",true,false,false]
[null,20230426143350,{"$f":"ROW()","v":527},"Conrad L Mallett Jr",null,null,"Lead","MailList3","clmallett@dmc.org","c.mallett@dmc.org",null,"(313) 316-2736","(313) 334-5776","(248) 552-0917","1370 Wellesley Dr","Detroit","MI",48203,null,false,false,false]
[null,20230426143351,{"$f":"ROW()","v":528},"CONSTELLATION HOLDINGS LTD",null,null,"Lead",null,null,null,null,null,null,null,null,null,null,null,"Summit County, OH",true,true,true]
[null,20230426143352,{"$f":"ROW()","v":529},"Consuelo I Posso ",null,null,"Lead","MailList3","antposso@gmail.com","possoconnie@yahoo.com","cposso@horwitzlaw.com","(773) 849-2793","(773) 417-4214","(773) 413-7650","2741 N Newcastle Ave","Chicago","IL",60707,"Cook County, IL",false,false,false]
[null,20230426143353,{"$f":"ROW()","v":530},"CONWAY, CRYSTAL",null,null,"Lead",null,null,null,null,null,null,null,null,null,null,null,"Summit County, OH",true,true,true]
[null,20230426143354,{"$f":"ROW()","v":531},"Cook County Black Chamber Of Commerce Corp",null,null,"Lead",null,null,null,null,"312.794.7765",null,null,"4222 W. Madison Street Unit 241058 ","Chicago  ","Il",60624,"Cook County, IL",true,false,false]
[null,20230426143355,{"$f":"ROW()","v":532},"COOK RONALD",null,null,"Lead",null,null,null,null,null,null,null,null,null,null,null,"Jefferson County, AL",true,true,true]
[null,20230426143356,{"$f":"ROW()","v":533},"COOPER, LARRY A",null,null,"Lead",null,null,null,null,null,null,null,null,null,null,null,"Loraine County, OH",true,true,true]
[null,20230426143357,{"$f":"ROW()","v":534},"Corazon Country Club Llc",null,null,"Lead",null,null,null,null,null,null,null,null,null,null,null,"Franklin County, OH",true,true,true]
[null,20230426143358,{"$f":"ROW()","v":535},"Cordero Ortega Luis",null,null,"Lead",null,null,null,null,null,null,null,null,null,null,null,"Franklin County, OH",true,true,true]
[null,20230426143359,{"$f":"ROW()","v":536},"Core It Solutions Grp Inc","Carol Iguchi",null,"Lead","MailList3","cciguchi5@cs.com","ciguchiw5@cs.com","ouciguchi61@cs.com","(847) 660-9346","(847) 670-3494","(630) 564-4200","10158 W 142nd Pl","Cedar Lake","IN",46303,"Cook County, IL",false,false,false]
[null,20230426143360,{"$f":"ROW()","v":537},"CORE LOGISTICAL SOLUTIONS LLC",null,null,"Lead",null,null,null,null,null,null,null,null,null,null,null,"Harrison County, MS",true,true,true]
[null,20230426143361,{"$f":"ROW()","v":538},"COREY CANDACE M ",null,null,"Lead",null,null,null,null,null,null,null,null,null,null,null,"Montgomery County, OH",true,true,true]
[null,20230426143362,{"$f":"ROW()","v":539},"COREY WAYNE E ",null,null,"Lead",null,null,null,null,null,null,null,null,null,null,null,"Montgomery County, OH",true,true,true]
[null,20230426143363,{"$f":"ROW()","v":540},"Corklico LLC",null,null,"Lead",null,null,null,null,null,null,null,null,null,null,null,"Pinellas County, FL",true,true,true]
[null,20230426143364,{"$f":"ROW()","v":541},"Cornerstone Supported Living",null,null,"Lead",null,null,null,null,null,null,null,null,null,null,null,"Franklin County, OH",true,true,true]
[null,20230426143365,{"$f":"ROW()","v":542},"Corporation Buzzazz ",null,null,"Lead",null,null,null,null,null,null,null,null,null,null,null,"Pinellas County, FL",true,true,true]
[null,20230426143366,{"$f":"ROW()","v":543},"CORTES ISRAEL",null,null,"Lead",null,null,null,null,null,null,null,null,null,null,null,"Cuyahoga County, OH",true,true,true]
[null,20230426143367,{"$f":"ROW()","v":544},"COTTINGHAM D",null,null,"Lead",null,null,null,null,null,null,null,null,null,null,null,"Jefferson County, AL",true,true,true]
[null,20230426143368,{"$f":"ROW()","v":545},"COTTLE SHAWN F",null,null,"Lead",null,null,null,null,null,null,null,null,null,null,null,"Stark County, OH",true,true,true]
[null,20230426143369,{"$f":"ROW()","v":546},"Coulter James T",null,null,"Lead",null,null,null,null,null,null,null,null,null,null,null,"Franklin County, OH",true,true,true]
[null,20230426143370,{"$f":"ROW()","v":547},"COUNTRY LAWN CARE SERVICES INC",null,null,"Lead",null,null,null,null,null,null,null,null,null,null,null,"Loraine County, OH",true,true,true]
[null,20230426143371,{"$f":"ROW()","v":548},"COUNTRYSIDE CONSTRUCTION INC",null,null,"Lead",null,null,null,null,null,null,null,null,null,null,null,"Loraine County, OH",true,true,true]
[null,20230426143372,{"$f":"ROW()","v":549},"COUNTRYSIDE LIVING and ELDERLY HOME CARE LLC ",null,null,"Lead",null,null,null,null,null,null,null,null,null,null,null,"Montgomery County, OH",true,true,true]
[null,20230426143373,{"$f":"ROW()","v":550},"Cour Boyle Wisinski ",null,null,"Lead",null,null,null,null,null,null,null,null,null,null,null,"Sussex County, NJ",true,true,true]
[null,20230426143374,{"$f":"ROW()","v":551},"Cour Boyle-Wisinski ",null,null,"Lead",null,null,null,null,null,null,null,null,null,null,null,"Sussex County, NJ",true,true,true]
[null,20230426143375,{"$f":"ROW()","v":552},"Coutchard A Point Du Jr Jour ",null,null,"Lead",null,null,null,null,null,null,null,null,null,null,null,"Broward County, FL",true,true,true]
[null,20230426143376,{"$f":"ROW()","v":553},"Craftmaster Plastering and Stucco, Llc","Rasheem Kincey",null,"Lead",null,null,null,null,"(334) 360-1376","(334) 393-1069","(334) 477-9843","129 Nann St","Enterprise","AL",36330,null,true,false,false]
[null,20230426143377,{"$f":"ROW()","v":554},"Craig Jon Nalls",null,null,"Lead","MailList3","cocoaloungeboy@yahoo.com","cnalls01@gmail.com","nallsc01@yahoo.com","(312) 451-5296","(312) 451-9383","(773) 930-4378","3852 N Springfield Ave","Chicago","IL",60618,"Cook County, IL",false,false,false]
[null,20230426143378,{"$f":"ROW()","v":555},"Craig T Fritz ",null,null,"Lead",null,null,null,null,null,null,null,null,null,null,null,"Broward County, FL",true,true,true]
[null,20230426143379,{"$f":"ROW()","v":556},"CREATIVE CONNECTIONS LLC",null,null,"Lead",null,null,null,null,null,null,null,null,null,null,null,"Hamilton County, OH",true,true,true]
[null,20230426143380,{"$f":"ROW()","v":557},"Creative Spirits Networks Inc","Cassandra Harris-Gray",null,"Lead","MailList3","info@creativespiritsonline.com",null,null," 502-254-9555","(502) 529-1658 - personal","\n(502) 529-1003 - personal"," 12730 Townepark Way Ste 201",null,"KY",null,"Jefferson County, KY",false,false,false]
[null,20230426143381,{"$f":"ROW()","v":558},"CRISTALLO PAUL",null,null,"Lead",null,null,null,null,null,null,null,null,null,null,null,"Cuyahoga County, OH",true,true,true]
[null,20230426143382,{"$f":"ROW()","v":559},"CRISTALLO, PAUL",null,null,"Lead",null,null,null,null,null,null,null,null,null,null,null,"Summit County, OH",true,true,true]
[null,20230426143383,{"$f":"ROW()","v":560},"CRITES, DWAYNE A",null,null,"Lead",null,null,null,null,null,null,null,null,null,null,null,"Summit County, OH",true,true,true]
[null,20230426143384,{"$f":"ROW()","v":561},"CROPWELL SMALL ANIMAL HOSPITAL INC",null,null,"Lead",null,null,null,null,null,null,null,null,null,null,null,"Jefferson County, AL",true,true,true]
[null,20230426143385,{"$f":"ROW()","v":562},"CROUCH, BRANDY J",null,null,"Lead",null,null,null,null,null,null,null,null,null,null,null,"Summit County, OH",true,true,true]
[null,20230426143386,{"$f":"ROW()","v":563},"CRUMPTON BRENT L PC",null,null,"Lead",null,null,null,null,null,null,null,null,null,null,null,"Jefferson County, AL",true,true,true]
[null,20230426143387,{"$f":"ROW()","v":564},"Crystal D Cruce ",null,null,"Lead","MailList3","ccruce1@sbcglobal.net","jscully@vanstar.com","crystal.cruce@sbcglobal.net","(313) 815-1404","(586) 799-7595","(313) 499-6043","24602 Hopkins St","Dearborn Heights","MI",48125,null,false,false,false]
[null,20230426143388,{"$f":"ROW()","v":565},"CT2 INC",null,null,"Lead",null,null,null,null,null,null,null,null,null,null,null,"Hamilton County, OH",true,true,true]
[null,20230426143389,{"$f":"ROW()","v":566},"CULEY TIMOTHY S",null,null,"Lead",null,null,null,null,null,null,null,null,null,null,null,"Cuyahoga County, OH",true,true,true]
[null,20230426143390,{"$f":"ROW()","v":567},"CULL DANIEL B",null,null,"Lead",null,null,null,null,null,null,null,null,null,null,null,"Cuyahoga County, OH",true,true,true]
[null,20230426143391,{"$f":"ROW()","v":568},"CULLERS PAUL E ",null,null,"Lead",null,null,null,null,null,null,null,null,null,null,null,"Montgomery County, OH",true,true,true]
[null,20230426143392,{"$f":"ROW()","v":569},"Cummins Tina M",null,null,"Lead",null,null,null,null,null,null,null,null,null,null,null,"Franklin County, OH",true,true,true]
[null,20230426143393,{"$f":"ROW()","v":570},"CUNNINGHAM, SOLOMON R",null,null,"Lead",null,null,null,null,null,null,null,null,null,null,null,"Lucas County, OH",true,true,true]
[null,20230426143394,{"$f":"ROW()","v":571},"CURRY DWAYNE L",null,null,"Lead",null,null,null,null,null,null,null,null,null,null,null,"Cuyahoga County, OH",true,true,true]
[null,20230426143395,{"$f":"ROW()","v":572},"Curtis A Johnson","",null,"Lead","MailList3","johnsonman37@yahoo.com","johnson_renay@yahoo.com","jjwydick@gmail.com","(901) 288-0905","(901) 474-5804","(901) 785-2959","4590 Tulane Rd","Memphis","TN","38109-5945",null,false,false,false]
[null,20230426143396,{"$f":"ROW()","v":573},"Curtis Goodwin ",null,null,"Lead",null,null,null,null,null,null,null,null,null,null,null,"Genesee County, MI",true,true,true]
[null,20230426143397,{"$f":"ROW()","v":574},"CYBER-TEL COMMUNICATIONS",null,null,"Lead",null,null,null,null,null,null,null,null,null,null,null,"Harrison County, WV",true,true,true]
[null,20230426143398,{"$f":"ROW()","v":575},"D And C Transportation LLC",null,null,"Lead",null,null,null,null,null,null,null,null,null,null,null,"Muskegon County, MI",true,true,true]
[null,20230426143399,{"$f":"ROW()","v":576},"D Florence Green ",null,null,"Lead",null,null,null,null,null,null,null,null,null,null,null,"Miami-Dade County, FL",true,true,true]
[null,20230426143401,{"$f":"ROW()","v":577},"D L Ospina ",null,null,"Lead",null,null,null,null,null,null,null,null,null,null,null,"Volusia County, FL",true,true,true]
[null,20230426143402,{"$f":"ROW()","v":578},"D&K Healthcare Solutions LLC",null,null,"Lead",null,null,null,null,null,null,null,null,null,null,null,"Pinellas County, FL",true,true,true]
[null,20230426143403,{"$f":"ROW()","v":579},"Dan and Keith Pizza Inc",null,null,"Lead",null,null,null,null,null,null,null,null,null,null,null,"Macomb County, MI",true,true,true]
[null,20230426143404,{"$f":"ROW()","v":580},"Dan McFall ",null,null,"Lead","MailList3","dpmcfall@yahoo.com","bubba71574@comcast.com",null,"(248) 259-7867","(586) 759-6574","(248) 629-6600","54164 Sunderland Dr","Shelby Township","MI",48316,null,false,false,false]
[null,20230426143405,{"$f":"ROW()","v":581},"Dana Battle ",null,null,"Lead",null,null,null,null,null,null,null,null,null,null,null,"Pinellas County, FL",true,true,true]
[null,20230426143406,{"$f":"ROW()","v":582},"Dance Arts Studio LLC",null,null,"Lead",null,null,null,null,null,null,null,null,null,null,null,"Charleston County, SC",true,true,true]
[null,20230426143407,{"$f":"ROW()","v":583},"Dane A Palarino ",null,null,"Lead",null,null,null,null,null,null,null,null,null,null,null,"Charleston County, SC",true,true,true]
[null,20230426143408,{"$f":"ROW()","v":584},"Dani Pupo ",null,null,"Lead",null,null,null,null,null,null,null,null,null,null,null,"Miami-Dade County, FL",true,true,true]
[null,20230426143409,{"$f":"ROW()","v":585},"DANIEL and FAMILY COSMETIC DENISTRY",null,null,"Lead",null,null,null,null,null,null,null,null,null,null,null,"Jefferson County, AL",true,true,true]
[null,20230426143410,{"$f":"ROW()","v":586},"DANIEL BETH ANN",null,null,"Lead",null,null,null,null,null,null,null,null,null,null,null,"Jefferson County, AL",true,true,true]
[null,20230426143411,{"$f":"ROW()","v":587},"Daniel D Sherman ",null,null,"Lead","MailList3","grshermom@aol.com","grshermom@blackplanet.com",null,"(513) 207-8967","(513) 231-5288","(513) 232-5288","217 Irving Way W","Columbus","OH",43214,"Cook County, IL",false,false,false]
[null,20230426143412,{"$f":"ROW()","v":588},"DANIEL FAMILY COSMETIC DENISTRY",null,null,"Lead",null,null,null,null,null,null,null,null,null,null,null,"Jefferson County, AL",true,true,true]
[null,20230426143413,{"$f":"ROW()","v":589},"Daniel J Merrion ",null,null,"Lead","MailList3","dmerrion@gmail.com","rdmerrioni53@verizon.net","dmerrion@hotmail.com","(312) 208-9800","(312) 492-7300","(630) 296-0083","5 Buckskin","Lemont","IL",60439,"Cook County, IL",false,false,false]
[null,20230426143414,{"$f":"ROW()","v":590},"DANIEL JOSEPH E",null,null,"Lead",null,null,null,null,null,null,null,null,null,null,null,"Jefferson County, AL",true,true,true]
[null,20230426143415,{"$f":"ROW()","v":591},"Daniel Madera ",null,null,"Lead","MailList4","carmendeliamadera@gmail.com","spic0mac@hotmail.com",null,"(860) 461-8396","(860) 436-6536","(860) 953-5963","708 Willard Ave","Newington","CT",6111,"Cook County, IL",false,false,false]
[null,20230426143416,{"$f":"ROW()","v":592},"Daniel Mcduffie ",null,null,"Lead","MailList4","destinydecoratorsinc@yahoo.com","lashawn.mcduffie@gmail.com",null,"(773) 220-0715","(773) 707-9277","(773) 429-9069","9615 S Bell Ave","Chicago","IL",60643,"Cook County, IL",false,false,false]
[null,20230426143417,{"$f":"ROW()","v":593},"Daniel P Kaepplinger ",null,null,"Lead","MailList4","dpkaepplinger@sbcglobal.net","jkpatton711@aol.com","dank4856@gmail.com","(847) 848-6111","(847) 394-0533","(773) 478-0817","1116 N Haddow Ave","Arlington Heights","IL",60004,"Cook County, IL",false,false,false]
[null,20230426143418,{"$f":"ROW()","v":594},"Daniel Perkins ",null,null,"Lead","MailList4","danperkins831@yahoo.com","petkins.dan72@gmail.com","perkins.dan72@gmail.com","(312) 824-5338","(630) 961-4565","(773) 573-5426","6002 S Halsted St #305","Chicago","IL",60621,"Cook County, IL",false,false,false]
[null,20230426143419,{"$f":"ROW()","v":595},"Daniel S Klein ",null,null,"Lead",null,null,null,null,null,null,null,null,null,null,null,"Genesee County, MI",true,true,true]
[null,20230426143420,{"$f":"ROW()","v":596},"Daniel Senico ",null,null,"Lead",null,null,null,null,null,null,null,null,null,null,null,"Horry County, SC",true,true,true]
[null,20230426143421,{"$f":"ROW()","v":597},"Danielle Brodsky ",null,null,"Lead",null,null,null,null,null,null,null,null,null,null,null,"Broward County, FL",true,true,true]
[null,20230426143422,{"$f":"ROW()","v":598},"Danielle I Williams ",null,null,"Lead",null,null,null,null,"(708) 307-2313","(773) 483-1018","(501) 922-3212","7111 S Eberhart Ave","Chicago","IL",60619,"Cook County, IL",true,false,false]
[null,20230426143423,{"$f":"ROW()","v":599},"Danielle Mcwhorter ","Richard H Mcwhorter, Ii ",null,"Lead","MailList4","obocce611@aol.com","richardmcw@aol.com",null,"(419) 357-8370","(843) 715-2442","(843) 757-1771","29 Peregrine Dr","Hilton Head Island","SC",29926,"Lexington County, SC",false,false,false]
[null,20230426143424,{"$f":"ROW()","v":600},"Danielle Zerger ",null,null,"Lead",null,null,null,null,null,null,null,null,null,null,null,"Broward County, FL",true,true,true]
[null,20230426143425,{"$f":"ROW()","v":601},"DANIELS ROGIE",null,null,"Lead",null,null,null,null,null,null,null,null,null,null,null,"Jefferson County, AL",true,true,true]
[null,20230426143426,{"$f":"ROW()","v":602},"Danna L Young ",null,null,"Lead","MailList4","mfe4@aol.com","uthorns76906@hotmail.com",null,"(254) 749-0433","(254) 666-0452","(254) 666-1595","3611 Brannon Dr","Waco","TX",76710,null,false,false,false]
[null,20230426143427,{"$f":"ROW()","v":603},"Danny Gipson, ",null,null,"Lead",null,null,null,null,null,null,null,null,null,null,null,"Platte County, MO",true,true,true]
[null,20230426143428,{"$f":"ROW()","v":604},"Danny J Ross ",null,null,"Lead","MailList4","dannyross2345@yahoo.com","mscarmen2@hotmail.com","dross@wowway.com","(708) 774-9087","(773) 287-0975","(773) 375-8328","2658 Baronne Dr","Springfield","IL",62704,"Cook County, IL",false,false,false]
[null,20230426143429,{"$f":"ROW()","v":605},"Danny L Gibson Trust  ",null,null,"Lead",null,null,null,null,null,null,null,null,null,null,null,"Platte County, MO",true,true,true]
[null,20230426143430,{"$f":"ROW()","v":606},"Danstar Builders Inc",null,null,"Lead",null,null,null,null,null,null,null,null,null,null,null,"Franklin County, OH",true,true,true]
[null,20230426143431,{"$f":"ROW()","v":607},"Darius Hatchett ",null,null,"Lead","MailList4","hatchett@go.com","dhatchett@go.com",null,"(248) 910-9468","(313) 582-3797","(313) 359-3008","15959 Woodland Dr","Dearborn","MI",48120,null,false,false,false]
[null,20230426143432,{"$f":"ROW()","v":608},"Darlenzy Darbouze ",null,null,"Lead",null,null,null,null,null,null,null,null,null,null,null,"Broward County, FL",true,true,true]
[null,20230426143433,{"$f":"ROW()","v":609},"DARLING ELECTRIC LLC",null,null,"Lead",null,null,null,null,null,null,null,null,null,null,null,"\nCopiah County, MS",true,true,true]
[null,20230426143434,{"$f":"ROW()","v":610},"Darrell Sr Barrett ",null,null,"Lead",null,null,null,null,null,null,null,null,null,null,null,"Sussex County, NJ",true,true,true]
[null,20230426143435,{"$f":"ROW()","v":611},"Darryl A Brittain ",null,null,"Lead",null,null,null,null,null,null,null,null,null,null,null,"Broward County, FL",true,true,true]
[null,20230426143436,{"$f":"ROW()","v":612},"Daryle O Coggins ",null,null,"Lead",null,null,null,null,null,null,null,null,null,null,null,"Cobb County, GA",true,true,true]
[null,20230426143437,{"$f":"ROW()","v":613},"David A Joe ",null,null,"Lead","MailList4","djoe@ebsworldwide.biz","david@ebsworldwide.biz","ebsworldwide@msn.com","(224) 475-8358","(847) 520-2540","(312) 202-9010","7024 S Kimbark Ave","Chicago","IL",60637,"Cook County, IL",false,false,false]
[null,20230426143438,{"$f":"ROW()","v":614},"David A Weiner ",null,null,"Lead",null,null,null,null,null,null,null,null,null,null,null,"Sussex County, NJ",true,true,true]
[null,20230426143439,{"$f":"ROW()","v":615},"David Burns","","","Lead","MailList4","dburns3353@aol.com",null,null,"(901) 372-3649","(901) 386-9220","(410) 952-7847","3127 Valley Lake Dr","Bartlett","TN","38135-2593",null,false,false,false]
[null,20230426143440,{"$f":"ROW()","v":616},"David Cipolloni ",null,null,"Lead",null,null,null,null,null,null,null,null,null,null,null,"Volusia County, FL",true,true,true]
[null,20230426143441,{"$f":"ROW()","v":617},"David D  Garcia ","Rebekah Garcia",null,"Lead","MailList4","davidgarcia801@sbcglobal.net","bsp528@yahoo.com","sdruihet@hotmail.com","(248) 249-5443","(734) 606-5008","(734) 495-1421","30916 Sibley Rd","Romulus","MI",48174,null,false,false,false]
[null,20230426143442,{"$f":"ROW()","v":618},"David E Moore ",null,null,"Lead",null,null,null,null,null,null,null,null,null,null,null,"Cobb County, GA",true,true,true]
[null,20230426143443,{"$f":"ROW()","v":619},"David Edkins ",null,null,"Lead",null,null,null,null,null,null,null,null,null,null,null,"Hillsborough County, FL",true,true,true]
[null,20230426143444,{"$f":"ROW()","v":620},"David G Allen ",null,null,"Lead",null,null,null,null,null,null,null,null,null,null,null,"Cobb County, GA",true,true,true]
[null,20230426143445,{"$f":"ROW()","v":621},"David Gayden","","Letter returned as insufficient address","Lead","MailList4","mssldavid@yahoo.com","supportm@bellsouth.net",null,"(901) 949-9763","(901) 729-7284","(901) 502-5698","2564 Appling Rd","Memphis","TN","38133-5091",null,false,false,false]
[null,20230426143446,{"$f":"ROW()","v":622},"David Gonzalez ",null,null,"Lead",null,null,null,null,null,null,null,null,null,null,null,"Cobb County, GA",true,true,true]
[null,20230426143447,{"$f":"ROW()","v":623},"David H Biggers ",null,null,"Lead",null,null,null,null,null,null,null,null,null,null,null,"Oakland County, MI",true,true,true]
[null,20230426143448,{"$f":"ROW()","v":624},"David Jr Kalisz ",null,null,"Lead",null,null,null,null,null,null,null,null,null,null,null,"Horry County, SC",true,true,true]
[null,20230426143449,{"$f":"ROW()","v":625},"DAVID KENNETH L",null,null,"Lead",null,null,null,null,null,null,null,null,null,null,null,"Butler County, OH",true,true,true]
[null,20230426143450,{"$f":"ROW()","v":626},"David Lozovsky ",null,null,"Lead",null,null,null,null,null,null,null,null,null,null,null,"Albany County, NY",true,true,true]
[null,20230426143451,{"$f":"ROW()","v":627},"David M Forystek ",null,null,"Lead",null,null,null,null,null,null,null,null,null,null,null,"Genesee County, MI",true,true,true]
[null,20230426143452,{"$f":"ROW()","v":628},"David S Malay ",null,null,"Lead","MailList4","david.malay@att.net","1david.malay@att.net",null,"(312) 608-7174","(708) 784-1305","(630) 654-8554","6473 Cherokee Dr","Indian Head Park","IL",60525,"Cook County, IL",false,false,false]
[null,20230426143453,{"$f":"ROW()","v":629},"David Skelton ",null,null,"Lead",null,null,null,null,null,null,null,null,null,null,null,"Pinellas County, FL",true,true,true]
[null,20230426143454,{"$f":"ROW()","v":630},"David Spivey","","","Lead",null,null,null,null,"(865) 240-9724","(865) 297-2489","(850) 562-4302","132 Utah Ave","Oak Ridge","TN","37830-5269",null,true,false,false]
[null,20230426143455,{"$f":"ROW()","v":631},"David Wayne Castle","","","Lead","MailList4","dwcastle@msn.com",null,null,"(901) 690-2400","(901) 517-2035","(901) 624-2428","1472 Wolf Hunter Dr","Collierville","TN","38017-5622",null,false,false,false]
[null,20230426143456,{"$f":"ROW()","v":632},"DAVIDSON LAURIE L",null,null,"Lead",null,null,null,null,null,null,null,null,null,null,null,"Rankin County, MS",true,true,true]
[null,20230426143457,{"$f":"ROW()","v":633},"DAVIDSON NICK INSULATION INC",null,null,"Lead",null,null,null,null,null,null,null,null,null,null,null,"Jefferson County, AL",true,true,true]
[null,20230426143458,{"$f":"ROW()","v":634},"DAVILA M P RAYO",null,null,"Lead",null,null,null,null,null,null,null,null,null,null,null,"Jefferson County, AL",true,true,true]
[null,20230426143459,{"$f":"ROW()","v":635},"DAVIS ALPHONSO",null,null,"Lead",null,null,null,null,null,null,null,null,null,null,null,"Cuyahoga County, OH",true,true,true]
[null,20230426143460,{"$f":"ROW()","v":636},"DAVIS SAMUEL",null,null,"Lead",null,null,null,null,null,null,null,null,null,null,null,"Harrison County, WV",true,true,true]
[null,20230426143461,{"$f":"ROW()","v":637},"DAVIS SUPIMA F",null,null,"Lead",null,null,null,null,null,null,null,null,null,null,null,"Jefferson County, AL",true,true,true]
[null,20230426143462,{"$f":"ROW()","v":638},"DAVIS, GARY",null,null,"Lead",null,null,null,null,null,null,null,null,null,null,null,"Summit County, OH",true,true,true]
[null,20230426143463,{"$f":"ROW()","v":639},"Dayana Souza Lima ",null,null,"Lead",null,null,null,null,null,null,null,null,null,null,null,"Broward County, FL",true,true,true]
[null,20230426143464,{"$f":"ROW()","v":640},"Daza Wenceslao Ramirez ",null,null,"Lead",null,null,null,null,null,null,null,null,null,null,null,"Hillsborough County, FL",true,true,true]
[null,20230426143465,{"$f":"ROW()","v":641},"DC FLOORING LLC",null,null,"Lead",null,null,null,null,null,null,null,null,null,null,null,"Hamilton County, OH",true,true,true]
[null,20230426143466,{"$f":"ROW()","v":642},"DDF Corp",null,null,"Lead","MailList4","uparker@ddfcorporation.com","russellnehemiah@yahoo.com",null,"(773) 599-3618",null,null,"1016 W. Jackson Blvd","Chicago","IL",60607,"Cook County, IL",false,false,false]
[null,20230426143467,{"$f":"ROW()","v":643},"De Lucas Nursery Inc","",null,"Lead",null,null,null,null,null,null,null,"","","","","Jackson County, MS",true,true,true]
[null,20230426143468,{"$f":"ROW()","v":644},"Dean Porter ",null,null,"Lead",null,null,null,null,null,null,null,null,null,null,null,"Charleston County, SC",true,true,true]
[null,20230426143469,{"$f":"ROW()","v":645},"Deborah Hollander ",null,null,"Lead",null,null,null,null,null,null,null,null,null,null,null,"Broward County, FL",true,true,true]
[null,20230426143470,{"$f":"ROW()","v":646},"Deborah K Biggers ",null,null,"Lead",null,null,null,null,null,null,null,null,null,null,null,"Oakland County, MI",true,true,true]
[null,20230426143471,{"$f":"ROW()","v":647},"Debra Dunn","",null,"Lead","MailList4","homeofdunn11@gmail.com","homeofdunn@tampabay.rr.com",null,"(865) 235-6707","(865) 288-0667","(423) 894-9516","814 Hurricane Creek Rd","Chattanooga","TN",37421,null,false,false,false]
[null,20230426143472,{"$f":"ROW()","v":648},"Debra English ",null,null,"Lead",null,null,null,null,null,null,null,null,null,null,null,"Macomb County, MI",true,true,true]
[null,20230426143473,{"$f":"ROW()","v":649},"Debra L Davis ",null,null,"Lead","MailList4","kodab93@yahoo.com","debbie.davis@gmail.com","eydebbie.davis80@gmail.com","(706) 889-5513","(770) 713-9216","(706) 698-7879","Po Box 625","East Ellijay","GA",30539,null,false,false,false]
[null,20230426143474,{"$f":"ROW()","v":650},"Decatur Country Club Inc.","Lisa Eyster",null,"Lead","MailList4","lisaeyster4@gmail.com",null,null,"(256) 350-6102",null,null,"2401 Country Club Rd Se","Decatur","AL",35601,null,false,false,false]
[null,20230426143475,{"$f":"ROW()","v":651},"DECATUR HIGHWAY TRANSMISSION",null,null,"Lead",null,null,null,null,null,null,null,null,null,null,null,"Jefferson County, AL",true,true,true]
[null,20230426143476,{"$f":"ROW()","v":652},"DEDDENS MARK A ",null,null,"Lead",null,null,null,null,null,null,null,null,null,null,null,"Montgomery County, OH",true,true,true]
[null,20230426143477,{"$f":"ROW()","v":653},"DELANEY COMMUNICATIONS INC",null,null,"Lead",null,null,null,null,null,null,null,null,null,null,null,"Hamilton County, OH",true,true,true]
[null,20230426143478,{"$f":"ROW()","v":654},"DELOACH ANNANIAS JR",null,null,"Lead",null,null,null,null,null,null,null,null,null,null,null,"Jefferson County, AL",true,true,true]
[null,20230426143479,{"$f":"ROW()","v":655},"DELOACH CATHY R JR",null,null,"Lead",null,null,null,null,null,null,null,null,null,null,null,"Jefferson County, AL",true,true,true]
[null,20230426143480,{"$f":"ROW()","v":656},"DELOACH ORTHODONTICS INC",null,null,"Lead",null,null,null,null,null,null,null,null,null,null,null,"Cuyahoga County, OH",true,true,true]
[null,20230426143481,{"$f":"ROW()","v":657},"Demetri Proffitt","",null,"Lead","MailList4","dsproffitt@comcast.net",null,null,"(423) 280-0387","(423) 332-7457","(423) 534-9399","677 Lusk Loop Rd","Dunlap","TN",37327,null,false,false,false]
[null,20230426143482,{"$f":"ROW()","v":658},"Demetrie Taggart ",null,null,"Lead",null,null,null,null,null,null,null,null,null,null,null,"Rockdale County, GA",true,true,true]
[null,20230426143483,{"$f":"ROW()","v":659},"Deneka Stone ",null,null,"Lead","MailList4","deneka.allen@ameritrade.com","bvdeneka.allen26@ameritrade.com","gstone5595@gmail.com","(502) 216-0516","(502) 231-6395","(502) 384-6243","7505 Astrid Way","Louisville","KY",40228,"Jefferson County, KY",false,false,false]
[null,20230426143484,{"$f":"ROW()","v":660},"Denise Mitchell ",null,null,"Lead",null,null,null,null,null,null,null,null,null,null,null,"Albany County, NY",true,true,true]
[null,20230426143485,{"$f":"ROW()","v":661},"Denise Nobles ",null,null,"Lead","MailList4","beammeup40@aol.com","rebeccasinly@outlook.com",null,"(708) 957-4024","(708) 862-6149","(708) 957-7097","1440 Western Ave","Flossmoor","IL",60422,"Cook County, IL",false,false,false]
[null,20230426143486,{"$f":"ROW()","v":662},"Denise Posusta ",null,null,"Lead",null,null,null,null,null,null,null,null,null,null,null,"Pinellas County, FL",true,true,true]
[null,20230426143487,{"$f":"ROW()","v":663},"DENNEY PATRICK A",null,null,"Lead",null,null,null,null,null,null,null,null,null,null,null,"Jefferson County, AL",true,true,true]
[null,20230426143488,{"$f":"ROW()","v":664},"DENNEY SHANNON M",null,null,"Lead",null,null,null,null,null,null,null,null,null,null,null,"Jefferson County, AL",true,true,true]
[null,20230426143489,{"$f":"ROW()","v":665},"Dennis Obrien ",null,null,"Lead",null,null,null,null,null,null,null,null,null,null,null,"Genesee County, MI",true,true,true]
[null,20230426143490,{"$f":"ROW()","v":666},"Dennis Tuwanna",null,null,"Lead",null,null,null,null,"(708) 576-8295","(773) 436-3247","(773) 776-0537","1255 S Michigan Ave #3608","Chicago","IL",60605,"Cook County, IL",true,false,false]
[null,20230426143491,{"$f":"ROW()","v":667},"Denver A Coury ",null,null,"Lead",null,null,null,null,null,null,null,null,null,null,null,"Macomb County, MI",true,true,true]
[null,20230426143492,{"$f":"ROW()","v":668},"Denward W Speer ",null,null,"Lead",null,null,null,null,null,null,null,null,null,null,null,"Charleston County, SC",true,true,true]
[null,20230426143493,{"$f":"ROW()","v":669},"Denz Michael T",null,null,"Lead",null,null,null,null,null,null,null,null,null,null,null,"Franklin County, OH",true,true,true]
[null,20230426143494,{"$f":"ROW()","v":670},"Derrick A Brooks ",null,null,"Lead",null,null,null,null,null,null,null,null,null,null,null,"Macomb County, MI",true,true,true]
[null,20230426143495,{"$f":"ROW()","v":671},"Derrick Boroday ",null,null,"Lead",null,null,null,null,null,null,null,null,null,null,null,"Broward County, FL",true,true,true]
[null,20230426143496,{"$f":"ROW()","v":672},"Derrick E Headd ",null,null,"Lead",null,null,null,null,"(586) 610-7732","(313) 884-5014","(586) 463-2319","1341 Roslyn Rd","Grosse Pointe Woods","MI",48236,null,true,false,false]
[null,20230426143497,{"$f":"ROW()","v":673},"Derrick L Miller ",null,null,"Lead","MailList4","mwesnzkf@onsitecomputersinc.com","killaklaw92@yahoo.com",null,"(616) 724-4799","(616) 617-7003","(616) 427-3709","1806 Horton Ave Se","Grand Rapids","MI",49507,null,false,false,false]
[null,20230426143498,{"$f":"ROW()","v":674},"Derrick Saulsberry","","","Lead","MailList4","dsaulsberry12@yahoo.com",null,null,"","","","9266 Afton Grove Rd","Cordova","TN",38016,null,false,true,false]
[null,20230426143499,{"$f":"ROW()","v":675},"Derrick Turton ",null,null,"Lead",null,null,null,null,null,null,null,null,null,null,null,"Broward County, FL",true,true,true]
[null,20230426143500,{"$f":"ROW()","v":676},"Destin J Klein ",null,null,"Lead",null,null,null,null,null,null,null,null,null,null,null,"Madison County, AL",true,true,true]
[null,20230426143501,{"$f":"ROW()","v":677},"Development Corp - As Nominee Darioush ",null,null,"Lead",null,null,null,null,null,null,null,null,null,null,null,"Albany County, NY",true,true,true]
[null,20230426143502,{"$f":"ROW()","v":678},"DEVINE FLOORING and DESIGN INC",null,null,"Lead",null,null,null,null,null,null,null,null,null,null,null,"Jefferson County, AL",true,true,true]
[null,20230426143503,{"$f":"ROW()","v":679},"Devine Flooring and Design Inc.","Johnny Devine",null,"Lead","MailList4","jdevine@devinesfa.com",null,null,"(205) 425-5058","(205) 965-1894","(205) 970-9748","39814 Pine Ln Se","Bessemer","AL",35022,null,false,false,false]
[null,20230426143504,{"$f":"ROW()","v":680},"DHRUVI INC",null,null,"Lead",null,null,null,null,null,null,null,null,null,null,null,"Summit County, OH",true,true,true]
[null,20230426143505,{"$f":"ROW()","v":681},"Diann Ailsworth",null,null,"Lead",null,null,null,null,null,null,null,null,null,null,null,"DeSoto County, MS",true,true,true]
[null,20230426143506,{"$f":"ROW()","v":682},"DIETERICHS JOE T",null,null,"Lead",null,null,null,null,null,null,null,null,null,null,null,"Cuyahoga County, OH",true,true,true]
[null,20230426143507,{"$f":"ROW()","v":683},"DILLMAN DAVID L ",null,null,"Lead",null,null,null,null,null,null,null,null,null,null,null,"Montgomery County, OH",true,true,true]
[null,20230426143508,{"$f":"ROW()","v":684},"Dillon Michael G",null,null,"Lead",null,null,null,null,null,null,null,null,null,null,null,"Franklin County, OH",true,true,true]
[null,20230426143509,{"$f":"ROW()","v":685},"Dina M Torsan ",null,null,"Lead",null,null,null,null,"(708) 385-4993",null,null,"12431 S Nashville Ave","Palos Heights","IL",60463,"Cook County, IL",true,false,false]
[null,20230426143510,{"$f":"ROW()","v":686},"Dina Y Bayome ",null,null,"Lead",null,null,null,null,null,null,null,null,null,null,null,"Volusia County, FL",true,true,true]
[null,20230426143511,{"$f":"ROW()","v":687},"Dino Kellikidis ",null,null,"Lead","MailList4\nMailList10","jediyamato@aol.com","m.kellikidis@yahoo.com",null,"(773) 858-9919","(708) 583-0911","(773) 775-4309","2062 Big Oak Ln","Northbrook","IL",60062,"Cook County, IL",false,false,false]
[null,20230426143512,{"$f":"ROW()","v":688},"Diomo Llc","Taniya Hanspard",null,"Lead","MailList4","mehanstad@gmail.com",null,null,"(248) 390-6175","(313) 617-9662","(734) 744-7135","700 Montclair St.","Detroit","MI","48214-4616",null,false,false,false]
[null,20230426143513,{"$f":"ROW()","v":689},"Dirk L Carswell ",null,null,"Lead",null,null,null,null,null,null,null,null,null,null,null,"Genesee County, MI",true,true,true]
[null,20230426143514,{"$f":"ROW()","v":690},"DIVERSIFIED SERVICES INC",null,null,"Lead",null,null,null,null,null,null,null,null,null,null,null,"Madison County, MS",true,true,true]
[null,20230426143515,{"$f":"ROW()","v":691},"Dlm Heating and Air Inc",null,null,"Lead",null,null,null,null,null,null,null,null,null,null,null,"Cobb County, GA",true,true,true]
[null,20230426143516,{"$f":"ROW()","v":692},"DOAN CHRIS",null,null,"Lead",null,null,null,null,null,null,null,null,null,null,null,"Cuyahoga County, OH",true,true,true]
[null,20230426143517,{"$f":"ROW()","v":693},"Doctor Cpa Pc Business ",null,null,"Lead",null,null,null,null,null,null,null,null,null,null,null,"Macomb County, MI",true,true,true]
[null,20230426143518,{"$f":"ROW()","v":694},"Dodge City Liquors","Donnie Gilbert","","Lead",null,null,null,null,"","","","7968 East Brainerd Road","Chattanooga","TN",37421,null,true,true,false]
[null,20230426143519,{"$f":"ROW()","v":695},"DODGE EXCAVATING LLC",null,null,"Lead",null,null,null,null,null,null,null,null,null,null,null,"Monongalia County, VA",true,true,true]
[null,20230426143520,{"$f":"ROW()","v":696},"Dogs In Style LLC",null,null,"Lead",null,null,null,null,null,null,null,null,null,null,null,"Cobb County, GA",true,true,true]
[null,20230426143521,{"$f":"ROW()","v":697},"Dolittles Of Charleston",null,null,"Lead",null,null,null,null,null,null,null,null,null,null,null,"Charleston County, SC",true,true,true]
[null,20230426143522,{"$f":"ROW()","v":698},"Dominique Celestin ",null,null,"Lead",null,null,null,null,null,null,null,null,null,null,null,"Cobb County, GA",true,true,true]
[null,20230426143523,{"$f":"ROW()","v":699},"Don Lilly",null,null,"Lead","MailList14","don_lilly@att.net","bokamash91@gmail.com",null,"(734) 377-9578","(734) 953-1635","(586) 790-6675","30710 Parkwood St","Westland","MI",48186,null,false,false,false]
[null,20230426143524,{"$f":"ROW()","v":700},"Donald A Coleman","","","Lead","MailList4","dcoleman@globalhue.com",null,null,"(646) 871-6600","(901) 465-8818","(248) 827-4149","595 Donelson Drive","Eads","TN","38028-3203",null,false,false,false]
[null,20230426143525,{"$f":"ROW()","v":701},"Donald J Johnson ",null,null,"Lead","MailList4","drjohnson58@gmail.com","djjohnson58@comcast.net","khyrhonnjohnson@gmail.com","(773) 617-4321","(773) 952-6523","(708) 653-9499","7715 S Laflin St","Chicago","IL",60620,"Cook County, IL",false,false,false]
[null,20230426143526,{"$f":"ROW()","v":702},"Donald J Melinda ",null,null,"Lead","MailList4","ms_behave75@yahoo.com","melinda.anderson@cs.com","misbehave@hotmail.com","(469) 814-9267","(214) 341-1459","(972) 424-0802","1025 Gannon Dr","Plano","TX",75025,"Cook County, IL",false,false,false]
[null,20230426143527,{"$f":"ROW()","v":703},"Donald Johnson",null,null,"Lead",null,null,null,null,null,null,null,null,null,null,null,"DeSoto County, MS",true,true,true]
[null,20230426143528,{"$f":"ROW()","v":704},"Donald R Bridges ",null,null,"Lead",null,null,null,null,null,null,null,null,null,null,null,"Genesee County, MI",true,true,true]
[null,20230426143529,{"$f":"ROW()","v":705},"Donald Wheat ",null,null,"Lead",null,null,null,null,null,null,null,null,null,null,null,"Genesee County, MI",true,true,true]
[null,20230426143530,{"$f":"ROW()","v":706},"Donkor Stanley",null,null,"Lead",null,null,null,null,null,null,null,null,null,null,null,"Franklin County, OH",true,true,true]
[null,20230426143531,{"$f":"ROW()","v":707},"Donn C Brintle ",null,null,"Lead",null,null,null,null,null,null,null,null,null,null,null,"Brevard County, FL",true,true,true]
[null,20230426143532,{"$f":"ROW()","v":708},"Donna B Cox ",null,null,"Lead",null,null,null,null,null,null,null,null,null,null,null,"Charleston County, SC",true,true,true]
[null,20230426143533,{"$f":"ROW()","v":709},"Dontae J Greenfield ",null,null,"Lead","MailList4","donny.greenfield@gmail.com",null,null,"(773) 885-8917","(815) 431-9783","(815) 431-0000","911 Ottawa Ave","Ottawa","IL",61350,"Cook County, IL",false,false,false]
[null,20230426143534,{"$f":"ROW()","v":710},"Doral Insurance Inc",null,null,"Lead",null,null,null,null,null,null,null,null,null,null,null,"Miami-Dade County, FL",true,true,true]
[null,20230426143536,{"$f":"ROW()","v":711},"Dorian Hale ",null,null,"Lead",null,null,null,null,null,null,null,null,null,null,null,"Oakland County, MI",true,true,true]
[null,20230426143537,{"$f":"ROW()","v":712},"Dothan Pipe and Supply Inc",null,null,"Lead",null,null,null,null,null,null,null,null,null,null,null,"Houston County, AL",true,true,true]
[null,20230426143538,{"$f":"ROW()","v":713},"DOUGLAS JANICE G",null,null,"Lead",null,null,null,null,null,null,null,null,null,null,null,"Cuyahoga County, OH",true,true,true]
[null,20230426143539,{"$f":"ROW()","v":714},"Dougs Mufflers Inc",null,null,"Lead",null,null,null,null,null,null,null,null,null,null,null,"Macomb County, MI",true,true,true]
[null,20230426143540,{"$f":"ROW()","v":715},"Driver Logistics Llc","Heather Pierson",null,"Lead","MailList4","thp01@charter.net",null,null,"(248) 474-6100","(313) 550-7890","(734) 716-8580","19500 Middlebelt Rd #250","Livonia","MICHIGAN",48152,"Wayne County, MI",false,false,false]
[null,20230426143541,{"$f":"ROW()","v":716},"DSI Construction LLC",null,null,"Lead",null,null,null,null,null,null,null,null,null,null,null,"Pinellas County, FL",true,true,true]
[null,20230426143542,{"$f":"ROW()","v":717},"Dtd Marine LLC",null,null,"Lead",null,null,null,null,null,null,null,null,null,null,null,"Broward County, FL",true,true,true]
[null,20230426143543,{"$f":"ROW()","v":718},"Dugan Gayle ",null,null,"Lead",null,null,null,null,null,null,null,null,null,null,null,"Rockdale County, GA",true,true,true]
[null,20230426143544,{"$f":"ROW()","v":719},"Dukes Welding And Fab Llc",null,"","Lead",null,null,null,null,"(865) 310-7678",null,null,"115 Eagle Way Ste D","Clinton","TN",37716,null,true,false,false]
[null,20230426143545,{"$f":"ROW()","v":720},"DULANTO FELIX R",null,null,"Lead",null,null,null,null,null,null,null,null,null,null,null,"Jefferson County, AL",true,true,true]
[null,20230426143546,{"$f":"ROW()","v":721},"DUNBAR MANDY D",null,null,"Lead",null,null,null,null,null,null,null,null,null,null,null,"Wood County, WV",true,true,true]
[null,20230426143547,{"$f":"ROW()","v":722},"DUNBAR RICHARD D",null,null,"Lead",null,null,null,null,null,null,null,null,null,null,null,"Wood County, WV",true,true,true]
[null,20230426143548,{"$f":"ROW()","v":723},"Dunn Dalyn L",null,null,"Lead",null,null,null,null,null,null,null,null,null,null,null,"Franklin County, OH",true,true,true]
[null,20230426143549,{"$f":"ROW()","v":724},"Dupont Gregory S",null,null,"Lead",null,null,null,null,null,null,null,null,null,null,null,"Franklin County, OH",true,true,true]
[null,20230426143550,{"$f":"ROW()","v":725},"DURANTI CAROL J",null,null,"Lead",null,null,null,null,null,null,null,null,null,null,null,"Monongalia County, VA",true,true,true]
[null,20230426143551,{"$f":"ROW()","v":726},"DURANTI RUDLPH P",null,null,"Lead",null,null,null,null,null,null,null,null,null,null,null,"Monongalia County, VA",true,true,true]
[null,20230426143552,{"$f":"ROW()","v":727},"Dwayne M Green ",null,null,"Lead",null,null,null,null,null,null,null,null,null,null,null,"Charleston County, SC",true,true,true]
[null,20230426143553,{"$f":"ROW()","v":728},"Dylan Development Corp",null,null,"Lead",null,null,null,null,null,null,null,null,null,null,null,"Franklin County, OH",true,true,true]
[null,20230426143554,{"$f":"ROW()","v":729},"DYNAMIC TREND INC",null,null,"Lead",null,null,null,null,null,null,null,null,null,null,null,"Summit County, OH",true,true,true]
[null,20230426143555,{"$f":"ROW()","v":730},"E and M Services, Llc"," David Price",null,"Lead","MailList4","meghan.peters@comcast.net","dmprice2300@address.com",null,"(205) 648-2113","(205) 491-7941","(205) 648-4030","Po Box 605","Sumiton","AL",35148,null,false,false,false]
[null,20230426143556,{"$f":"ROW()","v":731},"E Reynga Gonzalez ","M Nieves Romero ",null,"Lead","MailList4","magdanieves0125@hotmail.com","magrath@tiki.net",null,"(803) 297-5029","(803) 957-2252","(803) 381-1576","132 Veterans Ct","Gilbert","SC",29054,"Lexington County, SC",false,false,false]
[null,20230426143557,{"$f":"ROW()","v":732},"E Sobers ",null,null,"Lead",null,null,null,null,null,null,null,null,null,null,null,"Pinellas County, FL",true,true,true]
[null,20230426143558,{"$f":"ROW()","v":733},"Early Minds Academy LLC",null,null,"Lead",null,null,null,null,null,null,null,null,null,null,null,"Cobb County, GA",true,true,true]
[null,20230426143559,{"$f":"ROW()","v":734},"EARTHWORKS LANDSCAPE and DESIGN INC",null,null,"Lead",null,null,null,null,null,null,null,null,null,null,null,"Cuyahoga County, OH",true,true,true]
[null,20230426143560,{"$f":"ROW()","v":735},"Eastech Property Dev LLC",null,null,"Lead",null,null,null,null,null,null,null,null,null,null,null,"Charleston County, SC",true,true,true]
[null,20230426143561,{"$f":"ROW()","v":736},"Eazy Mobile Inc","Foad (frank) Ziyad",null,"Lead","MailList4","taras_box2@yahoo.com",null,null,"(773) 627-0354","(773) 653-9672","(708) 560-0684","14913 Sheila Ct","Oak Forest","IL",60452,"Cook County, IL",false,false,false]
[null,20230426143562,{"$f":"ROW()","v":737},"Ed Senez ",null,null,"Lead",null,null,null,null,null,null,null,null,null,null,null,"Volusia County, FL",true,true,true]
[null,20230426143563,{"$f":"ROW()","v":738},"Ed Senez Aluminum Specialist Inc",null,null,"Lead",null,null,null,null,null,null,null,null,null,null,null,"Volusia County, FL",true,true,true]
[null,20230426143564,{"$f":"ROW()","v":739},"Edgar Espada",null,null,"Lead","MailList5\nMailList4","edgarespada526@gmail.com","eveespada32@earthlink.net","reespadai95@earthlink.net","(773) 526-9200","(630) 289-3913","(773) 849-3512","2851 N Neva Ave","Chicago","IL",60634,"Cook County, IL",false,false,false]
[null,20230426143565,{"$f":"ROW()","v":740},"Edgar Espada ",null,null,"Lead","MailList14","edgarespada526@gmail.com","eveespada32@earthlink.net","reespadai95@earthlink.net","(773) 526-9200","(630) 289-3913","(773) 849-3512","2851 N Neva Ave","Chicago","IL",60634,"Cook County, IL",false,false,false]
[null,20230426143566,{"$f":"ROW()","v":741},"Edgar Ward ",null,null,"Lead",null,null,null,null,null,null,null,null,null,null,null,"Broward County, FL",true,true,true]
[null,20230426143567,{"$f":"ROW()","v":742},"Edgewater Trading LLC",null,null,"Lead",null,null,null,null,null,null,null,null,null,null,null,"Charleston County, SC",true,true,true]
[null,20230426143568,{"$f":"ROW()","v":743},"Edilberto Guajardo ",null,null,"Lead","MailList4","eguajardo9@yahoo.com",null,null,"(312) 907-8745","(773) 869-9344","(312) 532-4999","2230 S Wood St","Chicago","IL",60608,"Cook County, IL",false,false,false]
[null,20230426143569,{"$f":"ROW()","v":744},"EDMONDSON JONATHAN L",null,null,"Lead",null,null,null,null,null,null,null,null,null,null,null,"Jefferson County, AL",true,true,true]
[null,20230426143570,{"$f":"ROW()","v":745},"Edward Goines ",null,null,"Lead",null,null,null,null,null,null,null,null,null,null,null,"Cobb County, GA",true,true,true]
[null,20230426143571,{"$f":"ROW()","v":746},"Edward Peecher ",null,null,"Lead","MailList4","pstrkj5848@aol.com","epeecher@concentric.net","edpeecher@gmail.com","(773) 680-1647","(773) 324-8870","(773) 924-1266","4228 S King Dr","Chicago","IL",60653,"Cook County, IL",false,false,false]
[null,20230426143572,{"$f":"ROW()","v":747},"Edward Sprouse ",null,null,"Lead",null,null,null,null,null,null,null,null,null,null,null,"Horry County, SC",true,true,true]
[null,20230426143573,{"$f":"ROW()","v":748},"Edward W Iii James ",null,null,"Lead",null,null,null,null,null,null,null,null,null,null,null,"Hillsborough County, FL",true,true,true]
[null,20230426143574,{"$f":"ROW()","v":749},"Edwin Wilbert Jr",null,null,"Lead","MailList4","wilbe1@usachoice.com",null,null,"(724) 285-5692","(724) 283-2542","(412) 283-9069","117 Garden Grove Dr","Butler","PA",16002,null,false,false,false]
[null,20230426143575,{"$f":"ROW()","v":750},"Efrain Felipe ",null,null,"Lead",null,null,null,null,null,null,null,null,null,null,null,"Broward County, FL",true,true,true]
[null,20230426143576,{"$f":"ROW()","v":751},"El Mercadito Mexican Etc",null,null,"Lead",null,null,null,null,null,null,null,null,null,null,null,"Charleston County, SC",true,true,true]
[null,20230426143577,{"$f":"ROW()","v":752},"EL PATRON TEQUILERIA and CUISINE LLC",null,null,"Lead",null,null,null,null,null,null,null,null,null,null,null,"Summit County, OH",true,true,true]
[null,20230426143578,{"$f":"ROW()","v":753},"El Rincon San Juanero Inc",null,null,"Lead",null,null,null,null,null,null,null,null,null,null,null,"Miami-Dade County, FL",true,true,true]
[null,20230426143580,{"$f":"ROW()","v":754},"Elaine C Calderalo ",null,null,"Lead",null,null,null,null,null,null,null,null,null,null,null,"Miami-Dade County, FL",true,true,true]
[null,20230426143582,{"$f":"ROW()","v":755},"Elaine Fuller ",null,null,"Lead",null,null,null,null,null,null,null,null,null,null,null,"Rockdale County, GA",true,true,true]
[null,20230426143583,{"$f":"ROW()","v":756},"Elaine M Drake","","","Lead",null,null,null,null,"(901) 643-5089","(901) 785-6449","(901) 249-7819","5055 Horn Lake Rd","Memphis","TN",38109,null,true,false,false]
[null,20230426143584,{"$f":"ROW()","v":757},"Elena Pitter ",null,null,"Lead",null,null,null,null,null,null,null,null,null,null,null,"Broward County, FL",true,true,true]
[null,20230426143585,{"$f":"ROW()","v":758},"Elgen N Washington ",null,null,"Lead",null,null,null,null,null,null,null,null,null,null,null,"Charleston County, SC",true,true,true]
[null,20230426143586,{"$f":"ROW()","v":759},"Elijah R Banks ",null,null,"Lead","MailList4","veban@aol.com","banks.vera@gmail.com","veban777@ssbcglobal.net","(773) 606-8980","(773) 651-7372","(773) 391-2434","17263 Parkside Ave","South Holland","IL",60473,"Cook County, IL",false,false,false]
[null,20230426143587,{"$f":"ROW()","v":760},"Elite Antiques LLC",null,null,"Lead",null,null,null,null,null,null,null,null,null,null,null,"Platte County, MO",true,true,true]
[null,20230426143588,{"$f":"ROW()","v":761},"Elite Auto Group LLC",null,null,"Lead",null,null,null,null,null,null,null,null,null,null,null,"Genesee County, MI",true,true,true]
[null,20230426143589,{"$f":"ROW()","v":762},"ELITE NAILS",null,null,"Lead",null,null,null,null,null,null,null,null,null,null,null,"Loraine County, OH",true,true,true]
[null,20230426143590,{"$f":"ROW()","v":763},"Elizabeth C Brunsvold",null,null,"Lead","MailList4","brunsvol@chapman.com","elizabeth.brunsvold@netscape.net",null,"(312) 835-9997","(312) 988-4018","(312) 913-1512","1449 N Mohawk St","Chicago","IL",60610,"Cook County, IL",false,false,false]
[null,20230426143591,{"$f":"ROW()","v":764},"Elizabeth C Mayne ",null,null,"Lead",null,null,null,null,null,null,null,null,null,null,null,"Oakland County, MI",true,true,true]
[null,20230426143592,{"$f":"ROW()","v":765},"Elizabeth Harrell ",null,null,"Lead",null,null,null,null,null,null,null,null,null,null,null,"Charleston County, SC",true,true,true]
[null,20230426143593,{"$f":"ROW()","v":766},"Elizabeth Kendall","","","Lead",null,null,null,null,"(865) 202-9837","(865) 945-5426","(865) 457-1888","785 Laurel Rd ","Clinton","TN","37716-5454",null,true,false,false]
[null,20230426143594,{"$f":"ROW()","v":767},"Elizabeth P Rouse ",null,null,"Lead",null,null,null,null,null,null,null,null,null,null,null,"Volusia County, FL",true,true,true]
[null,20230426143595,{"$f":"ROW()","v":768},"Ellen Dranichak ",null,null,"Lead",null,null,null,null,null,null,null,null,null,null,null,"Albany County, NY",true,true,true]
[null,20230426143596,{"$f":"ROW()","v":769},"ELLIS JOHN S  ",null,null,"Lead",null,null,null,null,null,null,null,null,null,null,null,"Butler County, OH",true,true,true]
[null,20230426143597,{"$f":"ROW()","v":770},"Elma Chatman ",null,null,"Lead","MailList4","elmachatman@yahoo.com","loechatman17@themanors.net",null,"(313) 909-6662","(313) 544-8596","(313) 272-6428","307 Cove Pl","Atlanta","GA",30339,null,false,false,false]
[null,20230426143598,{"$f":"ROW()","v":771},"ELROD JERRY",null,null,"Lead",null,null,null,null,null,null,null,null,null,null,null,"Jefferson County, AL",true,true,true]
[null,20230426143599,{"$f":"ROW()","v":772},"ELRODS MOBILITY",null,null,"Lead",null,null,null,null,null,null,null,null,null,null,null,"Jefferson County, AL",true,true,true]
[null,20230426143600,{"$f":"ROW()","v":773},"Elsa Estenor-torreon ",null,null,"Lead","MailList4","elsa.torreon@gmail.com",null,null,"(630) 888-0158","(331) 472-4723","(630) 863-7523","2407 Fawn Lake Cir","Naperville","IL",60564,"Cook County, IL",false,false,false]
[null,20230426143601,{"$f":"ROW()","v":774},"Em Engineering Group Ltd",null,null,"Lead",null,null,null,null,null,null,null,null,null,null,null,"Franklin County, OH",true,true,true]
[null,20230426143602,{"$f":"ROW()","v":775},"Embroidery and Screen Printing Select ",null,null,"Lead",null,null,null,null,null,null,null,null,null,null,null,"Broward County, FL",true,true,true]
[null,20230426143603,{"$f":"ROW()","v":776},"Emilio J Argrenot ",null,null,"Lead",null,null,null,null,null,null,null,null,null,null,null,"Miami-Dade County, FL",true,true,true]
[null,20230426143605,{"$f":"ROW()","v":777},"Emily Williamson ",null,null,"Lead",null,null,null,null,null,null,null,null,null,null,null,"Brevard County, FL",true,true,true]
[null,20230426143606,{"$f":"ROW()","v":778},"Emisael J Jaramillo ",null,null,"Lead",null,null,null,null,null,null,null,null,null,null,null,"Broward County, FL",true,true,true]
[null,20230426143607,{"$f":"ROW()","v":779},"Enviro Recycling Group Llc",null,null,"Lead",null,null,null,null,null,null,null,null,null,null,null,"Franklin County, OH",true,true,true]
[null,20230426143608,{"$f":"ROW()","v":780},"ENVISION CHILDREN",null,null,"Lead",null,null,null,null,null,null,null,null,null,null,null,"Hamilton County, OH",true,true,true]
[null,20230426143609,{"$f":"ROW()","v":781},"Eon Washington ",null,null,"Lead",null,null,null,null,null,null,null,null,null,null,null,"Charleston County, SC",true,true,true]
[null,20230426143610,{"$f":"ROW()","v":782},"Erasmo Jr Hernandez ",null,null,"Lead","MailList5","erasmo.hernandez@att.net","erasmo.guzman@gmail.com","vervasmo.hernandez@att.net","(773) 523-2170","(773) 376-8685","(773) 229-9445","4352 S Western Ave","Chicago","IL",60609,"Cook County, IL",false,false,false]
[null,20230426143611,{"$f":"ROW()","v":783},"Eric Baymon ",null,null,"Lead","MailList5","mcbaymon@yahoo.com","baymoneric@gmail.com",null,"(773) 240-8239","(773) 240-8223",null,"620 Woodlawn St","Hoffman Estates","IL",60169,"Cook County, IL",false,false,false]
[null,20230426143612,{"$f":"ROW()","v":784},"Eric L Harper ",null,null,"Lead","MailList5","erich1126@yahoo.com",null,null,"(773) 875-5023","(847) 998-4518","(847) 207-2035","2436 Pick Dr","Glenview","IL",60025,"Cook County, IL",false,false,false]
[null,20230426143613,{"$f":"ROW()","v":785},"Eric L Wilson ",null,null,"Lead",null,null,null,null,null,null,null,null,null,null,null,"Broward County, FL",true,true,true]
[null,20230426143614,{"$f":"ROW()","v":786},"Eric Olson ",null,null,"Lead",null,null,null,null,null,null,null,null,null,null,null,"Broward County, FL",true,true,true]
[null,20230426143615,{"$f":"ROW()","v":787},"ERICS LAWN MAINTENANCE",null,null,"Lead",null,null,null,null,null,null,null,null,null,null,null,"Summit County, OH",true,true,true]
[null,20230426143616,{"$f":"ROW()","v":788},"Erik Salguero Luarca ",null,null,"Lead","MailList5","kerik.salguerox56@hotmail.com","erik.salguero@yahoo.com","zerik.salguerok91@hotmail.com","(630) 750-0674","(630) 570-0674","(630) 788-3185","5525 Pebblebeach Dr","Hanover Park","IL",60133,"Cook County, IL",false,false,false]
[null,20230426143617,{"$f":"ROW()","v":789},"Erika B Ramfos ",null,null,"Lead",null,null,null,null,null,null,null,null,null,null,null,"Oakland County, MI",true,true,true]
[null,20230426143618,{"$f":"ROW()","v":790},"Erika Iruega ",null,null,"Lead",null,null,null,null,null,null,null,null,null,null,null,"Cobb County, GA",true,true,true]
[null,20230426143619,{"$f":"ROW()","v":791},"Erin Christie Lea Bates ",null,null,"Lead",null,null,null,null,null,null,null,null,null,null,null,"Macomb County, MI",true,true,true]
[null,20230426143620,{"$f":"ROW()","v":792},"Erin D Page ",null,null,"Lead",null,null,null,null,"(313) 996-9162","(810) 937-7625",null,"18986 Schaefer Hwy","Detroit     ","MI",48235,null,true,false,false]
[null,20230426143621,{"$f":"ROW()","v":793},"ERKER, RAYMOND A",null,null,"Lead",null,null,null,null,null,null,null,null,null,null,null,"Loraine County, OH",true,true,true]
[null,20230426143622,{"$f":"ROW()","v":794},"Ernest Larson ",null,null,"Lead","MailList5","larst@aol.com","ibrkthngs@aol.com","ibrkthngs@netscape.com","(630) 300-4966","(630) 964-7637","(330) 285-5446","547 E Seegers Rd #220","Arlington Heights","IL",60005,"Cook County, IL",false,false,false]
[null,20230426143623,{"$f":"ROW()","v":795},"Ernesto Diaz ",null,null,"Lead",null,null,null,null,null,null,null,null,null,null,null,"Miami-Dade County, FL",true,true,true]
[null,20230426143625,{"$f":"ROW()","v":796},"ERNIES CULPEPPER ELECTRIC INC",null,null,"Lead",null,null,null,null,null,null,null,null,null,null,null,"Rankin County, MS",true,true,true]
[null,20230426143626,{"$f":"ROW()","v":797},"Ernisha Randolph ",null,null,"Lead",null,null,null,null,null,null,null,null,null,null,null,"Broward County, FL",true,true,true]
[null,20230426143627,{"$f":"ROW()","v":798},"Espy Bennie E",null,null,"Lead",null,null,null,null,null,null,null,null,null,null,null,"Franklin County, OH",true,true,true]
[null,20230426143628,{"$f":"ROW()","v":799},"Essiex Wilson",null,null,"Lead",null,null,null,null,null,null,null,null,null,null,null,"DeSoto County, MS",true,true,true]
[null,20230426143629,{"$f":"ROW()","v":800},"Ethel Hall-Langworthy ",null,null,"Lead","MailList5","dethel.hallb78@bright.net","ethelhall@comcast.net",null,"(773) 677-0397","(773) 548-4658","(773) 548-4657","3943 S Ellis Ave","Chicago","IL",60653,"Cook County, IL",false,false,false]
[null,20230426143630,{"$f":"ROW()","v":801},"Eugene Storey","9 Mile Rent All Inc",null,"Lead","MailList9","ems6415@gmail.com","genestorey01@yahoo.com","genestorey01@gmail.com","(248) 931-3099","(586) 757-6055","(586) 486-4869","11233 E 11 Mile Rd","Warren","MI",48093,"Macomb County, MI",false,false,false]
[null,20230426143631,{"$f":"ROW()","v":802},"Evan Rundle ",null,null,"Lead",null,null,null,null,null,null,null,null,null,null,null,"Miami-Dade County, FL",true,true,true]
[null,20230426143632,{"$f":"ROW()","v":803},"Evan Taber ",null,null,"Lead",null,null,null,null,null,null,null,null,null,null,null,"Broward County, FL",true,true,true]
[null,20230426143633,{"$f":"ROW()","v":804},"EVANS DONNIE H",null,null,"Lead",null,null,null,null,null,null,null,null,null,null,null,"Rankin County, MS",true,true,true]
[null,20230426143634,{"$f":"ROW()","v":805},"EVANS DONNIE H ET AL",null,null,"Lead",null,null,null,null,null,null,null,null,null,null,null,"Madison County, MS",true,true,true]
[null,20230426143635,{"$f":"ROW()","v":806},"EVANS SHANNON W",null,null,"Lead",null,null,null,null,null,null,null,null,null,null,null,"Rankin County, MS",true,true,true]
[null,20230426143637,{"$f":"ROW()","v":807},"Evelyn Vickers ",null,null,"Lead",null,null,null,null,null,null,null,null,null,null,null,"Broward County, FL",true,true,true]
[null,20230426143638,{"$f":"ROW()","v":808},"Evita G Kaigler ",null,null,"Lead",null,null,null,null,null,null,null,null,null,null,null,"Cobb County, GA",true,true,true]
[null,20230426143639,{"$f":"ROW()","v":809},"Ewha R Castro ",null,null,"Lead",null,null,null,null,null,null,null,null,null,null,null,"Rockdale County, GA",true,true,true]
[null,20230426143640,{"$f":"ROW()","v":810},"Executive Construction Group Inc",null,null,"Lead",null,null,null,null,null,null,null,null,null,null,null,"Broward County, FL",true,true,true]
[null,20230426143641,{"$f":"ROW()","v":811},"Executive Protective Services Gonzales Crystal","CRYSTAL L GONZALES",null,"Lead",null,null,null,null,"(734) 757-7208",null,null,"9574 Schaefer Hwy","Detroit","MI",48227,null,true,false,false]
[null,20230426143642,{"$f":"ROW()","v":812},"Express Logistic Services Corp","Jerry Knauss","","Lead",null,null,null,null,"(901) 674-0641","(901) 737-4688","(901) 235-6199","11870 Cranston Dr Ste 103","Arlington","TN","38002-4913",null,true,false,false]
[null,20230426143643,{"$f":"ROW()","v":813},"Ezra Williams ",null,null,"Lead",null,null,null,null,null,null,null,null,null,null,null,"Charleston County, SC",true,true,true]
[null,20230426143644,{"$f":"ROW()","v":814},"F Beck Company T ",null,null,"Lead",null,null,null,null,null,null,null,null,null,null,null,"Oakland County, MI",true,true,true]
[null,20230426143645,{"$f":"ROW()","v":815},"F Chavez and D Lara Hernandez","",null,"Lead",null,null,null,null,"(575) 399-3592","(912) 422-6765","(912) 422-6254","4450 Morrison Rd Apt A","Denver","CO",80219,null,true,false,false]
[null,20230426143646,{"$f":"ROW()","v":816},"F E Hiott Trucking LLC",null,null,"Lead",null,null,null,null,null,null,null,null,null,null,null,"Charleston County, SC",true,true,true]
[null,20230426143647,{"$f":"ROW()","v":817},"F Marrero R ",null,null,"Lead",null,null,null,null,null,null,null,null,null,null,null,"Miami-Dade County, FL",true,true,true]
[null,20230426143648,{"$f":"ROW()","v":818},"Fabelo Angel",null,null,"Lead","MailList14","afpapitofabelo@gmail.com","angelfabelo@ymail.com",null,"(773) 629-0418","(773) 344-4701","(773) 715-0353","3636 S Central Ave","Cicero","IL",60804,"Cook County, IL",false,false,false]
[null,20230426143649,{"$f":"ROW()","v":819},"Fabricated Technologies Inc",null,null,"Lead",null,null,null,null,null,null,null,null,null,null,null,"Madison County, AL",true,true,true]
[null,20230426143650,{"$f":"ROW()","v":820},"Fabricated Technologies Inc.","Brandy Casey",null,"Lead","MailList14","brandycasey@hotmail.com","lpbrandyapid72@aol.com","ylbrandyapid@aol.com","(256) 701-1150","(254) 698-9608","(256) 665-2050","Po Box 130","Gurley","AL",35748,null,false,false,false]
[null,20230426143651,{"$f":"ROW()","v":821},"FABRIS BRANDON A",null,null,"Lead",null,null,null,null,null,null,null,null,null,null,null,"Stark County, OH",true,true,true]
[null,20230426143652,{"$f":"ROW()","v":822},"Fabuless Floors and Cabinets Llc",null,null,"Lead",null,null,null,null,null,null,null,null,null,null,null,"Franklin County, OH",true,true,true]
[null,20230426143653,{"$f":"ROW()","v":823},"Fachman Alice L",null,null,"Lead",null,null,null,null,null,null,null,null,null,null,null,"Franklin County, OH",true,true,true]
[null,20230426143654,{"$f":"ROW()","v":824},"Fachman David A",null,null,"Lead",null,null,null,null,null,null,null,null,null,null,null,"Franklin County, OH",true,true,true]
[null,20230426143655,{"$f":"ROW()","v":825},"Family Child Care Inc","Carina Gallego",null,"Lead","MailList5","caren_zbot2@yahoo.com","jammi_fk@yahoo.com","tecaren_zbot217@yahoo.com","(773) 905-4730","(773) 685-3669","(630) 938-4524","2717 N Saint Louis Ave","Chicago","IL",60647,"Cook County, IL",false,false,false]
[null,20230426143656,{"$f":"ROW()","v":826},"Family Dental Alpha ",null,null,"Lead",null,null,null,null,null,null,null,null,null,null,null,"Macomb County, MI",true,true,true]
[null,20230426143657,{"$f":"ROW()","v":827},"Family360 Inc",null,null,"Lead",null,null,null,null,null,null,null,null,null,null,null,"Rockdale County, GA",true,true,true]
[null,20230426143658,{"$f":"ROW()","v":828},"FANCY FACE INC",null,null,"Lead",null,null,null,null,null,null,null,null,null,null,null,"Jefferson County, AL",true,true,true]
[null,20230426143659,{"$f":"ROW()","v":829},"FANTROY ARTHUR",null,null,"Lead",null,null,null,null,null,null,null,null,null,null,null,"Cuyahoga County, OH",true,true,true]
[null,20230426143660,{"$f":"ROW()","v":830},"Farrah Farley ",null,null,"Lead",null,null,null,null,null,null,null,null,null,null,null,"Cobb County, GA",true,true,true]
[null,20230426143661,{"$f":"ROW()","v":831},"FAWAKY BURST JUICE CO LLC",null,null,"Lead",null,null,null,null,null,null,null,null,null,null,null,"Cuyahoga County, OH",true,true,true]
[null,20230426143662,{"$f":"ROW()","v":832},"Faysal M Mohamed ",null,null,"Lead","MailList5","mfaysal1@yahoo.com","luv@gci.net",null,"(708) 349-1092","(312) 731-7762","(708) 226-0835","117 Windmill Rd","Orland Park","IL",60467,"Cook County, IL",false,false,false]
[null,20230426143663,{"$f":"ROW()","v":833},"Feather Home and Respite Care S Corp Blue ",null,null,"Lead",null,null,null,null,null,null,null,null,null,null,null,"Madison County, AL",true,true,true]
[null,20230426143664,{"$f":"ROW()","v":834},"FEATHERS, DAVID E",null,null,"Lead",null,null,null,null,null,null,null,null,null,null,null,"Summit County, OH",true,true,true]
[null,20230426143666,{"$f":"ROW()","v":835},"Feezell Funeral Supplies Inc","Michael Harding","1120 12/31/2018 xx-xx 11/04/2019 12/04/2029 5955.11","Lead",null,null,null,null,"(865) 335-9292","(865) 970-3440","(865) 380-5500","1900 E Broadway Ave","Maryville","TN",37804,null,true,false,false]
[null,20230426143667,{"$f":"ROW()","v":836},"Felbry College Llc",null,null,"Lead",null,null,null,null,null,null,null,null,null,null,null,"Franklin County, OH",true,true,true]
[null,20230426143668,{"$f":"ROW()","v":837},"Felicia Jones ",null,null,"Lead",null,null,null,null,null,null,null,null,null,null,null,"Cobb County, GA",true,true,true]
[null,20230426143669,{"$f":"ROW()","v":838},"Felix R Dulanto ",null,null,"Lead",null,null,null,null,null,null,null,null,null,null,null,"Mobile County, AL",true,true,true]
[null,20230426143670,{"$f":"ROW()","v":839},"Fendt Jeffery S",null,null,"Lead",null,null,null,null,null,null,null,null,null,null,null,"Cook County, IL",true,true,true]
[null,20230426143671,{"$f":"ROW()","v":840},"Fenix Automotive LLC",null,null,"Lead",null,null,null,null,null,null,null,null,null,null,null,"Charleston County, SC",true,true,true]
[null,20230426143672,{"$f":"ROW()","v":841},"Fereydoun Salimi ",null,null,"Lead",null,null,null,null,null,null,null,null,null,null,null,"Broward County, FL",true,true,true]
[null,20230426143673,{"$f":"ROW()","v":842},"FERNANDEZ RICHARD T",null,null,"Lead",null,null,null,null,null,null,null,null,null,null,null,"Harrison County, WV",true,true,true]
[null,20230426143674,{"$f":"ROW()","v":843},"Fernando Costa ",null,null,"Lead",null,null,null,null,null,null,null,null,null,null,null,"Broward County, FL",true,true,true]
[null,20230426143675,{"$f":"ROW()","v":844},"Fernando Jr Segoviano ",null,null,"Lead",null,null,null,null,null,null,null,null,null,null,null,"Cook County, IL",true,true,true]
[null,20230426143676,{"$f":"ROW()","v":845},"FIEDLER, ROBERT W JR",null,null,"Lead",null,null,null,null,null,null,null,null,null,null,null,"Lucas County, OH",true,true,true]
[null,20230426143677,{"$f":"ROW()","v":846},"Fiedor Yvonne J",null,null,"Lead",null,null,null,null,null,null,null,null,null,null,null,"Cook County, IL",true,true,true]
[null,20230426143678,{"$f":"ROW()","v":847},"Finley Margaret D",null,null,"Lead",null,null,null,null,null,null,null,null,null,null,null,"Franklin County, OH",true,true,true]
[null,20230426143679,{"$f":"ROW()","v":848},"Firm Kleppin ",null,null,"Lead",null,null,null,null,null,null,null,null,null,null,null,"Broward County, FL",true,true,true]
[null,20230426143680,{"$f":"ROW()","v":849},"Firm Pa Monfiston ",null,null,"Lead",null,null,null,null,null,null,null,null,null,null,null,"Broward County, FL",true,true,true]
[null,20230426143681,{"$f":"ROW()","v":850},"Firm Pc Manely ",null,null,"Lead",null,null,null,null,null,null,null,null,null,null,null,"Cobb County, GA",true,true,true]
[null,20230426143682,{"$f":"ROW()","v":851},"Flavor 91 Inc",null,null,"Lead",null,null,null,null,null,null,null,null,null,null,null,"Franklin County, OH",true,true,true]
[null,20230426143683,{"$f":"ROW()","v":852},"Fleet Equipment LLC",null,"","Lead",null,null,null,null,"","","","2505 Farrisview Rd","Memphis","TN","38118-9513",null,true,true,false]
[null,20230426143684,{"$f":"ROW()","v":853},"FLORES ANA M ",null,null,"Lead",null,null,null,null,null,null,null,null,null,null,null,"Montgomery County, OH",true,true,true]
[null,20230426143685,{"$f":"ROW()","v":854},"Florida Cleanex Inc",null,null,"Lead",null,null,null,null,null,null,null,null,null,null,null,"Broward County, FL",true,true,true]
[null,20230426143686,{"$f":"ROW()","v":855},"Fords Redi-Mix Concrete Co",null,null,"Lead",null,null,null,null,null,null,null,null,null,null,null,"Charleston County, SC",true,true,true]
[null,20230426143687,{"$f":"ROW()","v":856},"FORMULA EXTERMINATORS INC",null,null,"Lead",null,null,null,null,null,null,null,null,null,null,null,"Hamilton County, OH",true,true,true]
[null,20230426143688,{"$f":"ROW()","v":857},"FORTENBERRY ERNEST DECD ET AL",null,null,"Lead",null,null,null,null,null,null,null,null,null,null,null,"Madison County, MS",true,true,true]
[null,20230426143689,{"$f":"ROW()","v":858},"Forza Architecture Inc","",null,"Lead",null,null,null,null,null,null,null," 654 S Shelby St, Unit 301","Louisville","KY",40202,null,true,true,false]
[null,20230426143690,{"$f":"ROW()","v":859},"FOSTER KENNETH R",null,null,"Lead",null,null,null,null,null,null,null,null,null,null,null,"Rankin County, MS",true,true,true]
[null,20230426143692,{"$f":"ROW()","v":860},"FOUR CORNERS CLEANING INC",null,null,"Lead",null,null,null,null,null,null,null,null,null,null,null,"Summit County, OH",true,true,true]
[null,20230426143693,{"$f":"ROW()","v":861},"Fowler Tremaine R R",null,null,"Lead",null,null,null,null,null,null,null,null,null,null,null,"Cook County, IL",true,true,true]
[null,20230426143694,{"$f":"ROW()","v":862},"Foy Properties Inc","John William Foy",null,"Lead","MailList14","rebfoy@hotmail.com","rebeccajordan@address.com",null,"(615) 210-3296","(502) 365-3794","(615) 452-9810","7902 Beulah Church Rd","Louisville","KY",40228,"Jefferson County, KY",false,false,false]
[null,20230426143695,{"$f":"ROW()","v":863},"Fragolina LLC",null,null,"Lead",null,null,null,null,null,null,null,null,null,null,null,"Charleston County, SC",true,true,true]
[null,20230426143696,{"$f":"ROW()","v":864},"FRALEY DAVID",null,null,"Lead",null,null,null,null,null,null,null,null,null,null,null,"Butler County, OH",true,true,true]
[null,20230426143697,{"$f":"ROW()","v":865},"Frances L Birmingham ",null,null,"Lead",null,null,null,null,null,null,null,null,null,null,null,"Broward County, FL",true,true,true]
[null,20230426143698,{"$f":"ROW()","v":866},"Francis A Micor ",null,null,"Lead",null,null,null,null,null,null,null,null,null,null,null,"Cook County, IL",true,true,true]
[null,20230426143699,{"$f":"ROW()","v":867},"Francis Air Conditioning and Appliances Inc",null,null,"Lead",null,null,null,null,null,null,null,null,null,null,null,"Broward County, FL",true,true,true]
[null,20230426143700,{"$f":"ROW()","v":868},"Francisco Byun ",null,null,"Lead",null,null,null,null,null,null,null,null,null,null,null,"Broward County, FL",true,true,true]
[null,20230426143701,{"$f":"ROW()","v":869},"Francisco J Ayala ",null,null,"Lead",null,null,null,null,null,null,null,null,null,null,null,"Cook County, IL",true,true,true]
[null,20230426143702,{"$f":"ROW()","v":870},"Frank Co Enterprises Inc",null,null,"Lead",null,null,null,null,"(803) 309-2520","(803) 708-2355","(803) 764-0856","2424 Leaphart Rd #6b","West Columbia","SC",29169,"Lexington County, SC",true,false,false]
[null,20230426143703,{"$f":"ROW()","v":871},"Frankie Edmiston","","","Lead","MailList14","jedmistonwj20@earthlink.net","fran3231@gmail.com",null,"(901) 409-3231","(901) 372-3231","(415) 517-5853","4752 Hampton Ridge Ln","Bartlett","TN","38002-7554",null,false,false,false]
[null,20230426143704,{"$f":"ROW()","v":872},"Franklin Z Adell ",null,null,"Lead",null,null,null,null,null,null,null,null,null,null,null,"Oakland County, MI",true,true,true]
[null,20230426143705,{"$f":"ROW()","v":873},"Frazier Howard W",null,null,"Lead",null,null,null,null,null,null,null,null,null,null,null,"Franklin County, OH",true,true,true]
[null,20230426143706,{"$f":"ROW()","v":874},"FRAZIER, GRETCHEN",null,null,"Lead",null,null,null,null,null,null,null,null,null,null,null,"Summit County, OH",true,true,true]
[null,20230426143707,{"$f":"ROW()","v":875},"Frc Construction Llc",null,null,"Lead","MailList14","rebeccascodycat@aol.com",null,null,"(803) 894-4158","(803) 518-4287","(803) 894-4157","107 Wagon Wheel Court","Pelion","SC",29123,"Lexington County, SC",false,false,false]
[null,20230426143708,{"$f":"ROW()","v":876},"Fred Byrd III, Et Al","",null,"Lead",null,null,null,null,null,null,null,"","","","","DeSoto County, MS",true,true,true]
[null,20230426143709,{"$f":"ROW()","v":877},"Fred Herbert Smith ",null,null,"Lead",null,null,null,null,null,null,null,null,null,null,null,"Rockdale County, GA",true,true,true]
[null,20230426143710,{"$f":"ROW()","v":878},"Frederick Calvita J",null,null,"Lead",null,null,null,null,null,null,null,null,null,null,null,"Cook County, IL",true,true,true]
[null,20230426143711,{"$f":"ROW()","v":879},"Frederick G Helmsing ",null,null,"Lead",null,null,null,null,null,null,null,null,null,null,null,"Mobile County, AL",true,true,true]
[null,20230426143712,{"$f":"ROW()","v":880},"Frederick Jr Poulnot ",null,null,"Lead",null,null,null,null,null,null,null,null,null,null,null,"Charleston County, SC",true,true,true]
[null,20230426143713,{"$f":"ROW()","v":881},"Fresh Cleaning Lemon ",null,null,"Lead",null,null,null,null,null,null,null,null,null,null,null,"Horry County, SC",true,true,true]
[null,20230426143714,{"$f":"ROW()","v":882},"FRINGE",null,null,"Lead",null,null,null,null,null,null,null,null,null,null,null,"Jefferson County, AL",true,true,true]
[null,20230426143715,{"$f":"ROW()","v":883},"Fringe, Inc.","",null,"Lead",null,null,"fran3231@gmail.com",null,"","","","1830 29Th Ave S Ste 120","Homewood","AL",35209,null,false,true,false]
[null,20230426143716,{"$f":"ROW()","v":884},"FROEHLICH JAMES E JR ",null,null,"Lead",null,null,null,null,null,null,null,null,null,null,null,"Montgomery County, OH",true,true,true]
[null,20230426143717,{"$f":"ROW()","v":885},"Fuad Masri ",null,null,"Lead","MailList14","cdorsey47@msn.com","fuadmasri4791@gmail.com",null,"(708) 655-1318","(708) 424-4324","(773) 542-0101","10440 Menard Ave #2s","Oak Lawn","IL",60453,"Cook County, IL",false,false,false]
[null,20230426143718,{"$f":"ROW()","v":886},"FULLY PROMOMTED BIRMINGHAM",null,null,"Lead",null,null,null,null,null,null,null,null,null,null,null,"Jefferson County, AL",true,true,true]
[null,20230426143719,{"$f":"ROW()","v":887},"G and G Delivery Services Inc",null,null,"Lead",null,null,null,null,null,null,null,null,null,null,null,"Hillsborough County, FL",true,true,true]
[null,20230426143720,{"$f":"ROW()","v":888},"Gail Peyton ",null,null,"Lead",null,null,null,null,null,null,null,null,null,null,null,"Cobb County, GA",true,true,true]
[null,20230426143721,{"$f":"ROW()","v":889},"Gallegos Jose A",null,null,"Lead",null,null,null,null,null,null,null,null,null,null,null,"Franklin County, OH",true,true,true]
[null,20230426143722,{"$f":"ROW()","v":890},"Galvin Enterprises Inc",null,null,"Lead",null,null,null,null,null,null,null,null,null,null,null,"Cook County, IL",true,true,true]
[null,20230426143723,{"$f":"ROW()","v":891},"GARNER MANAGEMENT LLC",null,null,"Lead",null,null,null,null,null,null,null,null,null,null,null,"Madison County, MS",true,true,true]
[null,20230426143725,{"$f":"ROW()","v":892},"GARRETT COREY K",null,null,"Lead",null,null,null,null,null,null,null,null,null,null,null,"Rankin County, MS",true,true,true]
[null,20230426143726,{"$f":"ROW()","v":893},"Gary Ardito ",null,null,"Lead",null,null,null,null,null,null,null,null,null,null,null,"Albany County, NY",true,true,true]
[null,20230426143727,{"$f":"ROW()","v":894},"Gary H Forst ",null,null,"Lead",null,null,null,null,null,null,null,null,null,null,null,"Broward County, FL",true,true,true]
[null,20230426143728,{"$f":"ROW()","v":895},"Gary L Cartee ",null,null,"Lead",null,null,null,null,null,null,null,null,null,null,null,"Charleston County, SC",true,true,true]
[null,20230426143729,{"$f":"ROW()","v":896},"Gary L Hamilton","Garys Body Shop","","Lead","MailList14","garywhamilton@yahoo.com","pattyhamilton1979@gmail.com",null,"(865) 457-4645","(865) 300-2575","(865) 483-6953","255 Jd Yarnell Industrial Pkwy","Clinton","TN","37716-4011",null,false,false,false]
[null,20230426143730,{"$f":"ROW()","v":897},"Gary L Hansen ",null,null,"Lead",null,null,null,null,null,null,null,null,null,null,null,"Broward County, FL",true,true,true]
[null,20230426143731,{"$f":"ROW()","v":898},"Gary L Starks ",null,null,"Lead","MailList14","gesparks@yahoo.com","gesparks119@yahoo.com",null,"(989) 356-1868","(352) 314-0817","(989) 727-3319","6504 Beaver Lake Rd","Alpena","MI",49707,null,false,false,false]
[null,20230426143732,{"$f":"ROW()","v":899},"Gary Machnik ",null,null,"Lead","MailList14","garymachnik@yahoo.com",null,null,"(847) 757-1027","(773) 628-7906","(847) 301-2095","2275 Westview Dr","Des Plaines","IL",60018,"Cook County, IL",false,false,false]
[null,20230426143733,{"$f":"ROW()","v":900},"Gary Washington ",null,null,"Lead",null,null,null,null,null,null,null,null,null,null,null,"Houston County, AL",true,true,true]
[null,20230426143734,{"$f":"ROW()","v":901},"Gathering Place Of Columbus",null,null,"Lead",null,null,null,null,null,null,null,null,null,null,null,"Franklin County, OH",true,true,true]
[null,20230426143735,{"$f":"ROW()","v":902},"Gawain Reggans ",null,null,"Lead",null,null,null,null,null,null,null,null,null,null,null,"Cook County, IL",true,true,true]
[null,20230426143736,{"$f":"ROW()","v":903},"Geller Robert H",null,null,"Lead","MailList14","rgeller@paulgordon.org",null,null,"(630) 789-0261","(708) 450-0462","(708) 450-1591","519 60th Pl","Burr Ridge","IL",60527,"Cook County, IL",false,false,false]
[null,20230426143737,{"$f":"ROW()","v":904},"Genelle Speed-Hale ",null,null,"Lead",null,null,null,null,null,null,null,null,null,null,null,"Oakland County, MI",true,true,true]
[null,20230426143738,{"$f":"ROW()","v":905},"Genero M Cofield ",null,null,"Lead","MailList14","jacqueline.cofield@yahoo.com","jacquelinecofield@bigfoot.com",null,"(704) 494-8534","(313) 871-0114","(248) 996-8709","5256 Drexel St","Detroit","MI",48213,"Wayne County, MI",false,false,false]
[null,20230426143739,{"$f":"ROW()","v":906},"Genesis Total Healthcare LLC",null,null,"Lead",null,null,null,null,null,null,null,null,null,null,null,"Genesee County, MI",true,true,true]
[null,20230426143740,{"$f":"ROW()","v":907},"Genise Dash ",null,null,"Lead","MailList14","genise.dash@gmail.com","dashdenise@yahoo.com","babyg2001@blackplanet.com","(803) 261-1640","(803) 536-0466","(803) 260-2155","3941 Charleston Hwy #75","West Columbia","SC",29172,"Lexington County, SC",false,false,false]
[null,20230426143741,{"$f":"ROW()","v":908},"George Iv French ",null,null,"Lead",null,null,null,null,null,null,null,null,null,null,null,"Miami-Dade County, FL",true,true,true]
[null,20230426143743,{"$f":"ROW()","v":909},"George S Jr Thomas ",null,null,"Lead",null,null,null,null,null,null,null,null,null,null,null,"Charleston County, SC",true,true,true]
[null,20230426143744,{"$f":"ROW()","v":910},"Georgia Alcohol Dealers Association Inc",null,null,"Lead",null,null,null,null,null,null,null,null,null,null,null,"Rockdale County, GA",true,true,true]
[null,20230426143745,{"$f":"ROW()","v":911},"Georgia L Smith ",null,null,"Lead",null,null,null,null,null,null,null,null,null,null,null,"Charleston County, SC",true,true,true]
[null,20230426143746,{"$f":"ROW()","v":912},"Georgia Zorba ",null,null,"Lead",null,null,null,null,null,null,null,null,null,null,null,"Cook County, IL",true,true,true]
[null,20230426143747,{"$f":"ROW()","v":913},"Gerald B Stringham ",null,null,"Lead",null,null,null,null,null,null,null,null,null,null,null,"Volusia County, FL",true,true,true]
[null,20230426143748,{"$f":"ROW()","v":914},"Gerald Stinson ",null,null,"Lead",null,null,null,null,null,null,null,null,null,null,null,"Cobb County, GA",true,true,true]
[null,20230426143749,{"$f":"ROW()","v":915},"GERIATRIC PROVIDERS AND HOSPITALISTS INC",null,null,"Lead",null,null,null,null,null,null,null,null,null,null,null,"Hamilton County, OH",true,true,true]
[null,20230426143750,{"$f":"ROW()","v":916},"Germaylle White ",null,null,"Lead",null,null,null,null,null,null,null,null,null,null,null,"Cobb County, GA",true,true,true]
[null,20230426143751,{"$f":"ROW()","v":917},"GESINSKI ELIJAH D",null,null,"Lead",null,null,null,null,null,null,null,null,null,null,null,"Cuyahoga County, OH",true,true,true]
[null,20230426143752,{"$f":"ROW()","v":918},"GET TO THE LAKE INC",null,null,"Lead",null,null,null,null,null,null,null,null,null,null,null,"Jefferson County, AL",true,true,true]
[null,20230426143753,{"$f":"ROW()","v":919},"GHANI JACQUELING H",null,null,"Lead",null,null,null,null,null,null,null,null,null,null,null,"Cuyahoga County, OH",true,true,true]
[null,20230426143754,{"$f":"ROW()","v":920},"GIBBES STAFFING INC",null,null,"Lead",null,null,null,null,null,null,null,null,null,null,null,"Madison County, MS",true,true,true]
[null,20230426143755,{"$f":"ROW()","v":921},"GIBBS DAVID",null,null,"Lead",null,null,null,null,null,null,null,null,null,null,null,"Butler County, OH",true,true,true]
[null,20230426143756,{"$f":"ROW()","v":922},"Giberley Michel ",null,null,"Lead",null,null,null,null,null,null,null,null,null,null,null,"Miami-Dade County, FL",true,true,true]
[null,20230426143757,{"$f":"ROW()","v":923},"Gibson Aristide ",null,null,"Lead",null,null,null,null,null,null,null,null,null,null,null,"Broward County, FL",true,true,true]
[null,20230426143758,{"$f":"ROW()","v":924},"Gigis Kitchen Llc",null,null,"Lead",null,null,null,null,null,null,null,null,null,null,null,"Cook County, IL",true,true,true]
[null,20230426143759,{"$f":"ROW()","v":925},"Gil S Cagbabanua",null,null,"Lead","MailList14","gcagbabanua@webtv.net","gd110700@yahoo.com","lig0914@yahoo.com","(224) 875-0625","(847) 583-0625","(773) 509-9547","2416 Pinecrest Ln","Westchester","IL",60154,"Cook County, IL",false,false,false]
[null,20230426143760,{"$f":"ROW()","v":926},"Gil S Cagbabanua ",null,null,"Lead",null,null,null,null,null,null,null,null,null,null,null,"Cook County, IL",true,true,true]
[null,20230426143761,{"$f":"ROW()","v":927},"Gillespie Joseph M",null,null,"Lead",null,null,null,null,null,null,null,null,null,null,null,"Franklin County, OH",true,true,true]
[null,20230426143762,{"$f":"ROW()","v":928},"GILLIS FRANCIS",null,null,"Lead",null,null,null,null,null,null,null,"1802 CHICKASAW DR","Columbus","MS",39705,"Lowndes County, MS",true,true,false]
[null,20230426143763,{"$f":"ROW()","v":929},"GILLOTA NICOLE M LLC",null,null,"Lead",null,null,null,null,null,null,null,null,null,null,null,"Cuyahoga County, OH",true,true,true]
[null,20230426143764,{"$f":"ROW()","v":930},"Gilma Lieber ",null,null,"Lead",null,null,null,null,null,null,null,null,null,null,null,"Miami-Dade County, FL",true,true,true]
[null,20230426143765,{"$f":"ROW()","v":931},"Gilman Mathieu",null,null,"Lead",null,null,null,null,null,null,null,null,null,null,null,"Cook County, IL",true,true,true]
[null,20230426143766,{"$f":"ROW()","v":932},"Ginnie G Mcadoo ",null,null,"Lead",null,null,null,null,null,null,null,null,null,null,null,"Cobb County, GA",true,true,true]
[null,20230426143767,{"$f":"ROW()","v":933},"Gjeka Juncaj ",null,null,"Lead",null,null,null,null,null,null,null,null,null,null,null,"Macomb County, MI",true,true,true]
[null,20230426143768,{"$f":"ROW()","v":934},"Gl Healthcare Inc","Mary Cydel Mallari",null,"Lead","MailList14","madel74@juno.com","vtmcydelmallari2@hotmail.com","mmallari@gmail.com","(708) 535-9482","(630) 201-5492","(630) 390-8714","1315 Macom Dr. Ste 104","Naperville","IL",60564,"Cook County, IL",false,false,false]
[null,20230426143769,{"$f":"ROW()","v":935},"Gladstone Gikunoo ",null,null,"Lead",null,null,null,null,null,null,null,null,null,null,null,"Cook County, IL",true,true,true]
[null,20230426143770,{"$f":"ROW()","v":936},"GLANC, KENNETH W",null,null,"Lead",null,null,null,null,null,null,null,null,null,null,null,"Loraine County, OH",true,true,true]
[null,20230426143771,{"$f":"ROW()","v":937},"GLANC, MEGHAN D",null,null,"Lead",null,null,null,null,null,null,null,null,null,null,null,"Loraine County, OH",true,true,true]
[null,20230426143772,{"$f":"ROW()","v":938},"Glenesha Webster ",null,null,"Lead","MailList14","gwebster@yahoo.com","xnesha.webstert69@yahoo.com","boston49963@gmail.com","(502) 417-8274","(502) 644-6696","(502) 572-9322","6240 Maravian Dr","Louisville","KY",40258,"Jefferson County, KY",false,false,false]
[null,20230426143773,{"$f":"ROW()","v":939},"GMAJCAL ENTERPRISE INC",null,null,"Lead",null,null,null,null,null,null,null,null,null,null,null,"Jefferson County, AL",true,true,true]
[null,20230426143774,{"$f":"ROW()","v":940},"GOAD THOMAS",null,null,"Lead",null,null,null,null,null,null,null,null,null,null,null,"Cuyahoga County, OH",true,true,true]
[null,20230426143775,{"$f":"ROW()","v":941},"GOFF CHARLIE M",null,null,"Lead",null,null,null,null,null,null,null,null,null,null,null,"Jefferson County, AL",true,true,true]
[null,20230426143776,{"$f":"ROW()","v":942},"GOFF HEIDI W",null,null,"Lead",null,null,null,null,null,null,null,null,null,null,null,"Jefferson County, AL",true,true,true]
[null,20230426143777,{"$f":"ROW()","v":943},"GOLDSMITH BARBARA A",null,null,"Lead",null,null,null,null,null,null,null,null,null,null,null,"Rankin County, MS",true,true,true]
[null,20230426143778,{"$f":"ROW()","v":944},"Gomez Pedro Jr",null,null,"Lead",null,null,null,null,null,null,null,null,null,null,null,"Franklin County, OH",true,true,true]
[null,20230426143779,{"$f":"ROW()","v":945},"Gonellas Food, Inc.","George Yono",null,"Lead",null,null,null,null,"(313) 841-3500",null,"(313) 841-3500",null,null,null,null,"Wayne County, MI",true,false,false]
[null,20230426143780,{"$f":"ROW()","v":946},"Gonzalez Edwin D Cintron ",null,null,"Lead",null,null,null,null,null,null,null,null,null,null,null,"Pinellas County, FL",true,true,true]
[null,20230426143781,{"$f":"ROW()","v":947},"GOOTS JOSEPH P",null,null,"Lead",null,null,null,null,null,null,null,null,null,null,null,"Wood County, WV",true,true,true]
[null,20230426143782,{"$f":"ROW()","v":948},"Gorilla Operations Llc",null,null,"Lead",null,null,null,null,null,null,null,null,null,null,null,"Franklin County, OH",true,true,true]
[null,20230426143783,{"$f":"ROW()","v":949},"Gowri L Santhapur ",null,null,"Lead",null,null,null,null,null,null,null,null,null,null,null,"Oakland County, MI",true,true,true]
[null,20230426143784,{"$f":"ROW()","v":950},"Grace Enterprises Etc",null,null,"Lead",null,null,null,null,null,null,null,null,null,null,null,"Charleston County, SC",true,true,true]
[null,20230426143785,{"$f":"ROW()","v":951},"GRAFFEO JOHNNY G",null,null,"Lead",null,null,null,null,null,null,null,null,null,null,null,"Jefferson County, AL",true,true,true]
[null,20230426143786,{"$f":"ROW()","v":952},"GRAFFEO KIMBERLY L",null,null,"Lead",null,null,null,null,null,null,null,null,null,null,null,"Jefferson County, AL",true,true,true]
[null,20230426143787,{"$f":"ROW()","v":953},"GRAHAM JEFFREY",null,null,"Lead",null,null,null,null,null,null,null,null,null,null,null,"Harrison County, MS",true,true,true]
[null,20230426143788,{"$f":"ROW()","v":954},"Granados Carlos",null,null,"Lead",null,null,null,null,null,null,null,null,null,null,null,"Cook County, IL",true,true,true]
[null,20230426143789,{"$f":"ROW()","v":955},"GRAY ANTHONY",null,null,"Lead",null,null,null,null,null,null,null,null,null,null,null,"Cuyahoga County, OH",true,true,true]
[null,20230426143790,{"$f":"ROW()","v":956},"Great City Cars Llc",null,null,"Lead",null,null,null,null,null,null,null,null,null,null,null,"Franklin County, OH",true,true,true]
[null,20230426143791,{"$f":"ROW()","v":957},"GREAT HEALTH INC ",null,null,"Lead",null,null,null,null,null,null,null,null,null,null,null,"Montgomery County, OH",true,true,true]
[null,20230426143792,{"$f":"ROW()","v":958},"Great Lakes Wellness and Home Health Inc",null,null,"Lead",null,null,null,null,null,null,null,null,null,null,null,"Macomb County, MI",true,true,true]
[null,20230426143793,{"$f":"ROW()","v":959},"GREEN BASEBALL SOFTBALL FEDERATION",null,null,"Lead",null,null,null,null,null,null,null,null,null,null,null,"Summit County, OH",true,true,true]
[null,20230426143794,{"$f":"ROW()","v":960},"Green Electric Corp Power ",null,null,"Lead",null,null,null,null,null,null,null,null,null,null,null,"Miami-Dade County, FL",true,true,true]
[null,20230426143795,{"$f":"ROW()","v":961},"Greentech Insulation, LLC","",null,"Lead",null,null,null,null,"","","","17488 Catwalk Lane","Andalusia","AL",36420,null,true,true,false]
[null,20230426143796,{"$f":"ROW()","v":962},"Gregory A Clendenin ",null,null,"Lead",null,null,null,null,null,null,null,null,null,null,null,"Brevard County, FL",true,true,true]
[null,20230426143797,{"$f":"ROW()","v":963},"Gregory Cole ",null,null,"Lead",null,null,null,null,null,null,null,null,null,null,null,"Cobb County, GA",true,true,true]
[null,20230426143798,{"$f":"ROW()","v":964},"Gregory J Justus ",null,null,"Lead",null,null,null,null,null,null,null,null,null,null,null,"Cook County, IL",true,true,true]
[null,20230426143799,{"$f":"ROW()","v":965},"Gregory Makozy ",null,null,"Lead",null,null,null,null,null,null,null,null,null,null,null,"Broward County, FL",true,true,true]
[null,20230426143800,{"$f":"ROW()","v":966},"Griffin S Peifer ",null,null,"Lead",null,null,null,null,null,null,null,null,null,null,null,"Cook County, IL",true,true,true]
[null,20230426143801,{"$f":"ROW()","v":967},"GRIGGS TRAVIS L",null,null,"Lead",null,null,null,null,null,null,null,null,null,null,null,"Rankin County, MS",true,true,true]
[null,20230426143802,{"$f":"ROW()","v":968},"GROGG TERESA A",null,null,"Lead",null,null,null,null,null,null,null,null,null,null,null,"Wood County, WV",true,true,true]
[null,20230426143803,{"$f":"ROW()","v":969},"GRT Food Inc.","",null,"Lead",null,null,null,null,"","","","1961 Bell St","Montgomery","AL",36104,null,true,true,false]
[null,20230426143804,{"$f":"ROW()","v":970},"Gueilar L Jones ",null,null,"Lead",null,null,null,null,null,null,null,null,null,null,null,"Cook County, IL",true,true,true]
[null,20230426143805,{"$f":"ROW()","v":971},"Guillermo Alarcon ",null,null,"Lead",null,null,null,null,null,null,null,null,null,null,null,"Miami-Dade County, FL",true,true,true]
[null,20230426143807,{"$f":"ROW()","v":972},"GULLETTE SHAWON L ",null,null,"Lead",null,null,null,null,null,null,null,null,null,null,null,"Montgomery County, OH",true,true,true]
[null,20230426143808,{"$f":"ROW()","v":973},"Gumercindo Y Perez ",null,null,"Lead",null,null,null,null,null,null,null,null,null,null,null,"Cobb County, GA",true,true,true]
[null,20230426143809,{"$f":"ROW()","v":974},"Guriqbal Nandra ",null,null,"Lead","MailList15","gnandraau52@rediffmail.com","tgnandraf29@rediffmail.com",null,"(312) 804-4566","(312) 540-0130","(312) 540-6733","195 N Harbor Dr #330","Chicago","IL",60601,"Cook County, IL",false,false,false]
[null,20230426143810,{"$f":"ROW()","v":975},"Gustav Walter Jr Kloszewski ",null,null,"Lead",null,null,null,null,null,null,null,null,null,null,null,"Broward County, FL",true,true,true]
[null,20230426143811,{"$f":"ROW()","v":976},"Guzman High Llc",null,null,"Lead",null,null,null,null,null,null,null,null,null,null,null,"Franklin County, OH",true,true,true]
[null,20230426143812,{"$f":"ROW()","v":977},"Gwendolyn Nasim ",null,null,"Lead",null,null,null,null,null,null,null,null,null,null,null,"Mobile County, AL",true,true,true]
[null,20230426143813,{"$f":"ROW()","v":978},"H and R Industrial Contractors Inc",null,null,"Lead",null,null,null,null,null,null,null,null,null,null,null,"Cullman County, AL",true,true,true]
[null,20230426143814,{"$f":"ROW()","v":979},"H and S Machine Works LLC",null,null,"Lead",null,null,null,null,null,null,null,null,null,null,null,"Mobile County, AL",true,true,true]
[null,20230426143815,{"$f":"ROW()","v":980},"Haifa Nasser",null,null,"Lead",null,null,null,null,null,null,null,null,null,null,null,"DeSoto County, MS",true,true,true]
[null,20230426143816,{"$f":"ROW()","v":981},"Haig Istamboulian ",null,null,"Lead",null,null,null,null,null,null,null,null,null,null,null,"Macomb County, MI",true,true,true]
[null,20230426143817,{"$f":"ROW()","v":982},"HALL EDWARD M",null,null,"Lead",null,null,null,null,null,null,null,null,null,null,null,"Monongalia County, VA",true,true,true]
[null,20230426143818,{"$f":"ROW()","v":983},"HALL PAVEMENT INDUSTRIES INCORPORATED",null,null,"Lead",null,null,null,null,null,null,null,null,null,null,null,"Butler County, OH",true,true,true]
[null,20230426143819,{"$f":"ROW()","v":984},"HALL TIFFANY S",null,null,"Lead",null,null,null,null,null,null,null,null,null,null,null,"Monongalia County, VA",true,true,true]
[null,20230426143820,{"$f":"ROW()","v":985},"Haller Matthew S",null,null,"Lead",null,null,null,null,null,null,null,null,null,null,null,"Franklin County, OH",true,true,true]
[null,20230426143821,{"$f":"ROW()","v":986},"Hallo LLC",null,null,"Lead",null,null,null,null,null,null,null,null,null,null,null,"Broward County, FL",true,true,true]
[null,20230426143822,{"$f":"ROW()","v":987},"HAMER CHRISTOPHER S",null,null,"Lead",null,null,null,null,null,null,null,null,null,null,null,"Jefferson County, AL",true,true,true]
[null,20230426143823,{"$f":"ROW()","v":988},"HAMER LAW GROUP LLC",null,null,"Lead",null,null,null,null,null,null,null,null,null,null,null,"Jefferson County, AL",true,true,true]
[null,20230426143824,{"$f":"ROW()","v":989},"HAMILTONDAVIS MENTAL HEALTH INC",null,null,"Lead",null,null,null,null,null,null,null,null,null,null,null,"Rankin County, MS",true,true,true]
[null,20230426143825,{"$f":"ROW()","v":990},"HANEY JANICE M NOMINEE",null,null,"Lead",null,null,null,null,null,null,null,null,null,null,null,"Cuyahoga County, OH",true,true,true]
[null,20230426143826,{"$f":"ROW()","v":991},"Hanif Sorathia ",null,null,"Lead",null,null,null,null,null,null,null,null,null,null,null,"Broward County, FL",true,true,true]
[null,20230426143827,{"$f":"ROW()","v":992},"Hank H Iv Hepler ",null,null,"Lead",null,null,null,null,null,null,null,null,null,null,null,"Madison County, AL",true,true,true]
[null,20230426143828,{"$f":"ROW()","v":993},"Hanley Frost Pc Jessica ",null,null,"Lead",null,null,null,null,null,null,null,null,null,null,null,"Cobb County, GA",true,true,true]
[null,20230426143829,{"$f":"ROW()","v":994},"Hannah I Kennedy ",null,null,"Lead",null,null,null,null,null,null,null,null,null,null,null,"Cook County, IL",true,true,true]
[null,20230426143830,{"$f":"ROW()","v":995},"HANSON MARY JO",null,null,"Lead",null,null,null,null,null,null,null,null,null,null,null,"Cuyahoga County, OH",true,true,true]
[null,20230426143831,{"$f":"ROW()","v":996},"Hard Soda Co Llc",null,null,"Lead",null,null,null,null,null,null,null,null,null,null,null,"Franklin County, OH",true,true,true]
[null,20230426143832,{"$f":"ROW()","v":997},"Hardy Johnson","Latrice Johnson",null,"Lead",null,null,null,null,"(734) 941-4892","(734) 595-3536","(734) 728-7218","11420 Moore St","Romulus   ","MI",48174,null,true,false,false]
[null,20230426143833,{"$f":"ROW()","v":998},"HARGUR INC",null,null,"Lead",null,null,null,null,null,null,null,null,null,null,null,"Cuyahoga County, OH",true,true,true]
[null,20230426143834,{"$f":"ROW()","v":999},"Harold Jr Blum ",null,null,"Lead",null,null,null,null,null,null,null,null,null,null,null,"Cook County, IL",true,true,true]
[null,20230426143835,{"$f":"ROW()","v":1000},"HARRIS ANDREA M",null,null,"Lead",null,null,null,null,null,null,null,null,null,null,null,"Cuyahoga County, OH",true,true,true]
[null,20230426143836,{"$f":"ROW()","v":1001},"HARRIS DAVID T",null,null,"Lead",null,null,null,null,null,null,null,null,null,null,null,"Cuyahoga County, OH",true,true,true]
[null,20230426143837,{"$f":"ROW()","v":1002},"HARRIS HAROLD",null,null,"Lead",null,null,null,null,null,null,null,null,null,null,null,"Cuyahoga County, OH",true,true,true]
[null,20230426143838,{"$f":"ROW()","v":1003},"HARRIS JOSHUA",null,null,"Lead",null,null,null,null,null,null,null,null,null,null,null,"Jefferson County, AL",true,true,true]
[null,20230426143839,{"$f":"ROW()","v":1004},"Harris Tracey M",null,null,"Lead",null,null,null,null,null,null,null,null,null,null,null,"Cook County, IL",true,true,true]
[null,20230426143840,{"$f":"ROW()","v":1005},"Harrison Foods LLC",null,null,"Lead",null,null,null,null,null,null,null,null,null,null,null,"Houston County, AL",true,true,true]
[null,20230426143841,{"$f":"ROW()","v":1006},"Harrison Foods, LLC","",null,"Lead",null,null,null,null,"","","","Po Box 9611","Dothan","AL",36304,null,true,true,false]
[null,20230426143842,{"$f":"ROW()","v":1007},"HARRISON KRISTY D",null,null,"Lead",null,null,null,null,null,null,null,null,null,null,null,"Jefferson County, AL",true,true,true]
[null,20230426143843,{"$f":"ROW()","v":1008},"Harry Goldschein ",null,null,"Lead",null,null,null,null,null,null,null,null,null,null,null,"Volusia County, FL",true,true,true]
[null,20230426143844,{"$f":"ROW()","v":1009},"Hartsfield Timothy M",null,null,"Lead",null,null,null,null,"(313) 407-4930","(850) 668-6547","(313) 393-5531","4847 Highgrove Rd","Tallahassee","FL",32309,null,true,false,false]
[null,20230426143845,{"$f":"ROW()","v":1010},"HARVEY GEORGE",null,null,"Lead",null,null,null,null,null,null,null,null,null,null,null,"Cuyahoga County, OH",true,true,true]
[null,20230426143846,{"$f":"ROW()","v":1011},"Harvey Ostrander ",null,null,"Lead",null,null,null,null,null,null,null,null,null,null,null,"Oakland County, MI",true,true,true]
[null,20230426143847,{"$f":"ROW()","v":1012},"Hasan Shukriyyah Miller ",null,null,"Lead",null,null,null,null,null,null,null,null,null,null,null,"Rockdale County, GA",true,true,true]
[null,20230426143848,{"$f":"ROW()","v":1013},"HATFIELD SUZANNE A ",null,null,"Lead",null,null,null,null,null,null,null,null,null,null,null,"Montgomery County, OH",true,true,true]
[null,20230426143849,{"$f":"ROW()","v":1014},"HAUGABOOK, RHONDA D",null,null,"Lead",null,null,null,null,null,null,null,null,null,null,null,"Summit County, OH",true,true,true]
[null,20230426143850,{"$f":"ROW()","v":1015},"HAYDEN BRIAN P",null,null,"Lead",null,null,null,null,null,null,null,null,null,null,null,"Jefferson County, AL",true,true,true]
[null,20230426143851,{"$f":"ROW()","v":1016},"HAYDEN LINDSEY A",null,null,"Lead",null,null,null,null,null,null,null,null,null,null,null,"Jefferson County, AL",true,true,true]
[null,20230426143852,{"$f":"ROW()","v":1017},"Hayes David L",null,null,"Lead",null,null,null,null,null,null,null,null,null,null,null,"Franklin County, OH",true,true,true]
[null,20230426143853,{"$f":"ROW()","v":1018},"HAYNES OTTO JR",null,null,"Lead",null,null,null,null,null,null,null,null,null,null,null,"Cuyahoga County, OH",true,true,true]
[null,20230426143854,{"$f":"ROW()","v":1019},"HAZEL LINDA",null,null,"Lead",null,null,null,null,null,null,null,null,null,null,null,"Stark County, OH",true,true,true]
[null,20230426143855,{"$f":"ROW()","v":1020},"Head Marcus",null,null,"Lead",null,null,null,null,null,null,null,null,null,null,null,"Franklin County, OH",true,true,true]
[null,20230426143856,{"$f":"ROW()","v":1021},"HEADACHE CENTER PLLC THE",null,null,"Lead",null,null,null,null,null,null,null,null,null,null,null,"Madison County, MS",true,true,true]
[null,20230426143857,{"$f":"ROW()","v":1022},"Healthcare Staffing Serv Inc",null,null,"Lead",null,null,null,null,null,null,null,null,null,null,null,"Miami-Dade County, FL",true,true,true]
[null,20230426143859,{"$f":"ROW()","v":1023},"Heather A Kerr ",null,null,"Lead",null,null,null,null,null,null,null,null,null,null,null,"Oakland County, MI",true,true,true]
[null,20230426143860,{"$f":"ROW()","v":1024},"Heather F Grady",null,null,"Lead",null,null,null,null,null,null,null,null,null,null,null,"Nassau County, FL",true,true,true]
[null,20230426143861,{"$f":"ROW()","v":1025},"HEAVENLY KIDS LLC",null,null,"Lead",null,null,null,null,null,null,null,null,null,null,null,"Cuyahoga County, OH",true,true,true]
[null,20230426143862,{"$f":"ROW()","v":1026},"Heidi H Hamelin ",null,null,"Lead",null,null,null,null,null,null,null,null,null,null,null,"Cook County, IL",true,true,true]
[null,20230426143863,{"$f":"ROW()","v":1027},"Hemstock Tree Care and Firewood Service LLC",null,null,"Lead",null,null,null,null,null,null,null,null,null,null,null,"Madison County, AL",true,true,true]
[null,20230426143864,{"$f":"ROW()","v":1028},"HENDERSON MARIAH ",null,null,"Lead",null,null,null,null,null,null,null,null,null,null,null,"Montgomery County, OH",true,true,true]
[null,20230426143865,{"$f":"ROW()","v":1029},"Henley Dolmon","","Returned - No such number","Lead","MailList15","ourtaxemail@yahoo.com","henleydolmon@gmail.com","simplesolutiontaxes@gmail.com","(901) 550-6116","(901) 207-4898","(901) 305-6184","8674 Valmont Circle","Memphis","TN",38114,null,false,false,false]
[null,20230426143866,{"$f":"ROW()","v":1030},"Henry A Bailey ",null,null,"Lead",null,null,null,null,null,null,null,null,null,null,null,"Charleston County, SC",true,true,true]
[null,20230426143867,{"$f":"ROW()","v":1031},"Henry D Summers ",null,null,"Lead",null,null,null,null,null,null,null,null,null,null,null,"Cobb County, GA",true,true,true]
[null,20230426143868,{"$f":"ROW()","v":1032},"HENZEY WENDY A",null,null,"Lead",null,null,null,null,null,null,null,null,null,null,null,"Cuyahoga County, OH",true,true,true]
[null,20230426143869,{"$f":"ROW()","v":1033},"HENZEY WILLIAM R",null,null,"Lead",null,null,null,null,null,null,null,null,null,null,null,"Cuyahoga County, OH",true,true,true]
[null,20230426143870,{"$f":"ROW()","v":1034},"Herbert Hechenbichler ",null,null,"Lead",null,null,null,null,null,null,null,null,null,null,null,"Cobb County, GA",true,true,true]
[null,20230426143871,{"$f":"ROW()","v":1035},"Herbert J Strather ",null,null,"Lead",null,null,null,null,"(313) 407-4930","(850) 668-6547","(313) 393-5531",null,null,null,null,"Wayne County, MI",true,false,false]
[null,20230426143872,{"$f":"ROW()","v":1036},"Herbert Jefferson ",null,null,"Lead",null,null,null,null,null,null,null,null,null,null,null,"Cobb County, GA",true,true,true]
[null,20230426143873,{"$f":"ROW()","v":1037},"Herbert L Goldberg ",null,null,"Lead",null,null,null,null,null,null,null,null,null,null,null,"Cook County, IL",true,true,true]
[null,20230426143874,{"$f":"ROW()","v":1038},"Hey Angela Inc","Angela Wisniewski",null,"Lead","MailList15","wisniewski.angela@gmail.com",null,null,"(248) 470-8072","(248) 825-1067","(248) 203-1937","1361 Nicolet Pl","Detroit","MI",48207,"Wayne County, MI",false,false,false]
[null,20230426143875,{"$f":"ROW()","v":1039},"Hiagaty Omar ",null,null,"Lead",null,null,null,null,null,null,null,null,null,null,null,"Cook County, IL",true,true,true]
[null,20230426143876,{"$f":"ROW()","v":1040},"Hibachi Burger Oak Ridge","","","Lead",null,null,null,null,"(865) 685-0561",null,null,"138 Randolph Rd","Oak Ridge","TN","37830-5027",null,true,false,false]
[null,20230426143877,{"$f":"ROW()","v":1041},"Hidden Grill Bar-B-Que,, LLC","",null,"Lead",null,null,null,null,"","","","1400 10Th Ct","Phenix City","AL",36867,null,true,true,false]
[null,20230426143878,{"$f":"ROW()","v":1042},"HIESTAND JASON",null,null,"Lead",null,null,null,null,null,null,null,null,null,null,null,"Jefferson County, AL",true,true,true]
[null,20230426143879,{"$f":"ROW()","v":1043},"HIGDON NICK",null,null,"Lead",null,null,null,null,null,null,null,null,null,null,null,"Jefferson County, AL",true,true,true]
[null,20230426143880,{"$f":"ROW()","v":1044},"HIGGINS, THOMAS C",null,null,"Lead",null,null,null,null,null,null,null,null,null,null,null,"Lucas County, OH",true,true,true]
[null,20230426143881,{"$f":"ROW()","v":1045},"HIGHLAND PACKAGE STORE",null,null,"Lead",null,null,null,null,null,null,null,null,null,null,null,"Jefferson County, AL",true,true,true]
[null,20230426143882,{"$f":"ROW()","v":1046},"Hill Ebony R",null,null,"Lead",null,null,null,null,null,null,null,null,null,null,null,"Franklin County, OH",true,true,true]
[null,20230426143883,{"$f":"ROW()","v":1047},"HILL JANE E",null,null,"Lead",null,null,null,null,null,null,null,null,null,null,null,"Jefferson County, AL",true,true,true]
[null,20230426143884,{"$f":"ROW()","v":1048},"Hill Standard Works LLC",null,null,"Lead",null,null,null,null,null,null,null,null,null,null,null,"Macomb County, MI",true,true,true]
[null,20230426143885,{"$f":"ROW()","v":1049},"HIRBAWI5166 INC",null,null,"Lead",null,null,null,null,null,null,null,null,null,null,null,"Cuyahoga County, OH",true,true,true]
[null,20230426143886,{"$f":"ROW()","v":1050},"HITE, RICHARD A JR",null,null,"Lead",null,null,null,null,null,null,null,null,null,null,null,"Summit County, OH",true,true,true]
[null,20230426143887,{"$f":"ROW()","v":1051},"HJ and J TRUCKING",null,null,"Lead",null,null,null,null,null,null,null,null,null,null,null,"Monongalia County, VA",true,true,true]
[null,20230426143888,{"$f":"ROW()","v":1052},"Hobbs Brandon G",null,null,"Lead",null,null,null,null,null,null,null,null,null,null,null,"Franklin County, OH",true,true,true]
[null,20230426143889,{"$f":"ROW()","v":1053},"Holbrook Karen",null,null,"Lead",null,null,null,null,null,null,null,null,null,null,null,"Franklin County, OH",true,true,true]
[null,20230426143890,{"$f":"ROW()","v":1054},"Holiday Decorating Inc "," Michael P Schuster",null,"Lead",null,null,null,null,"(847) 891-4042","(847) 891-3625","(847) 345-2514"," 1908 Revere Lane ","Elk Grove Village","IL",60007,"Cook County, IL",true,false,false]
[null,20230426143891,{"$f":"ROW()","v":1055},"Hollis Arthur G",null,null,"Lead",null,null,null,null,null,null,null,null,null,null,null,"Cook County, IL",true,true,true]
[null,20230426143892,{"$f":"ROW()","v":1056},"Hong Kong Inn South Inc","Zhi Yong He",null,"Lead",null,null,null,null,"(313) 928-7711",null,null,"4245 Dix Hwy","Lincoln Park","MI",48146,"Wayne County, MI",true,false,false]
[null,20230426143894,{"$f":"ROW()","v":1057},"HOPEWELL BAPTIST CHURCH",null,null,"Lead",null,null,null,null,null,null,null,null,null,null,null,"Jefferson County, AL",true,true,true]
[null,20230426143895,{"$f":"ROW()","v":1058},"Hopienell Elliston ",null,null,"Lead",null,null,null,null,null,null,null,null,null,null,null,"Broward County, FL",true,true,true]
[null,20230426143896,{"$f":"ROW()","v":1059},"HOPP KEVIN D",null,null,"Lead",null,null,null,null,null,null,null,null,null,null,null,"Cuyahoga County, OH",true,true,true]
[null,20230426143897,{"$f":"ROW()","v":1060},"Hops N Guac Huntsville LLC",null,null,"Lead",null,null,null,null,null,null,null,null,null,null,null,"Madison County, AL",true,true,true]
[null,20230426143898,{"$f":"ROW()","v":1061},"Horvath Kenneth",null,null,"Lead",null,null,null,null,null,null,null,null,null,null,null,"Cook County, IL",true,true,true]
[null,20230426143899,{"$f":"ROW()","v":1062},"Hoskin Micheael",null,null,"Lead",null,null,null,null,null,null,null,null,null,null,null,"Cook County, IL",true,true,true]
[null,20230426143900,{"$f":"ROW()","v":1063},"HOWARD CRAIG A",null,null,"Lead",null,null,null,null,null,null,null,null,null,null,null,"Cuyahoga County, OH",true,true,true]
[null,20230426143901,{"$f":"ROW()","v":1064},"HOWARD DANIEL ",null,null,"Lead",null,null,null,null,null,null,null,null,null,null,null,"Montgomery County, OH",true,true,true]
[null,20230426143902,{"$f":"ROW()","v":1065},"Howard Industries Inc",null,null,"Lead",null,null,null,null,null,null,null,null,null,null,null,"Franklin County, OH",true,true,true]
[null,20230426143903,{"$f":"ROW()","v":1066},"HOWARD LARRY A ",null,null,"Lead",null,null,null,null,null,null,null,null,null,null,null,"Montgomery County, OH",true,true,true]
[null,20230426143904,{"$f":"ROW()","v":1067},"HOWARD ROBERT",null,null,"Lead",null,null,null,null,null,null,null,null,null,null,null,"Jefferson County, AL",true,true,true]
[null,20230426143905,{"$f":"ROW()","v":1068},"Howard Stein ",null,null,"Lead",null,null,null,null,null,null,null,null,null,null,null,"Cook County, IL",true,true,true]
[null,20230426143906,{"$f":"ROW()","v":1069},"HOWE PAUL J  ",null,null,"Lead",null,null,null,null,null,null,null,null,null,null,null,"Butler County, OH",true,true,true]
[null,20230426143907,{"$f":"ROW()","v":1070},"Hth Technical Agency Inc",null,null,"Lead",null,null,null,null,null,null,null,null,null,null,null,"Broward County, FL",true,true,true]
[null,20230426143908,{"$f":"ROW()","v":1071},"HUBBARD JEFFREY L",null,null,"Lead",null,null,null,null,null,null,null,null,null,null,null,"Monroe County, WV",true,true,true]
[null,20230426143909,{"$f":"ROW()","v":1072},"HUBBARD TAMMY L",null,null,"Lead",null,null,null,null,null,null,null,null,null,null,null,"Monroe County, WV",true,true,true]
[null,20230426143910,{"$f":"ROW()","v":1073},"HUGHES RIVER LAND MANGEMENT LLC",null,null,"Lead",null,null,null,null,null,null,null,null,null,null,null,"Jefferson County, AL",true,true,true]
[null,20230426143911,{"$f":"ROW()","v":1074},"HUGHES RIVER LAND SERVICES",null,null,"Lead",null,null,null,null,null,null,null,null,null,null,null,"Jefferson County, AL",true,true,true]
[null,20230426143912,{"$f":"ROW()","v":1075},"Hunter Land Worx LLC",null,null,"Lead",null,null,null,null,null,null,null,null,null,null,null,"Charleston County, SC",true,true,true]
[null,20230426143913,{"$f":"ROW()","v":1076},"HUNTER TRANSPORTATION LLC",null,null,"Lead",null,null,null,null,null,null,null,null,null,null,null,"Jefferson County, AL",true,true,true]
[null,20230426143914,{"$f":"ROW()","v":1077},"Huntsville Network For Urban School Renewal Inc",null,null,"Lead",null,null,null,null,null,null,null,null,null,null,null,"Madison County, AL",true,true,true]
[null,20230426143915,{"$f":"ROW()","v":1078},"HUTCHERSON TAMARA MOORE",null,null,"Lead",null,null,null,null,null,null,null,null,null,null,null,"Jefferson County, AL",true,true,true]
[null,20230426143916,{"$f":"ROW()","v":1079},"HUTSON NYCCOLE ",null,null,"Lead",null,null,null,null,null,null,null,null,null,null,null,"Montgomery County, OH",true,true,true]
[null,20230426143917,{"$f":"ROW()","v":1080},"Hyde and Swajanen PC  ",null,null,"Lead",null,null,null,null,null,null,null,null,null,null,null,"Marquette County, MI",true,true,true]
[null,20230426143918,{"$f":"ROW()","v":1081},"I and S Medical Llc",null,null,"Lead","MailList10","sstallings@insightbb.com",null,null,"(502) 409-6665","(502) 240-0083","(502) 377-4342"," 10920 Plantside Dr"," Ky",null,null,"Jefferson County, KY",false,false,false]
[null,20230426143919,{"$f":"ROW()","v":1082},"Iacobucci Stacy J",null,null,"Lead",null,null,null,null,null,null,null,null,null,null,null,"Franklin County, OH",true,true,true]
[null,20230426143920,{"$f":"ROW()","v":1083},"Ian S Kerr ",null,null,"Lead",null,null,null,null,null,null,null,null,null,null,null,"Oakland County, MI",true,true,true]
[null,20230426143921,{"$f":"ROW()","v":1084},"Ibrahim V Morris ",null,null,"Lead","MailList10","valdes38cuba@hotmail.com","gia18cuba@gmail.com","ibrahim.valdes@yahoo.com","(502) 802-1578","(502) 749-1039","(502) 409-1044","16900 Empire Ct","Louisville","KY",40245,null,false,false,false]
[null,20230426143922,{"$f":"ROW()","v":1085},"Idah Enyong ",null,null,"Lead",null,null,null,null,null,null,null,null,null,null,null,"Cobb County, GA",true,true,true]
[null,20230426143923,{"$f":"ROW()","v":1086},"IES Sales And Service LLC",null,null,"Lead",null,null,null,null,null,null,null,null,null,null,null,"Miami-Dade County, FL",true,true,true]
[null,20230426143924,{"$f":"ROW()","v":1087},"IET SECURITY INC",null,null,"Lead",null,null,null,null,null,null,null,null,null,null,null,"Jefferson County, AL",true,true,true]
[null,20230426143925,{"$f":"ROW()","v":1088},"IJESON MEDICAL SERVICS",null,null,"Lead",null,null,null,null,null,null,null,null,null,null,null,"Jefferson County, AL",true,true,true]
[null,20230426143926,{"$f":"ROW()","v":1089},"IMPORT PERFORMANCE LLC",null,null,"Lead",null,null,null,null,null,null,null,null,null,null,null,"Harrison County, MS",true,true,true]
[null,20230426143927,{"$f":"ROW()","v":1090},"Industrial Farmhouse, LLC","",null,"Lead",null,null,null,null,"","","","140 Mack Morris Dr","Scottsboro","AL",35769,null,true,true,false]
[null,20230426143928,{"$f":"ROW()","v":1091},"Ingram Kim D Jones ",null,null,"Lead",null,null,null,null,null,null,null,null,null,null,null,"Cobb County, GA",true,true,true]
[null,20230426143929,{"$f":"ROW()","v":1092},"Intelligen LLC",null,null,"Lead",null,null,null,null,null,null,null,null,null,null,null,"Genesee County, MI",true,true,true]
[null,20230426143930,{"$f":"ROW()","v":1093},"Interstate Heating and Cooling Inc.","",null,"Lead",null,null,null,null,"","","","133 Windsor Ln","Pelham","AL",35124,null,true,true,false]
[null,20230426143931,{"$f":"ROW()","v":1094},"INTUIT MARKETING LLC",null,null,"Lead",null,null,null,null,null,null,null,null,null,null,null,"Jefferson County, AL",true,true,true]
[null,20230426143932,{"$f":"ROW()","v":1095},"Ira Hasson ",null,null,"Lead",null,null,null,null,null,null,null,null,null,null,null,"Miami-Dade County, FL",true,true,true]
[null,20230426143934,{"$f":"ROW()","v":1096},"IRBY DENROY",null,null,"Lead",null,null,null,null,null,null,null,null,null,null,null,"Jefferson County, AL",true,true,true]
[null,20230426143935,{"$f":"ROW()","v":1097},"Ironworks Banta ",null,null,"Lead",null,null,null,null,null,null,null,null,null,null,null,"Sussex County, NJ",true,true,true]
[null,20230426143936,{"$f":"ROW()","v":1098},"Isaac Ali ",null,null,"Lead",null,null,null,null,null,null,null,null,null,null,null,"Cook County, IL",true,true,true]
[null,20230426143937,{"$f":"ROW()","v":1099},"Isaac C Butler ",null,null,"Lead",null,null,null,null,null,null,null,null,null,null,null,"Rockdale County, GA",true,true,true]
[null,20230426143938,{"$f":"ROW()","v":1100},"Isaac J Johnson","","","Lead","MailList10","ijohnson@rocketmail.com","matownsel@yahoo.com",null,"(870) 514-9239","(901) 314-2959","(901) 239-8282","4084 Claudette Cv","Memphis","TN","38118-2117",null,false,false,false]
[null,20230426143939,{"$f":"ROW()","v":1101},"Iurie Blajin ",null,null,"Lead",null,null,null,null,null,null,null,null,null,null,null,"Cook County, IL",true,true,true]
[null,20230426143940,{"$f":"ROW()","v":1102},"Ivan Sanchez Sierra ",null,null,"Lead",null,null,null,null,null,null,null,null,null,null,null,"Cobb County, GA",true,true,true]
[null,20230426143941,{"$f":"ROW()","v":1103},"Ivan Santiago ",null,null,"Lead",null,null,null,null,null,null,null,null,null,null,null,"Cook County, IL",true,true,true]
[null,20230426143942,{"$f":"ROW()","v":1104},"Ivan Yovcher ",null,null,"Lead",null,null,null,null,null,null,null,null,null,null,null,"Cobb County, GA",true,true,true]
[null,20230426143943,{"$f":"ROW()","v":1105},"J and G Pallets Inc",null,null,"Lead","MailList10","info@jgpalletsandtrucking.com",null,null,"(313) 921-0222",null,null,"6500 Mack Avenue","Detroit","MI",48207,"Wayne County, MI",false,false,false]
[null,20230426143944,{"$f":"ROW()","v":1106},"J Aboud Llc","James Aboud",null,"Lead","MailList10","jimaboud@yahoo.com","ehroy@msn.com","james.aboudln51@yahoo.com","(248) 877-4903","(248) 722-6162","(248) 426-9798","1340 Losey Rd","Rives Junction","MI",49277,"Wayne County, MI",false,false,false]
[null,20230426143945,{"$f":"ROW()","v":1107},"J Alfredo Martinez Valle ",null,null,"Lead",null,null,null,null,null,null,null,null,null,null,null,"Cook County, IL",true,true,true]
[null,20230426143946,{"$f":"ROW()","v":1108},"J Brooks Construction","",null,"Lead",null,null,null,null,"","","","Po Box 1608","Andalusia","AL",36420,null,true,true,false]
[null,20230426143947,{"$f":"ROW()","v":1109},"J David Abraham ",null,null,"Lead",null,null,null,null,null,null,null,null,null,null,null,"Albany County, NY",true,true,true]
[null,20230426143948,{"$f":"ROW()","v":1110},"J G T Transportation Inc",null,null,"Lead",null,null,null,null,null,null,null,null,null,null,null,"Miami-Dade County, FL",true,true,true]
[null,20230426143949,{"$f":"ROW()","v":1111},"J Garcia Johnson ",null,null,"Lead",null,null,null,null,null,null,null,null,null,null,null,"Cook County, IL",true,true,true]
[null,20230426143950,{"$f":"ROW()","v":1112},"J P RICE COMPANY INC",null,null,"Lead",null,null,null,null,null,null,null,null,null,null,null,"Monroe County, WV",true,true,true]
[null,20230426143951,{"$f":"ROW()","v":1113},"J SCOTT ENTERPRISES INC",null,null,"Lead",null,null,null,null,null,null,null,null,null,null,null,"Jefferson County, AL",true,true,true]
[null,20230426143952,{"$f":"ROW()","v":1114},"J W Cabinets and Supply Inc",null,null,"Lead",null,null,null,null,null,null,null,null,null,null,null,"Mobile County, AL",true,true,true]
[null,20230426143953,{"$f":"ROW()","v":1115},"Jabari-Akil Pamela A",null,null,"Lead",null,null,null,null,null,null,null,null,null,null,null,"Cook County, IL",true,true,true]
[null,20230426143954,{"$f":"ROW()","v":1116},"Jac-Co Construction Inc,","","","Lead",null,null,null,null,"(901) 385-7496",null,null,"6243 Macon Rd","Memphis","TN",38134,null,true,false,false]
[null,20230426143955,{"$f":"ROW()","v":1117},"Jace Aran ",null,null,"Lead",null,null,null,null,null,null,null,null,null,null,null,"Mobile County, AL",true,true,true]
[null,20230426143956,{"$f":"ROW()","v":1118},"Jace L Aran ",null,null,"Lead",null,null,null,null,null,null,null,null,null,null,null,"Mobile County, AL",true,true,true]
[null,20230426143957,{"$f":"ROW()","v":1119},"Jack and Jill Inc","",null,"Lead",null,null,null,null,null,null,null,"","","","","Jackson County, MS",true,true,true]
[null,20230426143958,{"$f":"ROW()","v":1120},"Jack Fick Excavating Inc",null,null,"Lead",null,null,null,null,null,null,null,null,null,null,null,"Genesee County, MI",true,true,true]
[null,20230426143959,{"$f":"ROW()","v":1121},"Jackie Manescala ",null,null,"Lead",null,null,null,null,null,null,null,"1920 West North B Street ","Tampa","FL",33606,"Hillsborough County, FL",true,true,false]
[null,20230426143960,{"$f":"ROW()","v":1122},"Jackson Juan",null,null,"Lead",null,null,null,null,null,null,null,null,null,null,null,"Cook County, IL",true,true,true]
[null,20230426143961,{"$f":"ROW()","v":1123},"JACKSON TAMIKA M",null,null,"Lead",null,null,null,null,null,null,null,null,null,null,null,"Cuyahoga County, OH",true,true,true]
[null,20230426143962,{"$f":"ROW()","v":1124},"Jacqueline L White ",null,null,"Lead",null,null,null,null,null,null,null,null,null,null,null,"Mobile County, AL",true,true,true]
[null,20230426143963,{"$f":"ROW()","v":1125},"Jaime Arroyo","",null,"Lead",null,null,null,null,null,null,null,"","","","","Jackson County, MS",true,true,true]
[null,20230426143964,{"$f":"ROW()","v":1126},"Jairo Demenezes ",null,null,"Lead",null,null,null,null,null,null,null,null,null,null,null,"Cobb County, GA",true,true,true]
[null,20230426143965,{"$f":"ROW()","v":1127},"Jaletha A Smith ",null,null,"Lead","MailList10","jasmith@carlson.com","micahmekhi@yahoo.com",null,"(313) 865-1902","(313) 881-5488","(313) 893-2253","1933 Pasadena St","Detroit","MI",48238,"Wayne County, MI",false,false,false]
[null,20230426143966,{"$f":"ROW()","v":1128},"James and Sandra Dunkin","","30 2018/19 $26,326.27","Lead","MailList10","jasiano@yahoo.com","lasiano@aol.com",null,"(415) 830-6466","(415) 384-8283","(415) 388-2144","938 N Linden Dr","Alcoa","TN",37701,null,false,false,false]
[null,20230426143967,{"$f":"ROW()","v":1129},"James and Susan M Edwards","",null,"Lead","MailList10","acjames52@yahoo.com","act@earthlink.net","acjames@needspeed.com","(901) 921-3982","(901) 867-9881","(901) 336-3718","2642 Altruria Rd","Bartlett","TN",38134,null,false,false,false]
[null,20230426143968,{"$f":"ROW()","v":1130},"James A Lenocker ",null,null,"Lead",null,null,null,null,null,null,null,null,null,null,null,"Cobb County, GA",true,true,true]
[null,20230426143969,{"$f":"ROW()","v":1131},"JAMES C SPELLS",null,null,"Lead",null,null,null,null,null,null,null,null,null,null,null,"Hamilton County, OH",true,true,true]
[null,20230426143970,{"$f":"ROW()","v":1132},"JAMES CATO, RITA T",null,null,"Lead",null,null,null,null,null,null,null,null,null,null,null,"Summit County, OH",true,true,true]
[null,20230426143971,{"$f":"ROW()","v":1133},"James Chiodini ",null,null,"Lead",null,null,null,null,null,null,null,null,null,null,null,"Macomb County, MI",true,true,true]
[null,20230426143972,{"$f":"ROW()","v":1134},"James Dawson ",null,null,"Lead",null,null,null,null,null,null,null,null,null,null,null,"Cobb County, GA",true,true,true]
[null,20230426143973,{"$f":"ROW()","v":1135},"James E Youngs ",null,null,"Lead",null,null,null,null,null,null,null,null,null,null,null,"Cook County, IL",true,true,true]
[null,20230426143974,{"$f":"ROW()","v":1136},"James Emerick ",null,null,"Lead",null,null,null,null,null,null,null,null,null,null,null,"Macomb County, MI",true,true,true]
[null,20230426143975,{"$f":"ROW()","v":1137},"James F Hemer ",null,null,"Lead","MailList10","khemmer@scboces.org",null,null,"(845) 475-4591","(845) 482-4966","(845) 482-5675","Po Box 374","Youngsville","NY",12791,"Cook County, IL",false,false,false]
[null,20230426143976,{"$f":"ROW()","v":1138},"James Henderson ",null,null,"Lead",null,null,null,null,null,null,null,null,null,null,null,"Macomb County, MI",true,true,true]
[null,20230426143977,{"$f":"ROW()","v":1139},"James K Kolke ",null,null,"Lead",null,null,null,null,null,null,null,null,null,null,null,"Cook County, IL",true,true,true]
[null,20230426143978,{"$f":"ROW()","v":1140},"James Lenocker ",null,null,"Lead",null,null,null,null,null,null,null,null,null,null,null,"Cobb County, GA",true,true,true]
[null,20230426143979,{"$f":"ROW()","v":1141},"James M Gavin ",null,null,"Lead","MailList10","jamesgavin@outlook.com","jimgym61@aol.com",null,"(262) 820-2762","(262) 650-9258","(414) 650-9258","821 Colchester Dr","Oswego","IL",60543,"Cook County, IL",false,false,false]
[null,20230426143980,{"$f":"ROW()","v":1142},"James M Obrien ",null,null,"Lead",null,null,null,null,null,null,null,null,null,null,null,"Cook County, IL",true,true,true]
[null,20230426143981,{"$f":"ROW()","v":1143},"James Marion Duncan ","Signtech Industries Llc ",null,"Lead","MailList10","md@signtechindustries.com",null,null,"(803) 794-4207",null,null,"106-b White Oak Ln","Lexington","SC",29073,"Lexington County, SC",false,false,false]
[null,20230426143982,{"$f":"ROW()","v":1144},"James Martin ","",null,"Lead",null,null,null,null,null,null,null,"","","","","Jackson County, MS",true,true,true]
[null,20230426143983,{"$f":"ROW()","v":1145},"James R Erwin ",null,null,"Lead",null,null,null,null,null,null,null,null,null,null,null,"Madison County, AL",true,true,true]
[null,20230426143984,{"$f":"ROW()","v":1146},"James R Maiuri ",null,null,"Lead",null,null,null,null,null,null,null,null,null,null,null,"Macomb County, MI",true,true,true]
[null,20230426143985,{"$f":"ROW()","v":1147},"James Rodwell ",null,null,"Lead",null,null,null,null,null,null,null,null,null,null,null,"Cook County, IL",true,true,true]
[null,20230426143986,{"$f":"ROW()","v":1148},"James W Thompson","","","Lead","MailList10","jrt879@bigfoot.com","marriel_thompson@yahoo.com",null,"(901) 463-0744","(901) 465-8762","(901) 387-9923","801 Meda St","Memphis","TN",38104,null,false,false,false]
[null,20230426143987,{"$f":"ROW()","v":1149},"James Williams ",null,null,"Lead",null,null,null,null,null,null,null,null,null,null,null,"Charleston County, SC",true,true,true]
[null,20230426143988,{"$f":"ROW()","v":1150},"JANAY L HARPER DPM PLLC",null,null,"Lead",null,null,null,null,null,null,null,null,null,null,null,"Madison County, MS",true,true,true]
[null,20230426143989,{"$f":"ROW()","v":1151},"Janet A Coventry ",null,null,"Lead",null,null,null,null,null,null,null,null,null,null,null,"Macomb County, MI",true,true,true]
[null,20230426143990,{"$f":"ROW()","v":1152},"Janet A Mesen ",null,null,"Lead",null,null,null,null,null,null,null,null,null,null,null,"Pinellas County, FL",true,true,true]
[null,20230426143991,{"$f":"ROW()","v":1153},"Janet E Melville ",null,null,"Lead",null,null,null,null,null,null,null,null,null,null,null,"Broward County, FL",true,true,true]
[null,20230426143992,{"$f":"ROW()","v":1154},"Janet F Tyra ",null,null,"Lead","MailList10","goldiechristensen@netzero.net","jtyra@bellsouth.net","drtcleaning@aol.com","(734) 673-5958","(734) 710-9933","(734) 927-9640","6140 Central St","Romulus","MI",48174,"Wayne County, MI",false,false,false]
[null,20230426143993,{"$f":"ROW()","v":1155},"Japs Logistics Inc",null,null,"Lead",null,null,null,null,null,null,null,null,null,null,null,"Miami-Dade County, FL",true,true,true]
[null,20230426143994,{"$f":"ROW()","v":1156},"JARROD D NICHOLS PC",null,null,"Lead",null,null,null,null,null,null,null,null,null,null,null,"Jefferson County, AL",true,true,true]
[null,20230426143995,{"$f":"ROW()","v":1157},"Jarrod D Nichols PC, Inc.","",null,"Lead",null,null,null,null,"(205) 504-4100","(205) 587-0051","(205) 870-3356","Po Box 360186","Birmingham","AL",35236,null,true,false,false]
[null,20230426143996,{"$f":"ROW()","v":1158},"Jarvis Family Medical Services","",null,"Lead",null,null,null,null,"(502) 822-3659",null,null,"914 Lily Creek Rd Suite 200 201","Louisville","KY",40243,null,true,false,false]
[null,20230426143997,{"$f":"ROW()","v":1159},"Jasmin Dipa ","",null,"Lead","MailList10","jdipa@msn.com",null,null,"(502) 471-9204","(502) 495-6249","(502) 267-1219"," 3903 Jefferson Park Pl","Louisville","KY",40299,null,false,false,false]
[null,20230426143998,{"$f":"ROW()","v":1160},"Jason C Phillips ",null,null,"Lead",null,null,null,null,null,null,null,null,null,null,null,"Hillsborough County, FL",true,true,true]
[null,20230426143999,{"$f":"ROW()","v":1161},"Jason Colonno ",null,null,"Lead",null,null,null,null,null,null,null,null,null,null,null,"Sussex County, NJ",true,true,true]
[null,20230426144000,{"$f":"ROW()","v":1162},"Jason Pillow ",null,null,"Lead",null,null,null,null,null,null,null,null,null,null,null,"Cook County, IL",true,true,true]
[null,20230426144001,{"$f":"ROW()","v":1163},"Jason Smothers ",null,null,"Lead","MailList10","smohigh247@gmail.com",null,null,"(618) 964-5489","(618) 952-0109","(618) 937-2606","603 N Horn St","West Frankfort","IL",62896,"Cook County, IL",false,false,false]
[null,20230426144002,{"$f":"ROW()","v":1164},"Jauregui P C Arturo ",null,null,"Lead",null,null,null,null,null,null,null,null,null,null,null,"Cook County, IL",true,true,true]
[null,20230426144003,{"$f":"ROW()","v":1165},"Javier E Ball ",null,null,"Lead",null,null,null,null,null,null,null,null,null,null,null,"Broward County, FL",true,true,true]
[null,20230426144004,{"$f":"ROW()","v":1166},"Javier E Hernandez ",null,null,"Lead",null,null,null,null,null,null,null,null,null,null,null,"Pinellas County, FL",true,true,true]
[null,20230426144005,{"$f":"ROW()","v":1167},"Javier Ortiz ",null,null,"Lead",null,null,null,null,null,null,null,null,null,null,null,"Miami-Dade County, FL",true,true,true]
[null,20230426144006,{"$f":"ROW()","v":1168},"Jay E Hornacek ",null,null,"Lead",null,null,null,null,null,null,null,null,null,null,null,"Cook County, IL",true,true,true]
[null,20230426144007,{"$f":"ROW()","v":1169},"Jayda G LLC",null,null,"Lead",null,null,null,null,null,null,null,null,null,null,null,"Charleston County, SC",true,true,true]
[null,20230426144008,{"$f":"ROW()","v":1170},"Jaz Inc",null,null,"Lead",null,null,null,null,null,null,null,null,null,null,null,"Franklin County, OH",true,true,true]
[null,20230426144009,{"$f":"ROW()","v":1171},"Jeanette Currence",null,null,"Lead",null,null,null,null,null,null,null,null,null,null,null,"DeSoto County, MS",true,true,true]
[null,20230426144011,{"$f":"ROW()","v":1172},"Jeanette L Blasius ",null,null,"Lead","MailList10","jblasius@communityalliancecu.org",null,null,"(734) 788-0598","(734) 467-8198","(734) 737-9398","17620 Woodside St","Livonia","MI",48152,"Wayne County, MI",false,false,false]
[null,20230426144012,{"$f":"ROW()","v":1173},"Jeanine M Smith ",null,null,"Lead",null,null,null,null,null,null,null,null,null,null,null,"Cook County, IL",true,true,true]
[null,20230426144013,{"$f":"ROW()","v":1174},"Jee H Kim ",null,null,"Lead","MailList10","jkim17@adelphia.net","jkim@charter.net","jkim17@roadrunner.com","(661) 565-5188","(630) 922-6927","(626) 639-3676","251 S Mariposa St","Burbank","CA",91506,"Cook County, IL",false,false,false]
[null,20230426144014,{"$f":"ROW()","v":1175},"Jeffery Lantz ",null,null,"Lead",null,null,null,null,null,null,null,null,null,null,null,"Oakland County, MI",true,true,true]
[null,20230426144015,{"$f":"ROW()","v":1176},"Jeffery S Fendt ",null,null,"Lead",null,null,null,null,null,null,null,null,null,null,null,"Cook County, IL",true,true,true]
[null,20230426144016,{"$f":"ROW()","v":1177},"Jeffrey A Rosenberg ",null,null,"Lead",null,null,null,null,null,null,null,null,null,null,null,"Broward County, FL",true,true,true]
[null,20230426144017,{"$f":"ROW()","v":1178},"Jeffrey J Levine ",null,null,"Lead",null,null,null,null,null,null,null,null,null,null,null,"Cook County, IL",true,true,true]
[null,20230426144018,{"$f":"ROW()","v":1179},"Jeffrey J Schmidt ",null,null,"Lead",null,null,null,null,null,null,null,null,null,null,null,"Genesee County, MI",true,true,true]
[null,20230426144019,{"$f":"ROW()","v":1180},"Jeffrey M Seymour ",null,null,"Lead",null,null,null,null,null,null,null,null,null,null,null,"Pinellas County, FL",true,true,true]
[null,20230426144020,{"$f":"ROW()","v":1181},"Jeffry D Knight ",null,null,"Lead",null,null,null,null,null,null,null,null,null,null,null,"Pinellas County, FL",true,true,true]
[null,20230426144021,{"$f":"ROW()","v":1182},"Jenkins Construction Inc",null,null,"Lead","MailList10","domains@interventionmedia.com","interventionmedia@yahoo.com","jim.jenkins@jenkinsconstruction.com","(313) 625-7200","(248) 352-8359","(248) 352-8348","985 E Jefferson Ave #300","Detroit","MI",48207,"Wayne County, MI",false,false,false]
[null,20230426144022,{"$f":"ROW()","v":1183},"JENKINS, JUSTIN",null,null,"Lead",null,null,null,null,null,null,null,null,null,null,null,"Loraine County, OH",true,true,true]
[null,20230426144023,{"$f":"ROW()","v":1184},"JENKINS, VICTORIA",null,null,"Lead",null,null,null,null,null,null,null,null,null,null,null,"Loraine County, OH",true,true,true]
[null,20230426144024,{"$f":"ROW()","v":1185},"Jennifer A Gonska ",null,null,"Lead",null,null,null,null,null,null,null,null,null,null,null,"Horry County, SC",true,true,true]
[null,20230426144025,{"$f":"ROW()","v":1186},"JENNIFER COBB",null,null,"Lead",null,null,null,null,null,null,null,null,null,null,null,"Hamilton County, OH",true,true,true]
[null,20230426144026,{"$f":"ROW()","v":1187},"Jennifer Crane ",null,null,"Lead",null,null,null,null,null,null,null,null,null,null,null,"Charleston County, SC",true,true,true]
[null,20230426144027,{"$f":"ROW()","v":1188},"Jennifer Hartman ",null,null,"Lead",null,null,null,null,null,null,null,null,null,null,null,"Cobb County, GA",true,true,true]
[null,20230426144028,{"$f":"ROW()","v":1189},"Jennifer Kee-Berrebi ",null,null,"Lead",null,null,null,null,null,null,null,"16115 Churchview Dr","Lithia","FL",33547,"Hillsborough County, FL",true,true,false]
[null,20230426144029,{"$f":"ROW()","v":1190},"JENNIFER M MARTIN",null,null,"Lead",null,null,null,null,null,null,null,null,null,null,null,"Hamilton County, OH",true,true,true]
[null,20230426144030,{"$f":"ROW()","v":1191},"Jennifer Trinca-Pasat ",null,null,"Lead",null,null,null,null,null,null,null,null,null,null,null,"Cook County, IL",true,true,true]
[null,20230426144031,{"$f":"ROW()","v":1192},"Jeon Seon S",null,null,"Lead",null,null,null,null,null,null,null,null,null,null,null,"Franklin County, OH",true,true,true]
[null,20230426144032,{"$f":"ROW()","v":1193},"Jerbich Michael",null,null,"Lead",null,null,null,null,null,null,null,null,null,null,null,"Cook County, IL",true,true,true]
[null,20230426144033,{"$f":"ROW()","v":1194},"Jeremy B Smith ",null,null,"Lead",null,null,null,null,null,null,null,null,null,null,null,"Cobb County, GA",true,true,true]
[null,20230426144034,{"$f":"ROW()","v":1195},"Jeremy D Duncan ",null,null,"Lead",null,null,null,null,null,null,null,null,null,null,null,"Pinellas County, FL",true,true,true]
[null,20230426144035,{"$f":"ROW()","v":1196},"Jeremy Kruska ",null,null,"Lead",null,null,null,null,null,null,null,null,null,null,null,"Charleston County, SC",true,true,true]
[null,20230426144036,{"$f":"ROW()","v":1197},"Jerold Loftin","",null,"Lead","MailList10","jhle40@aol.com","thiagovaladao@zipmail.com.br","jagcheezy@yahoo.com","(901) 751-0078","(210) 289-6648","(901) 828-6392","4746 Harvest Park Dr","Memphis","TN","38125-4767",null,false,false,false]
[null,20230426144037,{"$f":"ROW()","v":1198},"Jerome A Desantis ",null,null,"Lead",null,null,null,null,null,null,null,null,null,null,null,"Macomb County, MI",true,true,true]
[null,20230426144038,{"$f":"ROW()","v":1199},"Jerome A James ",null,null,"Lead","MailList10","jajames1957@yahoo.com","jeromejames@address.com","qjerome.jamesv69@eudoramail.com","(773) 504-2278","(909) 864-9582","(909) 574-7254","6245 Garden View Ln","Matteson","IL",60443,"Cook County, IL",false,false,false]
[null,20230426144039,{"$f":"ROW()","v":1200},"Jerron C Jones ",null,null,"Lead","MailList10","jerronjones@yahoo.com","jcortezjones@hotmail.com",null,"(502) 291-2893","(502) 298-8825","(502) 299-2405","9109 Big Boulder Dr","Louisville","KY",40291,null,false,false,false]
[null,20230426144040,{"$f":"ROW()","v":1201},"Jerry D Gardner ",null,null,"Lead","MailList10","marie122156@gmail.com",null,null,"(231) 893-4037","(734) 572-7313","(248) 344-0981","11334 Lamos Rd","Montague","MI",49437,null,false,false,false]
[null,20230426144041,{"$f":"ROW()","v":1202},"Jerry Praytor Jr",null,null,"Lead",null,null,null,null,null,null,null,null,null,null,null,"Cullman County, AL",true,true,true]
[null,20230426144042,{"$f":"ROW()","v":1203},"Jessica Carvalho ",null,null,"Lead",null,null,null,null,null,null,null,null,null,null,null,"Broward County, FL",true,true,true]
[null,20230426144043,{"$f":"ROW()","v":1204},"Jessie Mathews ",null,null,"Lead",null,null,null,null,null,null,null,null,null,null,null,"Cobb County, GA",true,true,true]
[null,20230426144044,{"$f":"ROW()","v":1205},"Jesus A Davila ",null,null,"Lead",null,null,null,null,null,null,null,null,null,null,null,"Miami-Dade County, FL",true,true,true]
[null,20230426144046,{"$f":"ROW()","v":1206},"Jewel D Braxton ",null,null,"Lead",null,null,null,null,null,null,null,null,null,null,null,"Cook County, IL",true,true,true]
[null,20230426144047,{"$f":"ROW()","v":1207},"Jewel Lewis ",null,null,"Lead",null,null,null,null,null,null,null,null,null,null,null,"Cook County, IL",true,true,true]
[null,20230426144048,{"$f":"ROW()","v":1208},"JEWISH SOUTH INC",null,null,"Lead",null,null,null,null,null,null,null,null,null,null,null,"Jefferson County, AL",true,true,true]
[null,20230426144049,{"$f":"ROW()","v":1209},"Jewusiak Const Inc",null,null,"Lead",null,null,null,null,null,null,null,null,null,null,null,"Cook County, IL",true,true,true]
[null,20230426144050,{"$f":"ROW()","v":1210},"JILES RAYMOND",null,null,"Lead",null,null,null,null,null,null,null,null,null,null,null,"Jefferson County, AL",true,true,true]
[null,20230426144051,{"$f":"ROW()","v":1211},"Jill A Johnson ",null,null,"Lead",null,null,null,null,null,null,null,null,null,null,null,"Oakland County, MI",true,true,true]
[null,20230426144052,{"$f":"ROW()","v":1212},"JIM F OROS JR PC",null,null,"Lead",null,null,null,null,null,null,null,null,null,null,null,"Jefferson County, AL",true,true,true]
[null,20230426144053,{"$f":"ROW()","v":1213},"Jingia C Hwang ",null,null,"Lead",null,null,null,null,null,null,null,null,null,null,null,"Volusia County, FL",true,true,true]
[null,20230426144054,{"$f":"ROW()","v":1214},"JL Cizek Inc",null,null,"Lead",null,null,null,null,null,null,null,null,null,null,null,"Marquette County, MI",true,true,true]
[null,20230426144055,{"$f":"ROW()","v":1215},"Joan C Huell ","Stanley H Huell ",null,"Lead","MailList10","stanhuell@gmail.com","jchuell@gmail.com",null,"(803) 732-3672","(803) 206-9948","(803) 732-6242","221 Gleneagle Cir","Irmo","SC",29063,"Lexington County, SC",false,false,false]
[null,20230426144056,{"$f":"ROW()","v":1216},"Joannette Salas-Hernandez ",null,null,"Lead",null,null,null,null,null,null,null,null,null,null,null,"Broward County, FL",true,true,true]
[null,20230426144057,{"$f":"ROW()","v":1217},"JOCEK JAMES",null,null,"Lead",null,null,null,null,null,null,null,null,null,null,null,"Cuyahoga County, OH",true,true,true]
[null,20230426144058,{"$f":"ROW()","v":1218},"Jocelin Savage ",null,null,"Lead",null,null,null,null,null,null,null,null,null,null,null,"Cobb County, GA",true,true,true]
[null,20230426144059,{"$f":"ROW()","v":1219},"Jocelyn Martinez ",null,null,"Lead",null,null,null,null,null,null,null,null,null,null,null,"Cook County, IL",true,true,true]
[null,20230426144060,{"$f":"ROW()","v":1220},"Jodi A Zaremski ",null,null,"Lead",null,null,null,null,null,null,null,null,null,null,null,"Sussex County, NJ",true,true,true]
[null,20230426144061,{"$f":"ROW()","v":1221},"Joeys Landscaping LLC",null,null,"Lead",null,null,null,null,null,null,null,null,null,null,null,"Charleston County, SC",true,true,true]
[null,20230426144062,{"$f":"ROW()","v":1222},"John D Cannon ",null,null,"Lead",null,null,null,null,null,null,null,null,null,null,null,"Macomb County, MI",true,true,true]
[null,20230426144063,{"$f":"ROW()","v":1223},"John David Wheeler, Et Al","",null,"Lead",null,null,null,null,null,null,null,"","","","","DeSoto County, MS",true,true,true]
[null,20230426144064,{"$f":"ROW()","v":1224},"John F Leydon ",null,null,"Lead",null,null,null,null,null,null,null,null,null,null,null,"Cook County, IL",true,true,true]
[null,20230426144065,{"$f":"ROW()","v":1225},"John F Tumey ",null,null,"Lead",null,null,null,null,null,null,null,null,null,null,null,"Charleston County, SC",true,true,true]
[null,20230426144066,{"$f":"ROW()","v":1226},"John G Barnes ",null,null,"Lead",null,null,null,null,null,null,null,null,null,null,null,"Charleston County, SC",true,true,true]
[null,20230426144067,{"$f":"ROW()","v":1227},"John K Muriithi ",null,null,"Lead",null,null,null,null,null,null,null,null,null,null,null,"Cobb County, GA",true,true,true]
[null,20230426144068,{"$f":"ROW()","v":1228},"John M Bessinger ",null,null,"Lead",null,null,null,null,null,null,null,null,null,null,null,"Horry County, SC",true,true,true]
[null,20230426144069,{"$f":"ROW()","v":1229},"John M Riley ","",null,"Lead",null,null,null,null,null,null,null,"","","","","Jackson County, MS",true,true,true]
[null,20230426144070,{"$f":"ROW()","v":1230},"John Molony ",null,null,"Lead",null,null,null,null,null,null,null,null,null,null,null,"Charleston County, SC",true,true,true]
[null,20230426144071,{"$f":"ROW()","v":1231},"John N Sigalos ",null,null,"Lead",null,null,null,null,null,null,null,null,null,null,null,"Cook County, IL",true,true,true]
[null,20230426144072,{"$f":"ROW()","v":1232},"John P Cesario ",null,null,"Lead",null,null,null,null,null,null,null,null,null,null,null,"Cook County, IL",true,true,true]
[null,20230426144073,{"$f":"ROW()","v":1233},"John P Cronin",null,null,"Lead",null,null,null,null,"(630) 833-2181","(312) 399-1555","(630) 790-0640","28 Windsor Dr","Elmhurst","IL",60126,"Cook County, IL",true,false,false]
[null,20230426144074,{"$f":"ROW()","v":1234},"John P Cronin ",null,null,"Lead",null,null,null,null,null,null,null,null,null,null,null,"Cook County, IL",true,true,true]
[null,20230426144075,{"$f":"ROW()","v":1235},"John P Leonard ",null,null,"Lead",null,null,null,null,null,null,null,null,null,null,null,"Sussex County, NJ",true,true,true]
[null,20230426144076,{"$f":"ROW()","v":1236},"John P Ryan ",null,null,"Lead",null,null,null,null,null,null,null,null,null,null,null,"Broward County, FL",true,true,true]
[null,20230426144077,{"$f":"ROW()","v":1237},"John P Thompson ",null,null,"Lead",null,null,null,null,null,null,null,null,null,null,null,"Sussex County, NJ",true,true,true]
[null,20230426144078,{"$f":"ROW()","v":1238},"John R Fick ",null,null,"Lead",null,null,null,null,null,null,null,null,null,null,null,"Genesee County, MI",true,true,true]
[null,20230426144079,{"$f":"ROW()","v":1239},"John R Hewitt ",null,null,"Lead",null,null,null,null,null,null,null,null,null,null,null,"Cobb County, GA",true,true,true]
[null,20230426144080,{"$f":"ROW()","v":1240},"John Ramos ",null,null,"Lead",null,null,null,null,null,null,null,null,null,null,null,"Broward County, FL",true,true,true]
[null,20230426144081,{"$f":"ROW()","v":1241},"John S Gentry ",null,null,"Lead",null,null,null,null,null,null,null,null,null,null,null,"Cook County, IL",true,true,true]
[null,20230426144082,{"$f":"ROW()","v":1242},"John S Iii Beasley ",null,null,"Lead",null,null,null,null,null,null,null,null,null,null,null,"Cobb County, GA",true,true,true]
[null,20230426144083,{"$f":"ROW()","v":1243},"John T Ii Howze ",null,null,"Lead",null,null,null,null,null,null,null,null,null,null,null,"Macomb County, MI",true,true,true]
[null,20230426144084,{"$f":"ROW()","v":1244},"John W Reid ",null,null,"Lead","MailList10","mule73@hotmail.com","reid.sem@gmail.com","johnlreid@worldnet.att.net","(847) 234-4010","(847) 337-8240","(217) 328-2934","700 Woodlawn Ave","Lake Forest","IL",60045,"Cook County, IL",false,false,false]
[null,20230426144085,{"$f":"ROW()","v":1245},"Johnson Andre D",null,null,"Lead",null,null,null,null,null,null,null,null,null,null,null,"Franklin County, OH",true,true,true]
[null,20230426144086,{"$f":"ROW()","v":1246},"JOHNSON ANTHONY M DR MD INC",null,null,"Lead",null,null,null,null,null,null,null,null,null,null,null,"Cuyahoga County, OH",true,true,true]
[null,20230426144087,{"$f":"ROW()","v":1247},"JOHNSON DENISE",null,null,"Lead",null,null,null,null,null,null,null,null,null,null,null,"Madison County, MS",true,true,true]
[null,20230426144088,{"$f":"ROW()","v":1248},"Johnson Donald J",null,null,"Lead",null,null,null,null,null,null,null,null,null,null,null,"Cook County, IL",true,true,true]
[null,20230426144089,{"$f":"ROW()","v":1249},"JOHNSON MELANIE",null,null,"Lead",null,null,null,null,null,null,null,null,null,null,null,"Jefferson County, AL",true,true,true]
[null,20230426144090,{"$f":"ROW()","v":1250},"JOHNSON RON E",null,null,"Lead",null,null,null,null,null,null,null,null,null,null,null,"Harrison County, MS",true,true,true]
[null,20230426144092,{"$f":"ROW()","v":1251},"Johnson Ronnie R",null,null,"Lead",null,null,null,null,null,null,null,null,null,null,null,"Franklin County, OH",true,true,true]
[null,20230426144093,{"$f":"ROW()","v":1252},"JOHNSTON SAMUEL A ",null,null,"Lead",null,null,null,null,null,null,null,null,null,null,null,"Montgomery County, OH",true,true,true]
[null,20230426144094,{"$f":"ROW()","v":1253},"Jonathan K Gauntt ",null,null,"Lead",null,null,null,null,null,null,null,null,null,null,null,"Cook County, IL",true,true,true]
[null,20230426144095,{"$f":"ROW()","v":1254},"Jonathan Lewis ",null,null,"Lead",null,null,null,null,null,null,null,null,null,null,null,"Cobb County, GA",true,true,true]
[null,20230426144096,{"$f":"ROW()","v":1255},"Jonathan Schoop ",null,null,"Lead",null,null,null,null,null,null,null,null,null,null,null,"Broward County, FL",true,true,true]
[null,20230426144097,{"$f":"ROW()","v":1256},"Jonathan V Rademacher",null,null,"Lead",null,null,null,null,null,null,null,null,null,null,null,"Muskegon County, MI",true,true,true]
[null,20230426144098,{"$f":"ROW()","v":1257},"Jones Gueilar L",null,null,"Lead",null,null,null,null,null,null,null,null,null,null,null,"Cook County, IL",true,true,true]
[null,20230426144099,{"$f":"ROW()","v":1258},"JONES JENNIFER ",null,null,"Lead",null,null,null,null,null,null,null,null,null,null,null,"Montgomery County, OH",true,true,true]
[null,20230426144100,{"$f":"ROW()","v":1259},"JONES ROBERT H ",null,null,"Lead",null,null,null,null,null,null,null,null,null,null,null,"Montgomery County, OH",true,true,true]
[null,20230426144101,{"$f":"ROW()","v":1260},"JONES, CARL",null,null,"Lead",null,null,null,null,null,null,null,null,null,null,null,"Summit County, OH",true,true,true]
[null,20230426144102,{"$f":"ROW()","v":1261},"JORDAN THOMAS G ",null,null,"Lead",null,null,null,null,null,null,null,null,null,null,null,"Montgomery County, OH",true,true,true]
[null,20230426144103,{"$f":"ROW()","v":1262},"JORDAN THOMAS G SR ",null,null,"Lead",null,null,null,null,null,null,null,null,null,null,null,"Montgomery County, OH",true,true,true]
[null,20230426144104,{"$f":"ROW()","v":1263},"Jordan W Rose",null,null,"Lead","MailList10","africanviolet12@yahoo.com",null,null,"(773) 580-5311","(262) 763-7936","(773) 338-6186","1918 N Wood St","Chicago","IL",60622,"Cook County, IL",false,false,false]
[null,20230426144105,{"$f":"ROW()","v":1264},"Jordan W Rose ",null,null,"Lead",null,null,null,null,null,null,null,null,null,null,null,"Cook County, IL",true,true,true]
[null,20230426144106,{"$f":"ROW()","v":1265},"Jose C Mendez ",null,null,"Lead",null,null,null,null,null,null,null,null,null,null,null,"Miami-Dade County, FL",true,true,true]
[null,20230426144107,{"$f":"ROW()","v":1266},"Jose G Perez ",null,null,"Lead",null,null,null,null,null,null,null,null,null,null,null,"Miami-Dade County, FL",true,true,true]
[null,20230426144108,{"$f":"ROW()","v":1267},"Jose Jaime Guzman ",null,null,"Lead",null,null,null,null,null,null,null,null,null,null,null,"Cobb County, GA",true,true,true]
[null,20230426144109,{"$f":"ROW()","v":1268},"Jose Marrero ",null,null,"Lead",null,null,null,null,null,null,null,null,null,null,null,"Sussex County, NJ",true,true,true]
[null,20230426144110,{"$f":"ROW()","v":1269},"Jose Perez Alonso ","Laura Esquivel ",null,"Lead","MailList10","lauraesq@live.com","cctr4@aol.com","llaura.esquivelw98@aol.com","(803) 894-7628","(803) 781-8059","(803) 309-7839","205 Westside Dr","Lexington","SC",29072,"Lexington County, SC",false,false,false]
[null,20230426144111,{"$f":"ROW()","v":1270},"Joseph Ajdarodini ",null,null,"Lead",null,null,null,null,null,null,null,null,null,null,null,"Madison County, AL",true,true,true]
[null,20230426144112,{"$f":"ROW()","v":1271},"Joseph R Mayne ",null,null,"Lead",null,null,null,null,null,null,null,null,null,null,null,"Oakland County, MI",true,true,true]
[null,20230426144113,{"$f":"ROW()","v":1272},"Joseph Smulevitz ",null,null,"Lead",null,null,null,null,null,null,null,null,null,null,null,"Cook County, IL",true,true,true]
[null,20230426144114,{"$f":"ROW()","v":1273},"Joseph Valenti ",null,null,"Lead",null,null,null,null,null,null,null,null,null,null,null,"Cobb County, GA",true,true,true]
[null,20230426144115,{"$f":"ROW()","v":1274},"Joseph W Huger ",null,null,"Lead",null,null,null,null,null,null,null,null,null,null,null,"Charleston County, SC",true,true,true]
[null,20230426144116,{"$f":"ROW()","v":1275},"Josephine A Malinowski ",null,null,"Lead",null,null,null,null,null,null,null,null,null,null,null,"Cook County, IL",true,true,true]
[null,20230426144117,{"$f":"ROW()","v":1276},"Joshua J and Michelle L Harmon","","","Lead","MailList10","joshua.harmon@nmfn.com",null,null,"(208) 658-8113","(754) 423-4048",null,"4814 W Roberts Rd","Boise","ID",83705,null,false,false,false]
[null,20230426144118,{"$f":"ROW()","v":1277},"Joshua Salonich ","Meagan Salonich ",null,"Lead","MailList10","jsalonich@gmail.com","yasuhiro95lierman.xe95@outlook.com",null,"(803) 260-1161","(803) 808-5909","(803) 926-0101","1305 Augusta Rd","West Columbia","SC",29169,"Lexington County, SC",false,false,false]
[null,20230426144119,{"$f":"ROW()","v":1278},"Josiah Shaver ",null,null,"Lead",null,null,null,null,null,null,null,null,null,null,null,"Rockdale County, GA",true,true,true]
[null,20230426144120,{"$f":"ROW()","v":1279},"JTV Incorporated",null,null,"Lead",null,null,null,null,null,null,null,null,null,null,null,"Pinellas County, FL",true,true,true]
[null,20230426144121,{"$f":"ROW()","v":1280},"Juan A Rivera ",null,null,"Lead",null,null,null,null,null,null,null,null,null,null,null,"Cook County, IL",true,true,true]
[null,20230426144122,{"$f":"ROW()","v":1281},"Juan Jackson ",null,null,"Lead",null,null,null,null,null,null,null,null,null,null,null,"Cook County, IL",true,true,true]
[null,20230426144123,{"$f":"ROW()","v":1282},"Juan Ramon Pons Lugo ",null,null,"Lead",null,null,null,null,null,null,null,null,null,null,null,"Broward County, FL",true,true,true]
[null,20230426144124,{"$f":"ROW()","v":1283},"Juan T Chamberlain ",null,null,"Lead",null,null,null,null,null,null,null,null,null,null,null,"Cook County, IL",true,true,true]
[null,20230426144125,{"$f":"ROW()","v":1284},"Judge M Jackson ",null,null,"Lead",null,null,null,null,null,null,null,null,null,null,null,"Mobile County, AL",true,true,true]
[null,20230426144126,{"$f":"ROW()","v":1285},"Judith K Cummins ",null,null,"Lead",null,null,null,null,null,null,null,null,null,null,null,"Cook County, IL",true,true,true]
[null,20230426144127,{"$f":"ROW()","v":1286},"JUDSON BRICK and BLOCK LLC",null,null,"Lead",null,null,null,null,null,null,null,null,null,null,null,"Summit County, OH",true,true,true]
[null,20230426144128,{"$f":"ROW()","v":1287},"Julian Jr Lecraw ",null,null,"Lead",null,null,null,null,null,null,null,null,null,null,null,"Cobb County, GA",true,true,true]
[null,20230426144129,{"$f":"ROW()","v":1288},"Julie Albano ",null,null,"Lead","MailList10","julzboop23@yahoo.com","jpaolillo@gmail.com",null,"(773) 896-5692","(708) 483-8585","(773) 525-5853","48 Rusty Rd","Lemont","IL",60439,"Cook County, IL",false,false,false]
[null,20230426144130,{"$f":"ROW()","v":1289},"Julie Albano ",null,null,"Lead",null,null,null,null,null,null,null,null,null,null,null,"Cook County, IL",true,true,true]
[null,20230426144131,{"$f":"ROW()","v":1290},"Julie Bibbs-Smith ",null,null,"Lead",null,null,null,null,null,null,null,null,null,null,null,"Cook County, IL",true,true,true]
[null,20230426144132,{"$f":"ROW()","v":1291},"Julie K Bolinger ",null,null,"Lead",null,null,null,null,null,null,null,null,null,null,null,"Genesee County, MI",true,true,true]
[null,20230426144133,{"$f":"ROW()","v":1292},"Julie M Bapst ",null,null,"Lead",null,null,null,null,null,null,null,null,null,null,null,"Cook County, IL",true,true,true]
[null,20230426144134,{"$f":"ROW()","v":1293},"Junior A Merino","Heidi U Merino",null,"Lead","MailList10","heidiumerino@yahoo.com","mutbvn@gmail.com","jrbeveragemanager@yahoo.com.mx","(646) 342-8302","(646) 667-2866","(901) 206-9378","7813 Bingham St","Dearborn","MI",48126,null,false,false,false]
[null,20230426144135,{"$f":"ROW()","v":1294},"Juscelio Detoledo Cruz ",null,null,"Lead",null,null,null,null,null,null,null,null,null,null,null,"Cobb County, GA",true,true,true]
[null,20230426144136,{"$f":"ROW()","v":1295},"JVDC INC",null,null,"Lead",null,null,null,null,null,null,null,null,null,null,null,"Cuyahoga County, OH",true,true,true]
[null,20230426144139,{"$f":"ROW()","v":1296},"JW POTTS INS AG and LICENSE SERV",null,null,"Lead",null,null,null,null,null,null,null,null,null,null,null,"Wood County, WV",true,true,true]
[null,20230426144140,{"$f":"ROW()","v":1297},"JW POTTS INSURANCE AGENCY",null,null,"Lead",null,null,null,null,null,null,null,null,null,null,null,"Wood County, WV",true,true,true]
[null,20230426144141,{"$f":"ROW()","v":1298},"K and M Glass Co Inc",null,null,"Lead",null,null,null,null,null,null,null,null,null,null,null,"Madison County, AL",true,true,true]
[null,20230426144142,{"$f":"ROW()","v":1299},"K&K Family Holdings LLC",null,null,"Lead",null,null,null,null,null,null,null,null,null,null,null,"Cobb County, GA",true,true,true]
[null,20230426144143,{"$f":"ROW()","v":1300},"Kabob Garden 2 Inc",null,null,"Lead","MailList10","kabobgarden124@gmail.com",null,null,"(734) 252-9880",null,null,"244 E. Columbia Dr.","Belleville","MI",48111,"Wayne County, MI",false,false,false]
[null,20230426144144,{"$f":"ROW()","v":1301},"Kaelin M Campbell ",null,null,"Lead",null,null,null,null,null,null,null,null,null,null,null,"Charleston County, SC",true,true,true]
[null,20230426144145,{"$f":"ROW()","v":1302},"Kaepplinger Daniel P",null,null,"Lead",null,null,null,null,null,null,null,null,null,null,null,"Cook County, IL",true,true,true]
[null,20230426144146,{"$f":"ROW()","v":1303},"KALBS COLLISION LLC",null,null,"Lead",null,null,null,null,null,null,null,null,null,null,null,"Hamilton County, OH",true,true,true]
[null,20230426144147,{"$f":"ROW()","v":1304},"Kamal Llc Anderson ",null,null,"Lead",null,null,null,null,null,null,null,null,null,null,null,"Cook County, IL",true,true,true]
[null,20230426144148,{"$f":"ROW()","v":1305},"Kamel Pickens ",null,null,"Lead",null,null,null,null,null,null,null,null,null,null,null,"Albany County, NY",true,true,true]
[null,20230426144149,{"$f":"ROW()","v":1306},"Kamisha Melvin ",null,null,"Lead",null,null,null,null,null,null,null,null,null,null,null,"Cook County, IL",true,true,true]
[null,20230426144150,{"$f":"ROW()","v":1307},"Karen L Storey","9 Mile Rent All Inc",null,"Lead","MailList10","karen.byrd@attb1.com",null,null,"(248) 446-1068","(248) 347-1780","(248) 673-6830","750 Prince Edward Dr","Howell","MI",48843,"Macomb County, MI",false,false,false]
[null,20230426144151,{"$f":"ROW()","v":1308},"Karen Marshall ",null,null,"Lead",null,null,null,null,null,null,null,null,null,null,null,"Madison County, AL",true,true,true]
[null,20230426144152,{"$f":"ROW()","v":1309},"Karen Sanders ",null,null,"Lead","MailList10","kchristen@erols.com","1kchristen@erols.com","karen@astro-physics.com","(815) 990-8089","(563) 343-7545","(815) 599-6828","3141 Ramsgate Rd","Rockford","IL",61114,"Cook County, IL",false,false,false]
[null,20230426144153,{"$f":"ROW()","v":1310},"Karen Scott ",null,null,"Lead",null,null,null,null,null,null,null,null,null,null,null,"Cook County, IL",true,true,true]
[null,20230426144154,{"$f":"ROW()","v":1311},"Karine Bogoraz ",null,null,"Lead",null,null,null,null,null,null,null,null,null,null,null,"Miami-Dade County, FL",true,true,true]
[null,20230426144156,{"$f":"ROW()","v":1312},"Karriem J Ali ",null,null,"Lead",null,null,null,null,null,null,null,null,null,null,null,"Oakland County, MI",true,true,true]
[null,20230426144157,{"$f":"ROW()","v":1313},"Kathleen L Freebairn ",null,null,"Lead",null,null,null,null,null,null,null,null,null,null,null,"Cobb County, GA",true,true,true]
[null,20230426144158,{"$f":"ROW()","v":1314},"Kathleen Leclaire ",null,null,"Lead",null,null,null,null,null,null,null,null,null,null,null,"Pinellas County, FL",true,true,true]
[null,20230426144159,{"$f":"ROW()","v":1315},"Kathleen R Minaghan ",null,null,"Lead",null,null,null,null,"(708) 848-4488",null,null,"241 N Kenilworth Ave","Oak Park","IL",60302,"Cook County, IL",true,false,false]
[null,20230426144160,{"$f":"ROW()","v":1316},"Kathryn L Jacoby ",null,null,"Lead",null,null,null,null,null,null,null,null,null,null,null,"Cobb County, GA",true,true,true]
[null,20230426144161,{"$f":"ROW()","v":1317},"Kathy L Ruddock",null,null,"Lead",null,null,null,null,null,null,null,null,null,null,null,"Nassau County, FL",true,true,true]
[null,20230426144162,{"$f":"ROW()","v":1318},"Kay D Ellison ",null,null,"Lead",null,null,null,null,null,null,null,null,null,null,null,"Horry County, SC",true,true,true]
[null,20230426144163,{"$f":"ROW()","v":1319},"KAZAVA SMITH",null,null,"Lead",null,null,null,null,null,null,null,null,null,null,null,"Hamilton County, OH",true,true,true]
[null,20230426144164,{"$f":"ROW()","v":1320},"Kecia D Corbitt Wynn ",null,null,"Lead",null,null,null,null,null,null,null,null,null,null,null,"Madison County, AL",true,true,true]
[null,20230426144165,{"$f":"ROW()","v":1321},"KEENEY MICHAEL A",null,null,"Lead",null,null,null,null,null,null,null,null,null,null,null,"Cuyahoga County, OH",true,true,true]
[null,20230426144166,{"$f":"ROW()","v":1322},"Keith and Dana L Mcdaniel","","","Lead","MailList10","blackwell0425@msn.com","pecotrain222@gmail.com",null,"(865) 382-4699","(865) 742-8783","(865) 272-3291","115 Bradley Ave","Oak Ridge","TN","37830-8206",null,false,false,false]
[null,20230426144167,{"$f":"ROW()","v":1323},"Keith Dextrom ",null,null,"Lead",null,null,null,null,null,null,null,null,null,null,null,"Macomb County, MI",true,true,true]
[null,20230426144168,{"$f":"ROW()","v":1324},"Keith V Frazier ",null,null,"Lead",null,null,null,null,null,null,null,null,null,null,null,"Cook County, IL",true,true,true]
[null,20230426144169,{"$f":"ROW()","v":1325},"KELLER DOUGLAS P",null,null,"Lead",null,null,null,null,null,null,null,null,null,null,null,"Cuyahoga County, OH",true,true,true]
[null,20230426144170,{"$f":"ROW()","v":1326},"Kelli A Menna ",null,null,"Lead",null,null,null,null,null,null,null,null,null,null,null,"Charleston County, SC",true,true,true]
[null,20230426144171,{"$f":"ROW()","v":1327},"Kelli M Mulder ",null,null,"Lead",null,null,null,null,null,null,null,null,null,null,null,"Cook County, IL",true,true,true]
[null,20230426144172,{"$f":"ROW()","v":1328},"Kellikidis Dino",null,null,"Lead","MailList15","jediyamato@aol.com","m.kellikidis@yahoo.com",null,"(773) 858-9919","(708) 583-0911","(773) 775-4309","2062 Big Oak Ln","Northbrook","IL",60062,"Cook County, IL",false,false,false]
[null,20230426144173,{"$f":"ROW()","v":1329},"Kelly Enterprises Co LLC",null,null,"Lead",null,null,null,null,null,null,null,null,null,null,null,"Cobb County, GA",true,true,true]
[null,20230426144174,{"$f":"ROW()","v":1330},"Kelly Kathy D",null,null,"Lead",null,null,null,null,null,null,null,null,null,null,null,"Franklin County, OH",true,true,true]
[null,20230426144175,{"$f":"ROW()","v":1331},"KELLY MEKEMBA D",null,null,"Lead",null,null,null,null,null,null,null,null,null,null,null,"Cuyahoga County, OH",true,true,true]
[null,20230426144176,{"$f":"ROW()","v":1332},"KELLY THOMAS A",null,null,"Lead",null,null,null,null,null,null,null,null,null,null,null,"Cuyahoga County, OH",true,true,true]
[null,20230426144177,{"$f":"ROW()","v":1333},"Kelvin Brown ","",null,"Lead","MailList10","leftyclutz04@yahoo.com","zachary.yap@gmail.com","kevinbrown1985@gmail.com","(606) 226-9361","(206) 350-1327","(314) 265-8305","44 Marlboro Ln","East Point","KY",41216,null,false,false,false]
[null,20230426144178,{"$f":"ROW()","v":1334},"Kelvin L Garner ",null,null,"Lead",null,null,null,null,null,null,null,null,null,null,null,"Cook County, IL",true,true,true]
[null,20230426144179,{"$f":"ROW()","v":1335},"KEMPER CHRISTOPHER G",null,null,"Lead",null,null,null,null,null,null,null,null,null,null,null,"Harrison County, WV",true,true,true]
[null,20230426144180,{"$f":"ROW()","v":1336},"KEMPER ELIZABETH M",null,null,"Lead",null,null,null,null,null,null,null,null,null,null,null,"Harrison County, WV",true,true,true]
[null,20230426144182,{"$f":"ROW()","v":1337},"Kendall C Gill ",null,null,"Lead",null,null,null,null,null,null,null,null,null,null,null,"Cook County, IL",true,true,true]
[null,20230426144183,{"$f":"ROW()","v":1338},"Kendrell O Sheppard ",null,null,"Lead",null,null,null,null,null,null,null,null,null,null,null,"Charleston County, SC",true,true,true]
[null,20230426144184,{"$f":"ROW()","v":1339},"Kenisha Mays ",null,null,"Lead",null,null,null,null,null,null,null,null,null,null,null,"Cobb County, GA",true,true,true]
[null,20230426144185,{"$f":"ROW()","v":1340},"Kenneth B Canty ",null,null,"Lead",null,null,null,null,null,null,null,null,null,null,null,"Charleston County, SC",true,true,true]
[null,20230426144186,{"$f":"ROW()","v":1341},"Kenneth B Fisher ",null,null,"Lead",null,null,null,null,null,null,null,null,null,null,null,"Macomb County, MI",true,true,true]
[null,20230426144187,{"$f":"ROW()","v":1342},"Kenneth Carmack",null,null,"Lead",null,null,null,null,null,null,null,null,null,null,null,"DeSoto County, MS",true,true,true]
[null,20230426144188,{"$f":"ROW()","v":1343},"Kenneth D Powell ",null,null,"Lead",null,null,null,null,null,null,null,null,null,null,null,"Mobile County, AL",true,true,true]
[null,20230426144189,{"$f":"ROW()","v":1344},"Kenneth Horvath ",null,null,"Lead","MailList10","staceyken@att.net","kenhorvath@ymail.com","damdylmatt@yahoo.com","(815) 301-7277","(815) 301-7278","(815) 893-4049","1616 N Leonard Ave","Mchenry","IL",60050,"Cook County, IL",false,false,false]
[null,20230426144190,{"$f":"ROW()","v":1345},"Kenneth J Baker ",null,null,"Lead","MailList10","kenny2416@gateway.com",null,null,"(901) 606-8462","(520) 360-4730","(906) 367-6612","1418 W Arthur Ave #1","Chicago","IL",60626,"Cook County, IL",false,false,false]
[null,20230426144191,{"$f":"ROW()","v":1346},"Kenneth J Baker ",null,null,"Lead",null,null,null,null,null,null,null,null,null,null,null,"Cook County, IL",true,true,true]
[null,20230426144192,{"$f":"ROW()","v":1347},"Kennys Lawn Service Inc",null,null,"Lead",null,null,null,null,"(734) 776-6093",null,null,null,"40158 Warren Rd\nCanton MI 48187",null,null,"Wayne County, MI",true,false,false]
[null,20230426144193,{"$f":"ROW()","v":1348},"Kerri Crane ",null,null,"Lead",null,null,null,null,null,null,null,null,null,null,null,"Oakland County, MI",true,true,true]
[null,20230426144194,{"$f":"ROW()","v":1349},"Kerry Bingham ",null,null,"Lead",null,null,null,null,null,null,null,null,null,null,null,"Cook County, IL",true,true,true]
[null,20230426144195,{"$f":"ROW()","v":1350},"Kevin Alexander ",null,null,"Lead",null,null,null,null,null,null,null,null,null,null,null,"Cook County, IL",true,true,true]
[null,20230426144196,{"$f":"ROW()","v":1351},"Kevin Brian Cox","","","Lead","MailList10","kevbcox1@yahoo.com","kcox4058@hotmail.com",null,"(901) 292-3176","(901) 502-8851","(812) 246-5230","8254 Foxbough Ln","Bartlett","TN.","38002-4560",null,false,false,false]
[null,20230426144197,{"$f":"ROW()","v":1352},"Kevin C Johnson Sr","","","Lead","MailList10","kevin.johnson@adelphia.net","digitalbykj@hotmail.com",null,"(443) 618-4479","(443) 274-2375","(410) 519-5876","5060 Silver Peak Cv","Memphis","TN","38125-3947",null,false,false,false]
[null,20230426144198,{"$f":"ROW()","v":1353},"Kevin Denis ",null,null,"Lead",null,null,null,null,null,null,null,null,null,null,null,"Albany County, NY",true,true,true]
[null,20230426144199,{"$f":"ROW()","v":1354},"Kevin F. Walker","",null,"Lead","MailList10","ctuusa@hotmail.com",null,null,"(404) 401-0581","(334) 887-1076",null,"3371 Skyway Dr. Suite 1","Auburn","AL",36830,null,false,false,false]
[null,20230426144200,{"$f":"ROW()","v":1355},"Kevin Gustafson ",null,null,"Lead",null,null,null,null,null,null,null,null,null,null,null,"Cook County, IL",true,true,true]
[null,20230426144201,{"$f":"ROW()","v":1356},"Kevin J Pittner ",null,null,"Lead",null,null,null,null,null,null,null,null,null,null,null,"Cook County, IL",true,true,true]
[null,20230426144202,{"$f":"ROW()","v":1357},"Kevin L Mason ",null,null,"Lead",null,null,null,null,null,null,null,null,null,null,null,"Cook County, IL",true,true,true]
[null,20230426144203,{"$f":"ROW()","v":1358},"Kevin L Ostrander ",null,null,"Lead",null,null,null,null,null,null,null,null,null,null,null,"Oakland County, MI",true,true,true]
[null,20230426144204,{"$f":"ROW()","v":1359},"Kevin W Stich ","Jamie L Stich ",null,"Lead","MailList10","memphisreservation@hotmail.com","kevinstich@gmail.com","stevenconley@gmail.com","(502) 298-9453","(502) 295-0882","(502) 921-9280","131 Overlook Dr","Brooks","KY",40109,"Jefferson County, KY",false,false,false]
[null,20230426144205,{"$f":"ROW()","v":1360},"KEYSTONE DEVELOPMENT CONTRACTORS",null,null,"Lead",null,null,null,null,null,null,null,null,null,null,null,"Jefferson County, AL",true,true,true]
[null,20230426144206,{"$f":"ROW()","v":1361},"Khamprasert Chamleunsouk ",null,null,"Lead","MailList10","chamleunsouk@comcast.net","chio@blackplanet.com",null,"(312) 654-1246","(612) 532-1098",null,"1000 S Clark St #2319","Chicago","IL",60605,"Cook County, IL",false,false,false]
[null,20230426144207,{"$f":"ROW()","v":1362},"KIDDIE WORLD LEARNING CENTER LLC",null,null,"Lead",null,null,null,null,null,null,null,null,null,null,null,"Jefferson County, AL",true,true,true]
[null,20230426144208,{"$f":"ROW()","v":1363},"Kids R Our Stars Learning Ctr Inc",null,null,"Lead",null,null,null,null,null,null,null,null,null,null,null,"Cook County, IL",true,true,true]
[null,20230426144209,{"$f":"ROW()","v":1364},"Kilby and Gannon Construction Services LLC",null,null,"Lead",null,null,null,null,null,null,null,null,null,null,null,"Albany County, NY",true,true,true]
[null,20230426144210,{"$f":"ROW()","v":1365},"Kimberly Philpot ",null,null,"Lead",null,null,null,null,"(847) 838-3467","(708) 623-1716","(847) 623-1716","602 Meridian Way","Antioch","IL",60002,"Cook County, IL",true,false,false]
[null,20230426144211,{"$f":"ROW()","v":1366},"KING ASHLEY",null,null,"Lead",null,null,null,null,null,null,null,null,null,null,null,"Madison County, MS",true,true,true]
[null,20230426144212,{"$f":"ROW()","v":1367},"King Christopher H",null,null,"Lead",null,null,null,null,null,null,null,null,null,null,null,"Cook County, IL",true,true,true]
[null,20230426144213,{"$f":"ROW()","v":1368},"KING ELECTRICAL SERVICES",null,null,"Lead",null,null,null,null,null,null,null,null,null,null,null,"Lucas County, OH",true,true,true]
[null,20230426144214,{"$f":"ROW()","v":1369},"KLEIN LANA L",null,null,"Lead",null,null,null,null,null,null,null,null,null,null,null,"Monongalia County, VA",true,true,true]
[null,20230426144215,{"$f":"ROW()","v":1370},"KLEIN ROBERT",null,null,"Lead",null,null,null,null,null,null,null,null,null,null,null,"Monongalia County, VA",true,true,true]
[null,20230426144216,{"$f":"ROW()","v":1371},"Knepp Ernest E",null,null,"Lead",null,null,null,null,null,null,null,null,null,null,null,"Franklin County, OH",true,true,true]
[null,20230426144217,{"$f":"ROW()","v":1372},"KNOTTS DAVID W II",null,null,"Lead",null,null,null,null,null,null,null,null,null,null,null,"Wood County, WV",true,true,true]
[null,20230426144218,{"$f":"ROW()","v":1373},"KOBASIC DEBORAH A",null,null,"Lead",null,null,null,null,null,null,null,null,null,null,null,"Cuyahoga County, OH",true,true,true]
[null,20230426144219,{"$f":"ROW()","v":1374},"Konnie Eggleston","","No phone or email found","Lead",null,null,null,null,"","","","1051 Palermo Ave","Memphis","TN",38106,null,true,true,false]
[null,20230426144220,{"$f":"ROW()","v":1375},"Kowske Brock",null,null,"Lead",null,null,null,null,null,null,null,null,null,null,null,"Cook County, IL",true,true,true]
[null,20230426144221,{"$f":"ROW()","v":1376},"KRIM, CONNIE L",null,null,"Lead",null,null,null,null,null,null,null,null,null,null,null,"Summit County, OH",true,true,true]
[null,20230426144222,{"$f":"ROW()","v":1377},"Kristin A West ",null,null,"Lead",null,null,null,null,null,null,null,null,null,null,null,"Broward County, FL",true,true,true]
[null,20230426144223,{"$f":"ROW()","v":1378},"Kristina Gail Williams ",null,null,"Lead","MailList10","pganderson@lexhealth.org","pganderson@gmail.com",null,"(803) 800-2596","(803) 892-2557","(317) 788-0791","274 Liberty Hill Rd","Lexington","SC",29073,"Lexington County, SC",false,false,false]
[null,20230426144224,{"$f":"ROW()","v":1379},"Krzysztof P Mach ",null,null,"Lead",null,null,null,null,null,null,null,null,null,null,null,"Cook County, IL",true,true,true]
[null,20230426144225,{"$f":"ROW()","v":1380},"Kwame Sr Ingram ",null,null,"Lead",null,null,null,null,null,null,null,null,null,null,null,"Cobb County, GA",true,true,true]
[null,20230426144226,{"$f":"ROW()","v":1381},"Kyata A Burns ",null,null,"Lead",null,null,null,null,null,null,null,null,null,null,null,"Macomb County, MI",true,true,true]
[null,20230426144227,{"$f":"ROW()","v":1382},"Kyei Agyaaku",null,null,"Lead",null,null,null,null,null,null,null,null,null,null,null,"Franklin County, OH",true,true,true]
[null,20230426144228,{"$f":"ROW()","v":1383},"Kyle M Abrams ",null,null,"Lead","MailList10","abrams_kyle@yahoo.com",null,null,"(847) 287-1319","(847) 824-3292","(224) 938-9551","1422 N Park Dr","Mount Prospect","IL",60056,"Cook County, IL",false,false,false]
[null,20230426144229,{"$f":"ROW()","v":1384},"Kyle M Abrams ",null,null,"Lead",null,null,null,null,null,null,null,null,null,null,null,"Cook County, IL",true,true,true]
[null,20230426144230,{"$f":"ROW()","v":1385},"L 5 Medical Holdings LLC",null,null,"Lead",null,null,null,null,null,null,null,null,null,null,null,"Charleston County, SC",true,true,true]
[null,20230426144231,{"$f":"ROW()","v":1386},"Labelle Homehealth Care Services Llc",null,null,"Lead",null,null,null,null,null,null,null,null,null,null,null,"Franklin County, OH",true,true,true]
[null,20230426144232,{"$f":"ROW()","v":1387},"LACKEY HENRY D ",null,null,"Lead",null,null,null,null,null,null,null,null,null,null,null,"Montgomery County, OH",true,true,true]
[null,20230426144233,{"$f":"ROW()","v":1388},"LADANYE BRIAN S",null,null,"Lead",null,null,null,null,null,null,null,null,null,null,null,"Harrison County, WV",true,true,true]
[null,20230426144234,{"$f":"ROW()","v":1389},"LADANYE DANITA K",null,null,"Lead",null,null,null,null,null,null,null,null,null,null,null,"Harrison County, WV",true,true,true]
[null,20230426144235,{"$f":"ROW()","v":1390},"Ladell D Bonds ",null,null,"Lead","MailList10","ldell_33@yahoo.com","lbonds33@gmail.com",null,"(708) 253-3353","(708) 360-3001","(923) 923-6179","1067 Herbert Breclaw Dr","Calumet City","IL",60409,"Cook County, IL",false,false,false]
[null,20230426144236,{"$f":"ROW()","v":1391},"LADNER RON B",null,null,"Lead",null,null,null,null,null,null,null,null,null,null,null,"Harrison County, MS",true,true,true]
[null,20230426144239,{"$f":"ROW()","v":1392},"Lakisha  Knight","L K Tax Service ",null,"Lead","MailList10","knightlakisha9@gmail.com","knightlakisha150@yahoo.com",null,"(248) 961-5529","(313) 366-1613","(313) 521-5181","7517 Emily St","Detroit","MI",48234,null,false,false,false]
[null,20230426144240,{"$f":"ROW()","v":1393},"LAMB, ERIK V",null,null,"Lead",null,null,null,null,null,null,null,null,null,null,null,"Summit County, OH",true,true,true]
[null,20230426144241,{"$f":"ROW()","v":1394},"Lane Electric Company, LLC","",null,"Lead",null,null,null,null,"","","","307 26Th St N","Pell City","AL",35125,null,true,true,false]
[null,20230426144242,{"$f":"ROW()","v":1395},"Lane Trucking","","","Lead","MailList10","jnjnn@address.com","hiltbar@aol.com",null,"(253) 495-9030","(818) 341-9776","(661) 947-0753","Po Box 683 I - ","Andersonville","TN",37705,null,false,false,false]
[null,20230426144243,{"$f":"ROW()","v":1396},"LANGOS FRANK S",null,null,"Lead",null,null,null,null,null,null,null,null,null,null,null,"Cuyahoga County, OH",true,true,true]
[null,20230426144244,{"$f":"ROW()","v":1397},"Laquanda Davis ",null,null,"Lead",null,null,null,null,null,null,null,null,null,null,null,"Miami-Dade County, FL",true,true,true]
[null,20230426144246,{"$f":"ROW()","v":1398},"Laquinta Riley ",null,null,"Lead",null,null,null,null,null,null,null,null,null,null,null,"Cobb County, GA",true,true,true]
[null,20230426144247,{"$f":"ROW()","v":1399},"Larrain Anthony",null,null,"Lead",null,null,null,null,null,null,null,null,null,null,null,"Cook County, IL",true,true,true]
[null,20230426144248,{"$f":"ROW()","v":1400},"Larry A Austin ",null,null,"Lead",null,null,null,null,null,null,null,null,null,null,null,"Cobb County, GA",true,true,true]
[null,20230426144249,{"$f":"ROW()","v":1401},"Larry Mondragon ",null,null,"Lead",null,null,null,null,null,null,null,null,null,null,null,"Cook County, IL",true,true,true]
[null,20230426144250,{"$f":"ROW()","v":1402},"Larry Smith ",null,null,"Lead",null,null,null,null,null,null,null,null,null,null,null,"Pinellas County, FL",true,true,true]
[null,20230426144251,{"$f":"ROW()","v":1403},"Larry Whiteside ",null,null,"Lead",null,null,null,null,null,null,null,null,null,null,null,"Cobb County, GA",true,true,true]
[null,20230426144252,{"$f":"ROW()","v":1404},"LASKO RONALD H",null,null,"Lead",null,null,null,null,null,null,null,null,null,null,null,"Cuyahoga County, OH",true,true,true]
[null,20230426144253,{"$f":"ROW()","v":1405},"Lass N Laddies Inc Old Shillelagh","Barbara A Kaufmann",null,"Lead","MailList11","info@oldshillelagh.com",null,null,"3139640007\n3134172537","(313) 930-1629","\n","349 Monroe","Detroit","MI",48226,null,false,false,false]
[null,20230426144254,{"$f":"ROW()","v":1406},"Latasha Gibson ",null,null,"Lead",null,null,null,null,null,null,null,null,null,null,null,"Hillsborough County, FL",true,true,true]
[null,20230426144255,{"$f":"ROW()","v":1407},"Lataunja Weaver ",null,null,"Lead",null,null,null,null,null,null,null,null,null,null,null,"Cook County, IL",true,true,true]
[null,20230426144256,{"$f":"ROW()","v":1408},"Latoya Collier ",null,null,"Lead","MailList11","collierlatoyalisa@gmail.com",null,null,"(773) 530-0851","(773) 374-4277","(773) 375-3122","8050 S Blackstone Ave","Chicago","IL",60619,"Cook County, IL",false,false,false]
[null,20230426144257,{"$f":"ROW()","v":1409},"Latresia Fair ",null,null,"Lead",null,null,null,null,null,null,null,null,null,null,null,"Rockdale County, GA",true,true,true]
[null,20230426144258,{"$f":"ROW()","v":1410},"Laura J Selph","","","Lead","MailList11","ljselph@gmail.com","laura.selph@ole.com",null,"(901) 761-3385","(901) 818-9854","(901) 493-4006","1293 S White Station Rd","Memphis","TN","38117-6329",null,false,false,false]
[null,20230426144259,{"$f":"ROW()","v":1411},"Laura L Ackerman ",null,null,"Lead",null,null,null,null,null,null,null,null,null,null,null,"Horry County, SC",true,true,true]
[null,20230426144260,{"$f":"ROW()","v":1412},"Lauryn A Overbey ",null,null,"Lead",null,null,null,null,null,null,null,null,null,null,null,"Cook County, IL",true,true,true]
[null,20230426144261,{"$f":"ROW()","v":1413},"Lavon T Mayes ","Michelle M Mayes ",null,"Lead","MailList11","peacee@gmail.com","peace197@lycos.com","peace6408@gmail.com","(502) 767-9874","(502) 690-3580","(502) 333-0955","6514 Lantern Dr","Louisville","KY",40228,null,false,false,false]
[null,20230426144262,{"$f":"ROW()","v":1414},"Law Office Of J D Walker, LLC","",null,"Lead",null,null,null,null,"","","","2969 Pelham Pkwy Ste F","Pelham","AL",35124,null,true,true,false]
[null,20230426144263,{"$f":"ROW()","v":1415},"Lawrence L Diamond ",null,null,"Lead",null,null,null,null,null,null,null,null,null,null,null,"Mobile County, AL",true,true,true]
[null,20230426144264,{"$f":"ROW()","v":1416},"Lawrence Riegner ",null,null,"Lead",null,null,null,null,null,null,null,null,null,null,null,"Volusia County, FL",true,true,true]
[null,20230426144265,{"$f":"ROW()","v":1417},"LAYNE MORGAN A",null,null,"Lead",null,null,null,null,null,null,null,null,null,null,null,"Knox County, OH",true,true,true]
[null,20230426144266,{"$f":"ROW()","v":1418},"Lazaro Vento ",null,null,"Lead",null,null,null,null,null,null,null,null,null,null,null,"Miami-Dade County, FL",true,true,true]
[null,20230426144267,{"$f":"ROW()","v":1419},"Lc Smith ",null,null,"Lead",null,null,null,null,null,null,null,null,null,null,null,"Cook County, IL",true,true,true]
[null,20230426144268,{"$f":"ROW()","v":1420},"Ldc Inc",null,null,"Lead",null,null,null,null,null,null,null,null,null,null,null,"Houston County, AL",true,true,true]
[null,20230426144269,{"$f":"ROW()","v":1421},"LDC Inc.","",null,"Lead",null,null,null,null,"","","","3634 Lingo Rd","Dothan","AL",36303,null,true,true,false]
[null,20230426144270,{"$f":"ROW()","v":1422},"Le Fer Forge Inc",null,null,"Lead",null,null,null,null,null,null,null,null,null,null,null,"Miami-Dade County, FL",true,true,true]
[null,20230426144271,{"$f":"ROW()","v":1423},"Le Mott Corporation LLC",null,null,"Lead",null,null,null,null,null,null,null,null,null,null,null,"Mobile County, AL",true,true,true]
[null,20230426144272,{"$f":"ROW()","v":1424},"LEA LANDSCAPING LLC",null,null,"Lead",null,null,null,null,null,null,null,null,null,null,null,"Cuyahoga County, OH",true,true,true]
[null,20230426144273,{"$f":"ROW()","v":1425},"Learning Resource Center Inc",null,null,"Lead",null,null,null,null,null,null,null,null,null,null,null,"Franklin County, OH",true,true,true]
[null,20230426144274,{"$f":"ROW()","v":1426},"Lechelle and Michael E Davenport","","","Lead","MailList11","giosah@aol.com","mrlawnmower@gmail.com","mrlawnmower50@gmail.com","(901) 873-1446","(865) 671-0625","(865) 671-0000","4142 Lucy Rd","Millington","TN","38053-7912",null,false,false,false]
[null,20230426144275,{"$f":"ROW()","v":1427},"Lee A Vaskovsky ",null,null,"Lead",null,null,null,null,null,null,null,null,null,null,null,"Pinellas County, FL",true,true,true]
[null,20230426144276,{"$f":"ROW()","v":1428},"Lee Dobbins ",null,null,"Lead",null,null,null,null,null,null,null,null,null,null,null,"Rockdale County, GA",true,true,true]
[null,20230426144277,{"$f":"ROW()","v":1429},"Lee Friedland ",null,null,"Lead",null,null,null,null,null,null,null,null,null,null,null,"Broward County, FL",true,true,true]
[null,20230426144278,{"$f":"ROW()","v":1430},"Leebutcher Debra",null,null,"Lead",null,null,null,null,null,null,null,null,null,null,null,"Franklin County, OH",true,true,true]
[null,20230426144279,{"$f":"ROW()","v":1431},"LEFT BLANK INTENTIONALLY",null,null,"Lead",null,null,null,null,null,null,null,null,null,null,null,"Rankin County, MS",true,true,true]
[null,20230426144280,{"$f":"ROW()","v":1432},"Legal Document Mgmt Inc",null,null,"Lead",null,null,null,null,null,null,null,null,null,null,null,"Cook County, IL",true,true,true]
[null,20230426144281,{"$f":"ROW()","v":1433},"Leggett Samuel",null,null,"Lead",null,null,null,null,null,null,null,null,null,null,null,"Cook County, IL",true,true,true]
[null,20230426144282,{"$f":"ROW()","v":1434},"Leo S Rakowski ",null,null,"Lead",null,null,null,null,null,null,null,null,null,null,null,"Cook County, IL",true,true,true]
[null,20230426144283,{"$f":"ROW()","v":1435},"Leonard A Batterson ",null,null,"Lead",null,null,null,null,null,null,null,null,null,null,null,"Cook County, IL",true,true,true]
[null,20230426144284,{"$f":"ROW()","v":1436},"Leonard Ellison","Francine Ellison",null,"Lead","MailList11","18002071413@archwireless.net","franell@comcast.net",null,"(313) 308-5121","(313) 341-5710","(248) 945-0151","27200 Franklin Rd #414","Southfield","MI",48034,"Wayne County, MI",false,false,false]
[null,20230426144285,{"$f":"ROW()","v":1437},"Leonard Medley ",null,null,"Lead",null,null,null,null,null,null,null,null,null,null,null,"Cobb County, GA",true,true,true]
[null,20230426144286,{"$f":"ROW()","v":1438},"Leonard Sulley ",null,null,"Lead",null,null,null,null,"(630) 333-8811","(630) 455-0988","(708) 205-4790","510 Oblock Ave","Pittsburgh","PA",15239,"Cook County, IL",true,false,false]
[null,20230426144287,{"$f":"ROW()","v":1439},"Leonides Nieves ",null,null,"Lead",null,null,null,null,null,null,null,null,null,null,null,"Cook County, IL",true,true,true]
[null,20230426144288,{"$f":"ROW()","v":1440},"Leos Complete Auto Repair Llc",null,null,"Lead",null,null,null,null,"248 957 8339",null,null,"29623 W Eight Mile Rd","Livonia","MI",48152,null,true,false,false]
[null,20230426144289,{"$f":"ROW()","v":1441},"Leroy Rudolph Jr","",null,"Lead",null,null,null,null,null,null,null,"","","","","Jackson County, MS",true,true,true]
[null,20230426144290,{"$f":"ROW()","v":1442},"Leslie A Graham ",null,null,"Lead",null,null,null,null,null,null,null,null,null,null,null,"Cobb County, GA",true,true,true]
[null,20230426144291,{"$f":"ROW()","v":1443},"Leticia Byrd",null,null,"Lead",null,null,null,null,null,null,null,null,null,null,null,"DeSoto County, MS",true,true,true]
[null,20230426144292,{"$f":"ROW()","v":1444},"Letitia A Gordon ",null,null,"Lead",null,null,null,null,null,null,null,null,null,null,null,"Genesee County, MI",true,true,true]
[null,20230426144293,{"$f":"ROW()","v":1445},"LEVER JAMES E ET AL",null,null,"Lead",null,null,null,null,null,null,null,null,null,null,null,"Madison County, MS",true,true,true]
[null,20230426144294,{"$f":"ROW()","v":1446},"LEWIS ELOISE R",null,null,"Lead",null,null,null,null,null,null,null,null,null,null,null,"Rankin County, MS",true,true,true]
[null,20230426144295,{"$f":"ROW()","v":1447},"Lewis S Francois ",null,null,"Lead",null,null,null,null,null,null,null,null,null,null,null,"Miami-Dade County, FL",true,true,true]
[null,20230426144297,{"$f":"ROW()","v":1448},"Lewis Smith ",null,null,"Lead",null,null,null,null,null,null,null,null,null,null,null,"Broward County, FL",true,true,true]
[null,20230426144298,{"$f":"ROW()","v":1449},"Lil Blessings Child Care Center Inc",null,null,"Lead",null,null,null,null,null,null,null,null,null,null,null,"Horry County, SC",true,true,true]
[null,20230426144299,{"$f":"ROW()","v":1450},"Linda Howard ",null,null,"Lead",null,null,null,null,null,null,null,null,null,null,null,"Macomb County, MI",true,true,true]
[null,20230426144300,{"$f":"ROW()","v":1451},"Linda J Lorah ",null,null,"Lead",null,null,null,null,null,null,null,null,null,null,null,"Charleston County, SC",true,true,true]
[null,20230426144301,{"$f":"ROW()","v":1452},"LINKS COMMUNITY and FAMILY SERVICES",null,null,"Lead",null,null,null,null,null,null,null,null,null,null,null,"Summit County, OH",true,true,true]
[null,20230426144302,{"$f":"ROW()","v":1453},"Liquors Corp Appalachian ",null,null,"Lead",null,null,null,null,null,null,null,null,null,null,null,"Sussex County, NJ",true,true,true]
[null,20230426144303,{"$f":"ROW()","v":1454},"Lisa Brancifort ",null,null,"Lead",null,null,null,null,null,null,null,null,null,null,null,"Horry County, SC",true,true,true]
[null,20230426144304,{"$f":"ROW()","v":1455},"Lisa H Crimando ",null,null,"Lead",null,null,null,null,null,null,null,null,null,null,null,"Sussex County, NJ",true,true,true]
[null,20230426144305,{"$f":"ROW()","v":1456},"Lisa M and Ryan Cox ",null,null,"Lead","MailList11","lisalis32@yahoo.com",null,null,"(313) 574-8431",null,null,"15506 Oak Dr","Livonia","MI",48154,null,false,false,false]
[null,20230426144306,{"$f":"ROW()","v":1457},"Lisa M Dean ",null,null,"Lead",null,null,null,null,null,null,null,"1518 West Pakm Cir","Valrico","FL",33596,"Hillsborough County, FL",true,true,false]
[null,20230426144307,{"$f":"ROW()","v":1458},"Lisa M Leporowski ",null,null,"Lead","MailList11","lisa0372@att.net","lisaoneil0327@yahoo.com","lisaleporowski@yahoo.com","(313) 492-9981","(313) 912-2708","(248) 957-9183","Po Box 487","Garden City","MI",48136,null,false,false,false]
[null,20230426144308,{"$f":"ROW()","v":1459},"Lisa M Shackelford ",null,null,"Lead",null,null,null,null,null,null,null,null,null,null,null,"Cobb County, GA",true,true,true]
[null,20230426144309,{"$f":"ROW()","v":1460},"Lisalynn V Devonshire ",null,null,"Lead",null,null,null,null,null,null,null,null,null,null,null,"Brevard County, FL",true,true,true]
[null,20230426144310,{"$f":"ROW()","v":1461},"Lissa A Gonzalez ",null,null,"Lead",null,null,null,null,null,null,null,null,null,null,null,"Miami-Dade County, FL",true,true,true]
[null,20230426144312,{"$f":"ROW()","v":1462},"LITT, MICHAEL D",null,null,"Lead",null,null,null,null,null,null,null,null,null,null,null,"Summit County, OH",true,true,true]
[null,20230426144313,{"$f":"ROW()","v":1463},"LITTLE PEOPLE DAY CARE CENTER LLC",null,null,"Lead",null,null,null,null,null,null,null,null,null,null,null,"\nCopiah County, MS",true,true,true]
[null,20230426144314,{"$f":"ROW()","v":1464},"Little Tigers Learning Center 2 Llc",null,null,"Lead",null,null,null,null,null,null,null,null,null,null,null,"Franklin County, OH",true,true,true]
[null,20230426144315,{"$f":"ROW()","v":1465},"Living Designs Landscaping",null,null,"Lead",null,null,null,null,null,null,null,null,null,null,null,"Charleston County, SC",true,true,true]
[null,20230426144316,{"$f":"ROW()","v":1466},"Loc Q Dang ",null,null,"Lead",null,null,null,null,null,null,null,null,null,null,null,"Broward County, FL",true,true,true]
[null,20230426144317,{"$f":"ROW()","v":1467},"Longstreth Jeffrey",null,null,"Lead",null,null,null,null,null,null,null,null,null,null,null,"Franklin County, OH",true,true,true]
[null,20230426144318,{"$f":"ROW()","v":1468},"Lopez Raul Lopez",null,null,"Lead",null,null,null,null,null,null,null,null,null,null,null,"Franklin County, OH",true,true,true]
[null,20230426144319,{"$f":"ROW()","v":1469},"Loren Glenn Whiddon",null,null,"Lead",null,null,null,null,null,null,null,null,null,null,null,"Nassau County, FL",true,true,true]
[null,20230426144320,{"$f":"ROW()","v":1470},"Loricks Auto Repair Llc","James C Lorick",null,"Lead","MailList11","kristin.lorick@gmail.com","loricksauto@gmail.com",null,"(803) 600-2245","(803) 356-1703","(803) 794-9670","4804 Augusta Rd","Lexington","SC",29073,"Lexington County, SC",false,false,false]
[null,20230426144321,{"$f":"ROW()","v":1471},"Louie J Dawson ",null,null,"Lead",null,null,null,null,null,null,null,null,null,null,null,"Houston County, AL",true,true,true]
[null,20230426144322,{"$f":"ROW()","v":1472},"Louis Calderon",null,null,"Lead","MailList11","louis_cldrn@yahoo.com",null,null,"(773) 767-6325","(773) 844-3986","(312) 269-4384","6233 S Natchez Ave","Chicago","IL",60638,"Cook County, IL",false,false,false]
[null,20230426144323,{"$f":"ROW()","v":1473},"Louis Calderon ",null,null,"Lead",null,null,null,null,null,null,null,null,null,null,null,"Cook County, IL",true,true,true]
[null,20230426144324,{"$f":"ROW()","v":1474},"Louis D Jones",null,null,"Lead",null,null,null,null,null,null,null,null,null,null,null,"DeSoto County, MS",true,true,true]
[null,20230426144325,{"$f":"ROW()","v":1475},"Louis D Zemp ",null,null,"Lead",null,null,null,null,null,null,null,null,null,null,null,"Charleston County, SC",true,true,true]
[null,20230426144326,{"$f":"ROW()","v":1476},"Louis R Cohan ",null,null,"Lead",null,null,null,null,null,null,null,null,null,null,null,"Cobb County, GA",true,true,true]
[null,20230426144327,{"$f":"ROW()","v":1477},"Louis S and Tonya S Smith","",null,"Lead","MailList11","tonya.smith@ameritrade.com",null,null,"(901) 358-4444","(901) 743-2346","(901) 730-0587","3050 Spring Hill Dr","Memphis","TN",38127,null,false,false,false]
[null,20230426144328,{"$f":"ROW()","v":1478},"LOVE MAUDIE",null,null,"Lead",null,null,null,null,null,null,null,null,null,null,null,"Madison County, MS",true,true,true]
[null,20230426144330,{"$f":"ROW()","v":1479},"LOVELADY ELECTRICAL CONTRACTORS LLC",null,null,"Lead",null,null,null,null,null,null,null,null,null,null,null,"Jefferson County, AL",true,true,true]
[null,20230426144331,{"$f":"ROW()","v":1480},"LOVELADY JEREMY D",null,null,"Lead",null,null,null,null,null,null,null,null,null,null,null,"Jefferson County, AL",true,true,true]
[null,20230426144332,{"$f":"ROW()","v":1481},"LOWERY LYNETTE",null,null,"Lead",null,null,null,null,null,null,null,null,null,null,null,"Jefferson County, AL",true,true,true]
[null,20230426144333,{"$f":"ROW()","v":1482},"LPV PRODUCTIONS INC",null,null,"Lead",null,null,null,null,null,null,null,null,null,null,null,"Cuyahoga County, OH",true,true,true]
[null,20230426144334,{"$f":"ROW()","v":1483},"Ltd Me&Miao ",null,null,"Lead",null,null,null,null,null,null,null,null,null,null,null,"Cook County, IL",true,true,true]
[null,20230426144335,{"$f":"ROW()","v":1484},"Lucanus Development Center Inc",null,null,"Lead",null,null,null,null,null,null,null,null,null,null,null,"Broward County, FL",true,true,true]
[null,20230426144336,{"$f":"ROW()","v":1485},"Lucia Miranda Oro Taboada ",null,null,"Lead",null,null,null,null,null,null,null,null,null,null,null,"Broward County, FL",true,true,true]
[null,20230426144337,{"$f":"ROW()","v":1486},"Lucien M Tenn ",null,null,"Lead",null,null,null,null,null,null,null,null,null,null,null,"Broward County, FL",true,true,true]
[null,20230426144338,{"$f":"ROW()","v":1487},"Lucinda Harrison ",null,null,"Lead",null,null,null,null,null,null,null,null,null,null,null,"Houston County, AL",true,true,true]
[null,20230426144339,{"$f":"ROW()","v":1488},"Lucious Moore ",null,null,"Lead",null,null,null,null,null,null,null,null,null,null,null,"Broward County, FL",true,true,true]
[null,20230426144340,{"$f":"ROW()","v":1489},"Lucky Dice Cafe LLC",null,null,"Lead",null,null,null,null,null,null,null,null,null,null,null,"Madison County, AL",true,true,true]
[null,20230426144341,{"$f":"ROW()","v":1490},"Lucretia Davis ",null,null,"Lead",null,null,null,null,null,null,null,null,null,null,null,"Macomb County, MI",true,true,true]
[null,20230426144342,{"$f":"ROW()","v":1491},"Ludmila Smolyansky ",null,null,"Lead",null,null,null,null,null,null,null,null,null,null,null,"Cook County, IL",true,true,true]
[null,20230426144343,{"$f":"ROW()","v":1492},"Ludner Confident ",null,null,"Lead",null,null,null,null,null,null,null,null,null,null,null,"Pinellas County, FL",true,true,true]
[null,20230426144344,{"$f":"ROW()","v":1493},"Luft Services Llc",null,null,"Lead",null,null,null,null,null,null,null,null,null,null,null,"Franklin County, OH",true,true,true]
[null,20230426144345,{"$f":"ROW()","v":1494},"Luis F Brathwaite ","Massa Brathwaite ",null,"Lead","MailList11","positiveimagingtech@gmail.com","lbrathw@juno.com","lbrathw1@juno.com","(516) 660-2868","(718) 306-9642","(516) 889-6090","11759 123rd St","South Ozone Park","NY",11420,"Lexington County, SC",false,false,false]
[null,20230426144346,{"$f":"ROW()","v":1495},"Luque Acct and Tax Services Corp",null,null,"Lead",null,null,null,null,null,null,null,null,null,null,null,"Cook County, IL",true,true,true]
[null,20230426144347,{"$f":"ROW()","v":1496},"Luth Ch Grace ",null,null,"Lead",null,null,null,null,null,null,null,null,null,null,null,"Cook County, IL",true,true,true]
[null,20230426144348,{"$f":"ROW()","v":1497},"LY MEN",null,null,"Lead",null,null,null,null,null,null,null,null,null,null,null,"Harrison County, MS",true,true,true]
[null,20230426144349,{"$f":"ROW()","v":1498},"Lynda S Shafer ",null,null,"Lead",null,null,null,null,null,null,null,null,null,null,null,"Cobb County, GA",true,true,true]
[null,20230426144350,{"$f":"ROW()","v":1499},"LYTTLE DAVID T ",null,null,"Lead",null,null,null,null,null,null,null,null,null,null,null,"Montgomery County, OH",true,true,true]
[null,20230426144351,{"$f":"ROW()","v":1500},"LYUBLINSKI EFIM",null,null,"Lead",null,null,null,null,null,null,null,null,null,null,null,"Cuyahoga County, OH",true,true,true]
[null,20230426144352,{"$f":"ROW()","v":1501},"M and K OCNSTRUCTION CO LLC",null,null,"Lead",null,null,null,null,null,null,null,null,null,null,null,"Wood County, WV",true,true,true]
[null,20230426144353,{"$f":"ROW()","v":1502},"M and M Collision Inc ","Gendels Collision Inc\nMichael Kondziolka",null,"Lead","MailList11","cheryl.kondziolka@yahoo.com",null,null,"(231) 598-0611","(231) 796-6533","(231) 592-9746","1015 Maple St","Big Rapids","MI",49307,"Wayne County, MI",false,false,false]
[null,20230426144354,{"$f":"ROW()","v":1503},"M Alexander ",null,null,"Lead",null,null,null,null,null,null,null,"4701 Marsh Hawk Ct","Valrico","FL",33596,"Hillsborough County, FL",true,true,false]
[null,20230426144355,{"$f":"ROW()","v":1504},"M Rivera Lebron ",null,null,"Lead",null,null,null,null,null,null,null,null,null,null,null,"Sussex County, NJ",true,true,true]
[null,20230426144356,{"$f":"ROW()","v":1505},"M Rivera-Lebron ",null,null,"Lead",null,null,null,null,null,null,null,null,null,null,null,"Sussex County, NJ",true,true,true]
[null,20230426144357,{"$f":"ROW()","v":1506},"M SCOTT BAKERIES INC",null,null,"Lead",null,null,null,null,null,null,null,null,null,null,null,"Jefferson County, AL",true,true,true]
[null,20230426144358,{"$f":"ROW()","v":1507},"M Valencia Ireta",null,null,"Lead",null,null,null,null,null,null,null,null,null,null,null,"Hamilton County, OH",true,true,true]
[null,20230426144359,{"$f":"ROW()","v":1508},"Ma Claudia Bennett","","","Lead","MailList11","newsolutionspainting@gmail.com",null,null,"(901) 340-4965","(901) 729-7002",null,"3735 Swan Ridge Cir S","Memphis","TN",38122,null,false,false,false]
[null,20230426144360,{"$f":"ROW()","v":1509},"Ma Group Inc",null,null,"Lead",null,null,null,null,null,null,null,null,null,null,null,"Miami-Dade County, FL",true,true,true]
[null,20230426144361,{"$f":"ROW()","v":1510},"Maani Omar",null,null,"Lead","MailList11","halina1madej@yahoo.com",null,null,"(630) 212-3736","(630) 212-3731","(630) 541-9047","8620 Johnston Rd","Burr Ridge","IL",60527,"Cook County, IL",false,false,false]
[null,20230426144362,{"$f":"ROW()","v":1511},"Macc Solutions and Distributions, LLC","",null,"Lead",null,null,null,null,"","","","288 Linwood Rd","Sterrett","AL",35147,null,true,true,false]
[null,20230426144363,{"$f":"ROW()","v":1512},"Mack Tuggle and Sherila Jones -Tuggle","","","Lead","MailList11","mack@jonesandtuggle.com","jmtuggle@aol.com","macktuggle@yahoo.com","(901) 754-2570","(901) 332-0111","(440) 454-0713","5294 Cherokee Rose Ln","Memphis","TN",38125,null,false,false,false]
[null,20230426144364,{"$f":"ROW()","v":1513},"MACKEY RADIATOR 4 INC",null,null,"Lead",null,null,null,null,null,null,null,null,null,null,null,"Summit County, OH",true,true,true]
[null,20230426144365,{"$f":"ROW()","v":1514},"MACKINNON CHRISTOPHER D",null,null,"Lead",null,null,null,null,null,null,null,null,null,null,null,"Harrison County, WV",true,true,true]
[null,20230426144366,{"$f":"ROW()","v":1515},"Macomb Family Services Inc",null,null,"Lead",null,null,null,null,null,null,null,null,null,null,null,"Macomb County, MI",true,true,true]
[null,20230426144367,{"$f":"ROW()","v":1516},"MAD RIVER TRANSPORT INC ",null,null,"Lead",null,null,null,null,null,null,null,null,null,null,null,"Montgomery County, OH",true,true,true]
[null,20230426144368,{"$f":"ROW()","v":1517},"Madalyns House Child Care LLC",null,null,"Lead",null,null,null,null,null,null,null,null,null,null,null,"Cobb County, GA",true,true,true]
[null,20230426144369,{"$f":"ROW()","v":1518},"Madalyns House Childcare LLC",null,null,"Lead",null,null,null,null,null,null,null,null,null,null,null,"Cobb County, GA",true,true,true]
[null,20230426144370,{"$f":"ROW()","v":1519},"MADDOX BARLON D",null,null,"Lead",null,null,null,null,null,null,null,null,null,null,null,"Jefferson County, AL",true,true,true]
[null,20230426144371,{"$f":"ROW()","v":1520},"MADDOX MARIYLN H",null,null,"Lead",null,null,null,null,null,null,null,null,null,null,null,"Jefferson County, AL",true,true,true]
[null,20230426144372,{"$f":"ROW()","v":1521},"Madera Daniel",null,null,"Lead",null,null,null,null,null,null,null,null,null,null,null,"Cook County, IL",true,true,true]
[null,20230426144373,{"$f":"ROW()","v":1522},"MADISON JOHN",null,null,"Lead",null,null,null,null,null,null,null,null,null,null,null,"Jefferson County, AL",true,true,true]
[null,20230426144374,{"$f":"ROW()","v":1523},"MAGIC CITY PRESSURE CLEANING INC",null,null,"Lead",null,null,null,null,null,null,null,null,null,null,null,"Jefferson County, AL",true,true,true]
[null,20230426144375,{"$f":"ROW()","v":1524},"Magnificent Home Healthcare LLC",null,null,"Lead",null,null,null,null,null,null,null,null,null,null,null,"Miami-Dade County, FL",true,true,true]
[null,20230426144376,{"$f":"ROW()","v":1525},"Malcolm I Owens ",null,null,"Lead",null,null,null,null,null,null,null,null,null,null,null,"Cook County, IL",true,true,true]
[null,20230426144377,{"$f":"ROW()","v":1526},"MALONEY, DAWN E",null,null,"Lead",null,null,null,null,null,null,null,null,null,null,null,"Summit County, OH",true,true,true]
[null,20230426144378,{"$f":"ROW()","v":1527},"Mamie S Beatty ",null,null,"Lead","MailList11","mamiebeatty@sbcglobal.net","mamiebeatty@comcast.net","mamie.beatty@sbcglobal.net","(313) 805-6893","(734) 737-9298","(901) 870-3437","27052 Westland Rd","Redford","MI",48240,"Wayne County, MI",false,false,false]
[null,20230426144379,{"$f":"ROW()","v":1528},"Management Group Ltd Usacs ",null,null,"Lead",null,null,null,null,null,null,null,null,null,null,null,"Genesee County, MI",true,true,true]
[null,20230426144380,{"$f":"ROW()","v":1529},"MANIS, CARL L",null,null,"Lead",null,null,null,null,null,null,null,null,null,null,null,"Lucas County, OH",true,true,true]
[null,20230426144381,{"$f":"ROW()","v":1530},"MANIS, LISA M ",null,null,"Lead",null,null,null,null,null,null,null,null,null,null,null,"Lucas County, OH",true,true,true]
[null,20230426144382,{"$f":"ROW()","v":1531},"Manning and Associates Securityllc",null,null,"Lead",null,null,null,null,null,null,null,null,null,null,null,"Cobb County, GA",true,true,true]
[null,20230426144383,{"$f":"ROW()","v":1532},"MANNING PATRICK G",null,null,"Lead",null,null,null,null,null,null,null,null,null,null,null,"Cuyahoga County, OH",true,true,true]
[null,20230426144384,{"$f":"ROW()","v":1533},"MANRON ELLIS ","",null,"Lead",null,null,null,null,null,null,null,"","","","","Jackson County, MS",true,true,true]
[null,20230426144385,{"$f":"ROW()","v":1534},"Marble City Meats, LLC","",null,"Lead",null,null,null,null,"","","","514 Odena Rd N","Sylacauga","AL",35150,null,true,true,false]
[null,20230426144386,{"$f":"ROW()","v":1535},"Marcel Pasalka ",null,null,"Lead",null,null,null,null,null,null,null,null,null,null,null,"Cook County, IL",true,true,true]
[null,20230426144387,{"$f":"ROW()","v":1536},"Marcia A Mcfarlane-Nyack ",null,null,"Lead",null,null,null,null,null,null,null,null,null,null,null,"Broward County, FL",true,true,true]
[null,20230426144388,{"$f":"ROW()","v":1537},"Marcos Reyes ",null,null,"Lead",null,null,null,null,null,null,null,null,null,null,null,"Volusia County, FL",true,true,true]
[null,20230426144389,{"$f":"ROW()","v":1538},"Marcotulio R V Mazariegos ",null,null,"Lead",null,null,null,null,null,null,null,null,null,null,null,"Cobb County, GA",true,true,true]
[null,20230426144390,{"$f":"ROW()","v":1539},"Marek Sanik ",null,null,"Lead",null,null,null,null,null,null,null,null,null,null,null,"Cook County, IL",true,true,true]
[null,20230426144391,{"$f":"ROW()","v":1540},"Margaret Cofrancesco ",null,null,"Lead",null,null,null,null,null,null,null,null,null,null,null,"Sussex County, NJ",true,true,true]
[null,20230426144392,{"$f":"ROW()","v":1541},"Maria A Gamboa ",null,null,"Lead",null,null,null,null,null,null,null,null,null,null,null,"Cook County, IL",true,true,true]
[null,20230426144393,{"$f":"ROW()","v":1542},"Maria C Abreu ",null,null,"Lead",null,null,null,null,null,null,null,null,null,null,null,"Broward County, FL",true,true,true]
[null,20230426144394,{"$f":"ROW()","v":1543},"Maria Fatima Cardoso ",null,null,"Lead",null,null,null,null,null,null,null,null,null,null,null,"Horry County, SC",true,true,true]
[null,20230426144395,{"$f":"ROW()","v":1544},"Maria T Rodriguez ",null,null,"Lead",null,null,null,null,null,null,null,null,null,null,null,"Broward County, FL",true,true,true]
[null,20230426144396,{"$f":"ROW()","v":1545},"Maria V Rosario ",null,null,"Lead",null,null,null,null,null,null,null,null,null,null,null,"Cook County, IL",true,true,true]
[null,20230426144397,{"$f":"ROW()","v":1546},"Mariano Pulido ",null,null,"Lead",null,null,null,null,null,null,null,null,null,null,null,"Cook County, IL",true,true,true]
[null,20230426144398,{"$f":"ROW()","v":1547},"Marias Unisex Ltd",null,null,"Lead",null,null,null,null,null,null,null,null,null,null,null,"Cook County, IL",true,true,true]
[null,20230426144399,{"$f":"ROW()","v":1548},"Marie V Iadipaoli ",null,null,"Lead",null,null,null,null,null,null,null,null,null,null,null,"Brevard County, FL",true,true,true]
[null,20230426144400,{"$f":"ROW()","v":1549},"Marilyn Wardle ",null,null,"Lead",null,null,null,null,null,null,null,null,null,null,null,"Pinellas County, FL",true,true,true]
[null,20230426144401,{"$f":"ROW()","v":1550},"Mario D Parham Sr","","","Lead","MailList11","mparham@windstream.net",null,null,"(901) 281-3677","(901) 743-9676","(901) 552-4446","11890 Metz Pl","Eads","TN","38028-6984",null,false,false,false]
[null,20230426144402,{"$f":"ROW()","v":1551},"Mario Dianovsky ",null,null,"Lead",null,null,null,null,null,null,null,null,null,null,null,"Miami-Dade County, FL",true,true,true]
[null,20230426144404,{"$f":"ROW()","v":1552},"Mario Rodriguez ",null,null,"Lead",null,null,null,null,null,null,null,null,null,null,null,"Cook County, IL",true,true,true]
[null,20230426144405,{"$f":"ROW()","v":1553},"Marjorie Petersen ",null,null,"Lead",null,null,null,null,null,null,null,null,null,null,null,"Cook County, IL",true,true,true]
[null,20230426144406,{"$f":"ROW()","v":1554},"Mark  J Moss DPM PC ",null,null,"Lead","MailList11","mmoss1012@aol.com",null,null,"(248) 553-8668","(248) 553-9193","(248) 763-1326","35115 Northmont Dr","Farmington Hills","MI",48331,null,false,false,false]
[null,20230426144407,{"$f":"ROW()","v":1555},"Mark A Spaugy ",null,null,"Lead",null,null,null,null,null,null,null,null,null,null,null,"Horry County, SC",true,true,true]
[null,20230426144408,{"$f":"ROW()","v":1556},"Mark Alston ",null,null,"Lead",null,null,null,null,null,null,null,null,null,null,null,"Charleston County, SC",true,true,true]
[null,20230426144409,{"$f":"ROW()","v":1557},"Mark Dedivanovic ",null,null,"Lead",null,null,null,null,null,null,null,null,null,null,null,"Macomb County, MI",true,true,true]
[null,20230426144410,{"$f":"ROW()","v":1558},"Mark Deitsch ",null,null,"Lead",null,null,null,null,null,null,null,null,null,null,null,"Charleston County, SC",true,true,true]
[null,20230426144411,{"$f":"ROW()","v":1559},"Mark Locour ",null,null,"Lead",null,null,null,null,null,null,null,null,null,null,null,"Cook County, IL",true,true,true]
[null,20230426144412,{"$f":"ROW()","v":1560},"Mark T and Misty J Weaver","",null,"Lead","MailList11","bweaver1997@gmail.com","mwaw100@hotmail.com","a4arrows@hotmail.com","(423) 637-4886","(706) 371-2597","(423) 658-1390","559 Melton Hill Drive","Clinton","TN",37716,null,false,false,false]
[null,20230426144413,{"$f":"ROW()","v":1561},"Marketmedios Comunicaciones Inc",null,null,"Lead",null,null,null,null,null,null,null,null,null,null,null,"Broward County, FL",true,true,true]
[null,20230426144414,{"$f":"ROW()","v":1562},"Marlon Alford ",null,null,"Lead",null,null,null,null,null,null,null,null,null,null,null,"Cook County, IL",true,true,true]
[null,20230426144415,{"$f":"ROW()","v":1563},"MARSHALL LAND COMPANY LLC",null,null,"Lead",null,null,null,null,null,null,null,null,null,null,null,"Stark County, OH",true,true,true]
[null,20230426144416,{"$f":"ROW()","v":1564},"Marshawn A Patterson","",null,"Lead","MailList11","prettyboymap@dell.com","prettyboymap@yahoo.com","prettyboymap@compuserve.com","(901) 412-8090","(901) 590-3855","(901) 248-9051","698 Woodlawn St","Memphis","TN","38107-3944",null,false,false,false]
[null,20230426144417,{"$f":"ROW()","v":1565},"Martin Delgadillo ",null,null,"Lead",null,null,null,null,null,null,null,null,null,null,null,"Cook County, IL",true,true,true]
[null,20230426144418,{"$f":"ROW()","v":1566},"Martin G Alston ",null,null,"Lead",null,null,null,null,null,null,null,null,null,null,null,"Cook County, IL",true,true,true]
[null,20230426144419,{"$f":"ROW()","v":1567},"MARTIN TERI J",null,null,"Lead",null,null,null,null,null,null,null,null,null,null,null,"Jefferson County, AL",true,true,true]
[null,20230426144420,{"$f":"ROW()","v":1568},"Martin Zoladz ",null,null,"Lead",null,null,null,null,null,null,null,null,null,null,null,"Cook County, IL",true,true,true]
[null,20230426144421,{"$f":"ROW()","v":1569},"MARTYN, MICHAEL",null,null,"Lead",null,null,null,null,null,null,null,null,null,null,null,"Summit County, OH",true,true,true]
[null,20230426144422,{"$f":"ROW()","v":1570},"Marvin J Bridget D Bowie ",null,null,"Lead","MailList11","bowieinc@sbcglobal.net","mbowie11@comcast.net",null,"(313) 477-1167","(313) 404-0764","(313) 526-4777","13837 Eastburn St","Detroit","MI",48205,null,false,false,false]
[null,20230426144423,{"$f":"ROW()","v":1571},"Marvin L Bell ",null,null,"Lead",null,null,null,null,null,null,null,null,null,null,null,"Cook County, IL",true,true,true]
[null,20230426144424,{"$f":"ROW()","v":1572},"Mary Barrett ",null,null,"Lead",null,null,null,null,null,null,null,null,null,null,null,"Sussex County, NJ",true,true,true]
[null,20230426144425,{"$f":"ROW()","v":1573},"Mary Coffey ","",null,"Lead",null,null,null,null,"(502) 261-9898","(502) 261-9274","(502) 491-6623","3340 Hidden Lake Ct","Fisherville","KY",40023,null,true,false,false]
[null,20230426144426,{"$f":"ROW()","v":1574},"Mary E Ryan ",null,null,"Lead","MailList11","mary48336@gmail.com","mary48336@att.net","merzie@email.com","(586) 381-0922","(586) 939-2401","(248) 364-0700","22766 Frederick Ave","Farmington","MI",48336,null,false,false,false]
[null,20230426144427,{"$f":"ROW()","v":1575},"Mary J Gates","",null,"Lead",null,null,null,null,null,null,null,"","","","","Lee County, MS",true,true,true]
[null,20230426144428,{"$f":"ROW()","v":1576},"Mary Kay Browne ",null,null,"Lead","MailList11","mare1256@yahoo.com",null,null,"(479) 445-6520","(973) 377-9179","(479) 582-1136","128 Crystal Springs Dr","Lexington","SC",29073,"Lexington County, SC",false,false,false]
[null,20230426144429,{"$f":"ROW()","v":1577},"Mary Roberts ","Steve Roberts ",null,"Lead","MailList11","steve.roberts@hotmail.com",null,null,"(850) 907-5749","(850) 386-8242","(850) 514-4252","9113 Old Chemonie Rd","Tallahassee","FL",32309,"Lexington County, SC",false,false,false]
[null,20230426144430,{"$f":"ROW()","v":1578},"Mason Kevin L",null,null,"Lead",null,null,null,null,null,null,null,null,null,null,null,"Cook County, IL",true,true,true]
[null,20230426144431,{"$f":"ROW()","v":1579},"MASTERCRAFT FLOORS INC",null,null,"Lead",null,null,null,null,null,null,null,null,null,null,null,"Jefferson County, AL",true,true,true]
[null,20230426144432,{"$f":"ROW()","v":1580},"MATELSKE DANIEL P JR",null,null,"Lead",null,null,null,null,null,null,null,null,null,null,null,"Cuyahoga County, OH",true,true,true]
[null,20230426144433,{"$f":"ROW()","v":1581},"Mathieu Gilman ",null,null,"Lead",null,null,null,null,null,null,null,null,null,null,null,"Cook County, IL",true,true,true]
[null,20230426144434,{"$f":"ROW()","v":1582},"MATT WINTERS EXCAVATION LLC",null,null,"Lead",null,null,null,null,null,null,null,null,null,null,null,"Summit County, OH",true,true,true]
[null,20230426144435,{"$f":"ROW()","v":1583},"Matthew D Sosonkin ",null,null,"Lead",null,null,null,null,null,null,null,null,null,null,null,"Broward County, FL",true,true,true]
[null,20230426144436,{"$f":"ROW()","v":1584},"Matthew D Twomey ",null,null,"Lead",null,null,null,null,null,null,null,null,null,null,null,"Charleston County, SC",true,true,true]
[null,20230426144437,{"$f":"ROW()","v":1585},"Matthew Eggen ",null,null,"Lead",null,null,null,null,null,null,null,null,null,null,null,"Broward County, FL",true,true,true]
[null,20230426144438,{"$f":"ROW()","v":1586},"Matthew L Batson ",null,null,"Lead",null,null,null,null,null,null,null,null,null,null,null,"Charleston County, SC",true,true,true]
[null,20230426144439,{"$f":"ROW()","v":1587},"Matthew L Mims ",null,null,"Lead",null,null,null,null,null,null,null,null,null,null,null,"Horry County, SC",true,true,true]
[null,20230426144440,{"$f":"ROW()","v":1588},"Matthew Martin ",null,null,"Lead",null,null,null,null,null,null,null,null,null,null,null,"Cobb County, GA",true,true,true]
[null,20230426144441,{"$f":"ROW()","v":1589},"Matthew O Lindeblad ",null,null,"Lead",null,null,null,null,null,null,null,null,null,null,null,"Cook County, IL",true,true,true]
[null,20230426144442,{"$f":"ROW()","v":1590},"Matthew Riccio ",null,null,"Lead",null,null,null,null,null,null,null,null,null,null,null,"Cook County, IL",true,true,true]
[null,20230426144443,{"$f":"ROW()","v":1591},"Matthew Ryan ",null,null,"Lead",null,null,null,null,null,null,null,null,null,null,null,"Albany County, NY",true,true,true]
[null,20230426144444,{"$f":"ROW()","v":1592},"Matthew T Embry","Complete Comfort, LLC",null,"Lead",null,null,null,null,"(502) 749-3903","(502) 749-9870","(502) 937-7032","5806 Grandel Blvd","Louisville","KY",40258,null,true,false,false]
[null,20230426144445,{"$f":"ROW()","v":1593},"Matthew T Jager ",null,null,"Lead",null,null,null,null,"(313) 575-1969","(313) 962-0429","(313) 877-9305","1419 6th St","Detroit","MI",48226,"Wayne County, MI",true,false,false]
[null,20230426144446,{"$f":"ROW()","v":1594},"Matthews Aundrea",null,null,"Lead",null,null,null,null,null,null,null,null,null,null,null,"Franklin County, OH",true,true,true]
[null,20230426144447,{"$f":"ROW()","v":1595},"Maurice Conley ",null,null,"Lead",null,null,null,null,"(773) 846-8080","(773) 776-5626","(312) 622-3527","8501 S Rockwell St","Chicago","IL",60652,"Cook County, IL",true,false,false]
[null,20230426144448,{"$f":"ROW()","v":1596},"Maurice Conley ",null,null,"Lead",null,null,null,null,null,null,null,null,null,null,null,"Cook County, IL",true,true,true]
[null,20230426144449,{"$f":"ROW()","v":1597},"Maury D Kommor",null,null,"Lead","MailList11","lorikommor@gmail.com","lamkommor@aol.com","kommor@kommorlaw.com","(502) 262-1013","(502) 451-6873","(502) 434-7349","1205 S 3rd St","Louisville","KY",40203,null,false,false,false]
[null,20230426144450,{"$f":"ROW()","v":1598},"MAWASHA PHETOLO R ",null,null,"Lead",null,null,null,null,null,null,null,null,null,null,null,"Montgomery County, OH",true,true,true]
[null,20230426144451,{"$f":"ROW()","v":1599},"MAXS SPORTS and SPIRITS ",null,null,"Lead",null,null,null,null,null,null,null,null,null,null,null,"Montgomery County, OH",true,true,true]
[null,20230426144452,{"$f":"ROW()","v":1600},"MAY RICHARD TIMOTHY",null,null,"Lead",null,null,null,null,null,null,null,null,null,null,null,"Rankin County, MS",true,true,true]
[null,20230426144453,{"$f":"ROW()","v":1601},"Mazen M Sukkar ",null,null,"Lead",null,null,null,null,null,null,null,null,null,null,null,"Broward County, FL",true,true,true]
[null,20230426144454,{"$f":"ROW()","v":1602},"MC NABB BRYAN ",null,null,"Lead",null,null,null,null,null,null,null,null,null,null,null,"Montgomery County, OH",true,true,true]
[null,20230426144455,{"$f":"ROW()","v":1603},"Mcallaster Katrina R",null,null,"Lead",null,null,null,null,null,null,null,null,null,null,null,"Franklin County, OH",true,true,true]
[null,20230426144456,{"$f":"ROW()","v":1604},"MCCALLA LAWN CARE",null,null,"Lead",null,null,null,null,null,null,null,null,null,null,null,"Jefferson County, AL",true,true,true]
[null,20230426144457,{"$f":"ROW()","v":1605},"MCCALLUM RICHARD S",null,null,"Lead",null,null,null,null,null,null,null,null,null,null,null,"Jefferson County, AL",true,true,true]
[null,20230426144458,{"$f":"ROW()","v":1606},"McCanns Inc",null,null,"Lead",null,null,null,null,null,null,null,null,null,null,null,"Horry County, SC",true,true,true]
[null,20230426144459,{"$f":"ROW()","v":1607},"Mcclellan Family Chiropractic PC Inc.","",null,"Lead",null,null,null,null,"","","","1021 Us Highway 431 Ste 12","Anniston","AL",36206,null,true,true,false]
[null,20230426144460,{"$f":"ROW()","v":1608},"MCCOY BRIAN D",null,null,"Lead",null,null,null,null,null,null,null,null,null,null,null,"Wood County, WV",true,true,true]
[null,20230426144461,{"$f":"ROW()","v":1609},"Mcduffie Daniel",null,null,"Lead",null,null,null,null,null,null,null,null,null,null,null,"Cook County, IL",true,true,true]
[null,20230426144462,{"$f":"ROW()","v":1610},"Mcgriff Auto Service Inc.","",null,"Lead",null,null,null,null,"","","","1614 Bell St","Montgomery","AL",36104,null,true,true,false]
[null,20230426144463,{"$f":"ROW()","v":1611},"MCKEE LASHUNDA",null,null,"Lead",null,null,null,null,null,null,null,null,null,null,null,"Jefferson County, AL",true,true,true]
[null,20230426144464,{"$f":"ROW()","v":1612},"MCKEE LASHUNDA K",null,null,"Lead",null,null,null,null,null,null,null,null,null,null,null,"Jefferson County, AL",true,true,true]
[null,20230426144465,{"$f":"ROW()","v":1613},"MCKEE TRACY K",null,null,"Lead",null,null,null,null,null,null,null,null,null,null,null,"Jefferson County, AL",true,true,true]
[null,20230426144466,{"$f":"ROW()","v":1614},"MCNAMARA EILEEN M",null,null,"Lead",null,null,null,null,null,null,null,null,null,null,null,"Cuyahoga County, OH",true,true,true]
[null,20230426144467,{"$f":"ROW()","v":1615},"Md Management Llc",null,null,"Lead",null,null,null,null,null,null,null,null,null,null,null,"Franklin County, OH",true,true,true]
[null,20230426144468,{"$f":"ROW()","v":1616},"MDMTAO LLC",null,null,"Lead",null,null,null,null,null,null,null,null,null,null,null,"Cuyahoga County, OH",true,true,true]
[null,20230426144469,{"$f":"ROW()","v":1617},"Me Myself And I Childcare Preschool LLC",null,null,"Lead",null,null,null,null,null,null,null,null,null,null,null,"Genesee County, MI",true,true,true]
[null,20230426144470,{"$f":"ROW()","v":1618},"MEADOWS E SR  ",null,null,"Lead",null,null,null,null,null,null,null,null,null,null,null,"Butler County, OH",true,true,true]
[null,20230426144471,{"$f":"ROW()","v":1619},"Medical Care Pc Horizons ",null,null,"Lead",null,null,null,null,null,null,null,null,null,null,null,"Madison County, AL",true,true,true]
[null,20230426144472,{"$f":"ROW()","v":1620},"Medical Personnel Suwannee ",null,null,"Lead",null,null,null,null,null,null,null,null,null,null,null,"Volusia County, FL",true,true,true]
[null,20230426144473,{"$f":"ROW()","v":1621},"Megan M and William H Mays III","","","Lead","MailList11","megan.pease@gmail.com","meganmp78@yahoo.com","tigergrd78@aol.com","(901) 831-6414","(901) 690-6760","(901) 737-6349","4174 Minden Rd","Memphis","TN",38117,null,false,false,false]
[null,20230426144474,{"$f":"ROW()","v":1622},"Megara Service Inc",null,null,"Lead",null,null,null,null,null,null,null,null,null,null,null,"Miami-Dade County, FL",true,true,true]
[null,20230426144475,{"$f":"ROW()","v":1623},"MEIGS MINE SERVICE LLC",null,null,"Lead",null,null,null,null,null,null,null,null,null,null,null,"Meigs County, OH",true,true,true]
[null,20230426144476,{"$f":"ROW()","v":1624},"Melanie L and Acer V Nesbitt","","","Lead","MailList11","melanielerese@hotmail.com","melanie.shaw@flash.net",null,"(901) 550-5340","(901) 569-8489","(901) 440-8073","1280 Auburn Woods Dr","Collierville","TN","38017-4857",null,false,false,false]
[null,20230426144477,{"$f":"ROW()","v":1625},"Melvin C Miller ",null,null,"Lead",null,null,null,null,null,null,null,null,null,null,null,"Horry County, SC",true,true,true]
[null,20230426144478,{"$f":"ROW()","v":1626},"Melvin L Phillips ",null,null,"Lead","MailList11","melvinlphillips@outlook.com","melvinphillips@netzero.net","melvin.phillips@cancer.org","(312) 623-9645","(312) 399-1124","(847) 864-9411","19 Huntington Cir #11","Naperville","IL",60540,"Cook County, IL",false,false,false]
[null,20230426144479,{"$f":"ROW()","v":1627},"MEREDITH RONALD W",null,null,"Lead",null,null,null,null,null,null,null,null,null,null,null,"Wood County, WV",true,true,true]
[null,20230426144480,{"$f":"ROW()","v":1628},"Meredith Walling ",null,null,"Lead",null,null,null,null,null,null,null,null,null,null,null,"Sussex County, NJ",true,true,true]
[null,20230426144481,{"$f":"ROW()","v":1629},"Mergenthaler Scott R",null,null,"Lead",null,null,null,null,null,null,null,null,null,null,null,"Franklin County, OH",true,true,true]
[null,20230426144482,{"$f":"ROW()","v":1630},"MERIDIETH, MICHAEL R JR",null,null,"Lead",null,null,null,null,null,null,null,null,null,null,null,"Lucas County, OH",true,true,true]
[null,20230426144483,{"$f":"ROW()","v":1631},"MERIDIETH, STACY",null,null,"Lead",null,null,null,null,null,null,null,null,null,null,null,"Lucas County, OH",true,true,true]
[null,20230426144484,{"$f":"ROW()","v":1632},"Meritra Inc",null,null,"Lead",null,null,null,null,null,null,null,null,null,null,null,"Franklin County, OH",true,true,true]
[null,20230426144485,{"$f":"ROW()","v":1633},"Metal Tech Products Inc","Letitia A Gordon",null,"Lead","MailList11","drumboogie1@gmail.com",null,null,"(313) 533-5277","(810) 750-8370","(248) 763-4012","15720 Dale ","DETROIT ","MI","MI 48223","Wayne County, MI",false,false,false]
[null,20230426144486,{"$f":"ROW()","v":1634},"Metro Detroit Barber College",null,null,"Lead","MailList11","metrodetbarber@yahoo.com",null,null,"(313) 342-4400",null,null,"7443 W Mcnichols Rd","Detroit","MI",48221,"Wayne County, MI",false,false,false]
[null,20230426144487,{"$f":"ROW()","v":1635},"MFERS LLC",null,null,"Lead",null,null,null,null,null,null,null,null,null,null,null,"Stark County, OH",true,true,true]
[null,20230426144488,{"$f":"ROW()","v":1636},"Mi Casa Hospitality Group LLC",null,null,"Lead",null,null,null,null,null,null,null,null,null,null,null,"Horry County, SC",true,true,true]
[null,20230426144489,{"$f":"ROW()","v":1637},"MICEALA  DELGADO",null,null,"Lead",null,null,null,null,null,null,null,null,null,null,null,"Hamilton County, OH",true,true,true]
[null,20230426144490,{"$f":"ROW()","v":1638},"Mich Martinez ",null,null,"Lead",null,null,null,null,null,null,null,null,null,null,null,"Broward County, FL",true,true,true]
[null,20230426144491,{"$f":"ROW()","v":1639},"Michael and Maryl Golden","","","Lead","MailList11","mworks@gmail.com","wntrberry@geocities.com","michael@dulcimerguy.com","(217) 473-5889","(217) 245-2207","(217) 245-7792","459 Peach Orchard Rd","Clinton","TN","37716-6607",null,false,false,false]
[null,20230426144492,{"$f":"ROW()","v":1640},"Michael A Cohen ",null,null,"Lead",null,null,null,null,null,null,null,null,null,null,null,"Oakland County, MI",true,true,true]
[null,20230426144493,{"$f":"ROW()","v":1641},"Michael Brown ",null,null,"Lead",null,null,null,null,null,null,null,null,null,null,null,"Broward County, FL",true,true,true]
[null,20230426144494,{"$f":"ROW()","v":1642},"Michael Campbell ",null,null,"Lead",null,null,null,null,null,null,null,null,null,null,null,"Genesee County, MI",true,true,true]
[null,20230426144495,{"$f":"ROW()","v":1643},"Michael D Guthrie","","","Lead","MailList11","mguthrie@mac.com","mikeomatic@aol.com","thememphoman@gmail.com","(901) 496-8115","(901) 685-0889","(901) 327-8045","176 S Oak Grove Rd","Memphis","TN","38120-2215",null,false,false,false]
[null,20230426144496,{"$f":"ROW()","v":1644},"Michael D Mcrae ",null,null,"Lead",null,null,null,null,null,null,null,null,null,null,null,"Rockdale County, GA",true,true,true]
[null,20230426144497,{"$f":"ROW()","v":1645},"Michael D Winfrey ",null,null,"Lead",null,null,null,null,null,null,null,null,null,null,null,"Cook County, IL",true,true,true]
[null,20230426144498,{"$f":"ROW()","v":1646},"Michael Flores ",null,null,"Lead",null,null,null,null,null,null,null,null,null,null,null,"Cook County, IL",true,true,true]
[null,20230426144499,{"$f":"ROW()","v":1647},"Michael Harding","Feezell Funeral Supplies Inc",null,"Lead","MailList11","feezellfs2013@att.net","elbarco@bellsouth.net","mpswharding@bellsouth.net","(865) 335-9292","(865) 970-3440","(865) 380-5500","102 Dante Cir","Maryville","TN",37803,null,false,false,false]
[null,20230426144500,{"$f":"ROW()","v":1648},"Michael J Tracy ",null,null,"Lead","MailList11","michael.tracy@worldnet.att.net","mtracy84@comcast.net","jftracyslp@tivejo.com","(847) 530-5405","(847) 729-3439","(847) 832-9297","1920 Chestnut Ave #113","Glenview","IL",60025,"Cook County, IL",false,false,false]
[null,20230426144501,{"$f":"ROW()","v":1649},"Michael Jerbich ",null,null,"Lead",null,null,null,null,null,null,null,null,null,null,null,"Cook County, IL",true,true,true]
[null,20230426144502,{"$f":"ROW()","v":1650},"Michael Jerode Mccann ",null,null,"Lead",null,null,null,null,null,null,null,null,null,null,null,"Mobile County, AL",true,true,true]
[null,20230426144503,{"$f":"ROW()","v":1651},"Michael K Burke ",null,null,"Lead",null,null,null,null,null,null,null,null,null,null,null,"Albany County, NY",true,true,true]
[null,20230426144504,{"$f":"ROW()","v":1652},"MICHAEL K H KOSSOW O D INC",null,null,"Lead",null,null,null,null,null,null,null,null,null,null,null,"Loraine County, OH",true,true,true]
[null,20230426144506,{"$f":"ROW()","v":1653},"Michael K Herron ",null,null,"Lead",null,null,null,null,null,null,null,null,null,null,null,"Hillsborough County, FL",true,true,true]
[null,20230426144507,{"$f":"ROW()","v":1654},"Michael L Christopher ",null,null,"Lead",null,null,null,null,null,null,null,null,null,null,null,"Volusia County, FL",true,true,true]
[null,20230426144508,{"$f":"ROW()","v":1655},"Michael M Fuller ",null,null,"Lead",null,null,null,null,null,null,null,null,null,null,null,"Cook County, IL",true,true,true]
[null,20230426144509,{"$f":"ROW()","v":1656},"Michael Manning ",null,null,"Lead",null,null,null,null,null,null,null,null,null,null,null,"Albany County, NY",true,true,true]
[null,20230426144510,{"$f":"ROW()","v":1657},"Michael Napieraj ",null,null,"Lead",null,null,null,null,null,null,null,null,null,null,null,"Oakland County, MI",true,true,true]
[null,20230426144511,{"$f":"ROW()","v":1658},"Michael Pendleton ",null,null,"Lead",null,null,null,null,null,null,null,null,null,null,null,"Cook County, IL",true,true,true]
[null,20230426144512,{"$f":"ROW()","v":1659},"Michael R Harris ","",null,"Lead","MailList11","arselyochoa1@msn.com","michae.harris5@netzero.net","michael.harris@ge.com","(513) 924-1511","(502) 310-1509","(502) 479-6075"," 2915 Dundee Rd","Louisville","KY",40205,null,false,false,false]
[null,20230426144513,{"$f":"ROW()","v":1660},"MICHAEL S DAVID TRUST  ",null,null,"Lead",null,null,null,null,null,null,null,null,null,null,null,"Butler County, OH",true,true,true]
[null,20230426144514,{"$f":"ROW()","v":1661},"Michael S Robbins ","Dawn Robbins ",null,"Lead","MailList11","dawn_m_wilson@hotmail.com","msrobbins2000@yahoo.com",null,"(502) 641-3745","(502) 398-5578","(502) 964-4892","1408 Whisperwood Trce","Louisville","KY",40245,null,false,false,false]
[null,20230426144515,{"$f":"ROW()","v":1662},"Michael Shamrock ",null,null,"Lead",null,null,null,null,null,null,null,"2049 Valley Lo Ln","Glenview","IL",60026,"Cook County, IL",true,true,false]
[null,20230426144516,{"$f":"ROW()","v":1663},"Michael T Tomlinson ",null,null,"Lead",null,null,null,null,null,null,null,null,null,null,null,"Horry County, SC",true,true,true]
[null,20230426144517,{"$f":"ROW()","v":1664},"Michael V Zaremski ",null,null,"Lead",null,null,null,null,null,null,null,null,null,null,null,"Sussex County, NJ",true,true,true]
[null,20230426144518,{"$f":"ROW()","v":1665},"Michaelene A Eakin ",null,null,"Lead",null,null,null,null,null,null,null,null,null,null,null,"Volusia County, FL",true,true,true]
[null,20230426144519,{"$f":"ROW()","v":1666},"Micheael Hoskin ",null,null,"Lead",null,null,null,null,null,null,null,null,null,null,null,"Cook County, IL",true,true,true]
[null,20230426144520,{"$f":"ROW()","v":1667},"Michelle L Southwick ",null,null,"Lead",null,null,null,null,null,null,null,null,null,null,null,"Volusia County, FL",true,true,true]
[null,20230426144521,{"$f":"ROW()","v":1668},"Michelle Reason ",null,null,"Lead","MailList11","michelle.eason@uspto.gov","effie.eason@bea.gov",null,"(571) 272-4231","(301) 322-6801","(301) 278-5066","1203 Ivy Club Ln #1713","Hyattsville","MD",20785,"Cook County, IL",false,false,false]
[null,20230426144522,{"$f":"ROW()","v":1669},"Michigan Temperature Services Llc","Charles Pearse",null,"Lead","MailList11","natannk@aol.com",null,null,"(734) 377-9622","(248) 486-7700","(734) 464-6176","11428 Arrowhead Dr","South Lyon","MI",48178,"Wayne County, MI",false,false,false]
[null,20230426144523,{"$f":"ROW()","v":1670},"Mickey Troccoli ",null,null,"Lead",null,null,null,null,null,null,null,null,null,null,null,"Cook County, IL",true,true,true]
[null,20230426144524,{"$f":"ROW()","v":1671},"Midwest Gi And Hepatology Llc",null,null,"Lead",null,null,null,null,null,null,null,null,null,null,null,"Cook County, IL",true,true,true]
[null,20230426144525,{"$f":"ROW()","v":1672},"Miguel A Alfaro ",null,null,"Lead",null,null,null,null,null,null,null,null,null,null,null,"Cook County, IL",true,true,true]
[null,20230426144526,{"$f":"ROW()","v":1673},"Miguel A Soto ",null,null,"Lead",null,null,null,null,null,null,null,null,null,null,null,"Cobb County, GA",true,true,true]
[null,20230426144527,{"$f":"ROW()","v":1674},"Miguel Valencia ",null,null,"Lead",null,null,null,null,null,null,null,null,null,null,null,"Cobb County, GA",true,true,true]
[null,20230426144528,{"$f":"ROW()","v":1675},"MIKE KAESER AUTO BODY AND SALES INC",null,null,"Lead",null,null,null,null,null,null,null,null,null,null,null,"Hamilton County, OH",true,true,true]
[null,20230426144529,{"$f":"ROW()","v":1676},"Milad J Shaer ",null,null,"Lead",null,null,null,null,null,null,null,null,null,null,null,"Cook County, IL",true,true,true]
[null,20230426144530,{"$f":"ROW()","v":1677},"Milardos Pizzeria And Sports Pub LLC",null,null,"Lead",null,null,null,null,null,null,null,null,null,null,null,"Horry County, SC",true,true,true]
[null,20230426144531,{"$f":"ROW()","v":1678},"Milford Merritt ",null,null,"Lead",null,null,null,null,null,null,null,null,null,null,null,"Cobb County, GA",true,true,true]
[null,20230426144532,{"$f":"ROW()","v":1679},"MILLER - WHITMER FAMILY CHIROPATIC INC",null,null,"Lead",null,null,null,null,null,null,null,null,null,null,null,"Harrison County, MS",true,true,true]
[null,20230426144533,{"$f":"ROW()","v":1680},"MILLER GINA",null,null,"Lead",null,null,null,null,null,null,null,null,null,null,null,"Jefferson County, AL",true,true,true]
[null,20230426144534,{"$f":"ROW()","v":1681},"MILLER JEREMY",null,null,"Lead",null,null,null,null,null,null,null,null,null,null,null,"Jefferson County, AL",true,true,true]
[null,20230426144535,{"$f":"ROW()","v":1682},"MILLER STEVEN L",null,null,"Lead",null,null,null,null,null,null,null,null,null,null,null,"Harrison County, MS",true,true,true]
[null,20230426144537,{"$f":"ROW()","v":1683},"MILLER, PAMELA",null,null,"Lead",null,null,null,null,null,null,null,null,null,null,null,"Loraine County, OH",true,true,true]
[null,20230426144538,{"$f":"ROW()","v":1684},"MILLERS PRINT and MAIL INC INC",null,null,"Lead",null,null,null,null,null,null,null,null,null,null,null,"Summit County, OH",true,true,true]
[null,20230426144539,{"$f":"ROW()","v":1685},"Minerva Moya ",null,null,"Lead","MailList11","minerva.moya@hotmail.com","mmr-23@hotmail.com","mmoya@amfam.com","(773) 259-5665","(708) 834-4474","(708) 317-4554","4116 Home Ave","Berwyn","IL",60402,"Cook County, IL",false,false,false]
[null,20230426144540,{"$f":"ROW()","v":1686},"Miodrag Gavriloski ",null,null,"Lead",null,null,null,null,null,null,null,null,null,null,null,"Macomb County, MI",true,true,true]
[null,20230426144541,{"$f":"ROW()","v":1687},"Mira Inc",null,null,"Lead",null,null,null,null,null,null,null,null,null,null,null,"Madison County, AL",true,true,true]
[null,20230426144542,{"$f":"ROW()","v":1688},"Miroslav Pavlovic ",null,null,"Lead",null,null,null,null,null,null,null,null,null,null,null,"Cook County, IL",true,true,true]
[null,20230426144543,{"$f":"ROW()","v":1689},"Misty Washington ",null,null,"Lead","MailList11","mistywright@dell.com","mwright0728@comcast.net","sangria_wright@yahoo.com","(404) 246-4308","(770) 703-6599","(770) 964-3161","6903 Misttop Loop","Fairburn","GA",30213,"Jefferson County, KY",false,false,false]
[null,20230426144544,{"$f":"ROW()","v":1690},"Mitchell Bell ",null,null,"Lead",null,null,null,null,null,null,null,null,null,null,null,"Miami-Dade County, FL",true,true,true]
[null,20230426144546,{"$f":"ROW()","v":1691},"Moates Auto Xchange Inc.","",null,"Lead",null,null,null,null,"","","","828 N Us Highway 231","Ozark","AL",35360,null,true,true,false]
[null,20230426144547,{"$f":"ROW()","v":1692},"Mobile Physicians For Women Pc Greater ",null,null,"Lead",null,null,null,null,null,null,null,null,null,null,null,"Mobile County, AL",true,true,true]
[null,20230426144548,{"$f":"ROW()","v":1693},"MODERN HAIRITAGE SALON LLC",null,null,"Lead",null,null,null,null,null,null,null,null,null,null,null,"Stark County, OH",true,true,true]
[null,20230426144549,{"$f":"ROW()","v":1694},"MOFFETT BRIAN K",null,null,"Lead",null,null,null,null,null,null,null,null,null,null,null,"Harrison County, MS",true,true,true]
[null,20230426144551,{"$f":"ROW()","v":1695},"Mohammad Sohail ",null,null,"Lead",null,null,null,null,null,null,null,null,null,null,null,"Cook County, IL",true,true,true]
[null,20230426144552,{"$f":"ROW()","v":1696},"Mohammed N Aljaber ",null,null,"Lead",null,null,null,null,null,null,null,null,null,null,null,"Volusia County, FL",true,true,true]
[null,20230426144553,{"$f":"ROW()","v":1697},"Mohamoud Ahmed",null,null,"Lead",null,null,null,null,null,null,null,null,null,null,null,"Franklin County, OH",true,true,true]
[null,20230426144554,{"$f":"ROW()","v":1698},"Moheeb Et Al Nasser",null,null,"Lead",null,null,null,null,null,null,null,null,null,null,null,"DeSoto County, MS",true,true,true]
[null,20230426144555,{"$f":"ROW()","v":1699},"MOLETTE SHAKERI",null,null,"Lead",null,null,null,null,null,null,null,null,null,null,null,"Jefferson County, AL",true,true,true]
[null,20230426144556,{"$f":"ROW()","v":1700},"Molly Jones",null,null,"Lead",null,null,null,null,null,null,null,null,null,null,null,"DeSoto County, MS",true,true,true]
[null,20230426144557,{"$f":"ROW()","v":1701},"MOLNAR JOSEPH JR  ",null,null,"Lead",null,null,null,null,null,null,null,null,null,null,null,"Stark County, OH",true,true,true]
[null,20230426144558,{"$f":"ROW()","v":1702},"MON AMIE INCORPORATED",null,null,"Lead",null,null,null,null,null,null,null,null,null,null,null,"Jefferson County, AL",true,true,true]
[null,20230426144559,{"$f":"ROW()","v":1703},"Monica Hincapie ",null,null,"Lead",null,null,null,null,null,null,null,null,null,null,null,"Volusia County, FL",true,true,true]
[null,20230426144560,{"$f":"ROW()","v":1704},"Monica Moss ",null,null,"Lead",null,null,null,null,null,null,null,null,null,null,null,"Horry County, SC",true,true,true]
[null,20230426144561,{"$f":"ROW()","v":1705},"Monifa A Beasley ",null,null,"Lead",null,null,null,null,null,null,null,null,null,null,null,"Cobb County, GA",true,true,true]
[null,20230426144562,{"$f":"ROW()","v":1706},"MOON AUTOMOTIVE INC",null,null,"Lead",null,null,null,null,null,null,null,null,null,null,null,"Jefferson County, AL",true,true,true]
[null,20230426144563,{"$f":"ROW()","v":1707},"MOORE HUTCHERSO TAMARA",null,null,"Lead",null,null,null,null,null,null,null,null,null,null,null,"Jefferson County, AL",true,true,true]
[null,20230426144564,{"$f":"ROW()","v":1708},"MOORE KERRI",null,null,"Lead",null,null,null,null,null,null,null,null,null,null,null,"Jefferson County, AL",true,true,true]
[null,20230426144565,{"$f":"ROW()","v":1709},"MOORE WILLIAM M ET AL",null,null,"Lead",null,null,null,null,null,null,null,null,null,null,null,"Madison County, MS",true,true,true]
[null,20230426144566,{"$f":"ROW()","v":1710},"MORRIS LESA R",null,null,"Lead",null,null,null,null,null,null,null,null,null,null,null,"\nCopiah County, MS",true,true,true]
[null,20230426144567,{"$f":"ROW()","v":1711},"MORROW CHRISTAL R",null,null,"Lead",null,null,null,null,null,null,null,null,null,null,null,"Cuyahoga County, OH",true,true,true]
[null,20230426144568,{"$f":"ROW()","v":1712},"MORUA JUAN A DIAZ ",null,null,"Lead",null,null,null,null,null,null,null,null,null,null,null,"Montgomery County, OH",true,true,true]
[null,20230426144569,{"$f":"ROW()","v":1713},"MOSS CARD CONSULTING INC",null,null,"Lead",null,null,null,null,null,null,null,null,null,null,null,"Cuyahoga County, OH",true,true,true]
[null,20230426144570,{"$f":"ROW()","v":1714},"MOSS TYRUS L",null,null,"Lead",null,null,null,null,null,null,null,null,null,null,null,"Jefferson County, AL",true,true,true]
[null,20230426144571,{"$f":"ROW()","v":1715},"Motumation Llc","Mike Dahl",null,"Lead","MailList11","mdahl1@gmail.com","michaeldahl@netzero.net",null,"(502) 396-8961","(502) 231-1866","(502) 314-1686","3101 Breckenridge Ln Ste 101","Louisville","KY",40220,null,false,false,false]
[null,20230426144572,{"$f":"ROW()","v":1716},"Mouayed Sara",null,null,"Lead",null,null,null,null,null,null,null,null,null,null,null,"Cook County, IL",true,true,true]
[null,20230426144573,{"$f":"ROW()","v":1717},"MOUNT PLEASANT NOW DEVELOPMENT CORP",null,null,"Lead",null,null,null,null,null,null,null,null,null,null,null,"Cuyahoga County, OH",true,true,true]
[null,20230426144574,{"$f":"ROW()","v":1718},"MOUNTAINEER TECHNOLOGY CONSULTANTS LLC",null,null,"Lead",null,null,null,null,null,null,null,null,null,null,null,"Monongalia County, VA",true,true,true]
[null,20230426144575,{"$f":"ROW()","v":1719},"Mrg Contractors Inc",null,null,"Lead",null,null,null,null,null,null,null,null,null,null,null,"Genesee County, MI",true,true,true]
[null,20230426144576,{"$f":"ROW()","v":1720},"Mrmb LLC",null,null,"Lead",null,null,null,null,null,null,null,null,null,null,null,"Horry County, SC",true,true,true]
[null,20230426144577,{"$f":"ROW()","v":1721},"Muin Shreim ",null,null,"Lead","MailList11","shreimm@aol.com",null,null,"(703) 481-8866","(201) 450-8378","(212) 288-8500","507 Roosevelt Blvd #C416","Falls Church   ","VA",22044,null,false,false,false]
[null,20230426144578,{"$f":"ROW()","v":1722},"MULLINAX RAYBURN",null,null,"Lead",null,null,null,null,null,null,null,null,null,null,null,"Jefferson County, AL",true,true,true]
[null,20230426144579,{"$f":"ROW()","v":1723},"Murphy Tria A",null,null,"Lead",null,null,null,null,null,null,null,null,null,null,null,"Cook County, IL",true,true,true]
[null,20230426144580,{"$f":"ROW()","v":1724},"Muslimah Mannan ",null,null,"Lead",null,null,null,null,null,null,null,null,null,null,null,"Oakland County, MI",true,true,true]
[null,20230426144581,{"$f":"ROW()","v":1725},"MUTCHLER JAMES S",null,null,"Lead",null,null,null,null,null,null,null,null,null,null,null,"Harrison County, MS",true,true,true]
[null,20230426144582,{"$f":"ROW()","v":1726},"Mutekis Williams ",null,null,"Lead",null,null,null,null,null,null,null,null,null,null,null,"Charleston County, SC",true,true,true]
[null,20230426144583,{"$f":"ROW()","v":1727},"MYERS CHARLES W",null,null,"Lead",null,null,null,null,null,null,null,null,null,null,null,"Jefferson County, AL",true,true,true]
[null,20230426144584,{"$f":"ROW()","v":1728},"Myers James J",null,null,"Lead",null,null,null,null,null,null,null,null,null,null,null,"Franklin County, OH",true,true,true]
[null,20230426144585,{"$f":"ROW()","v":1729},"Myrtle Morrison ",null,null,"Lead",null,null,null,null,null,null,null,null,null,null,null,"Cook County, IL",true,true,true]
[null,20230426144586,{"$f":"ROW()","v":1730},"Nacho Kitchen Llc",null,null,"Lead",null,null,null,null,null,null,null,null,null,null,null,"Franklin County, OH",true,true,true]
[null,20230426144587,{"$f":"ROW()","v":1731},"Najm Hassan ",null,null,"Lead",null,null,null,null,null,null,null,null,null,null,null,"Macomb County, MI",true,true,true]
[null,20230426144588,{"$f":"ROW()","v":1732},"Nakamura Jenkins ",null,null,"Lead",null,null,null,null,null,null,null,null,null,null,null,"Cook County, IL",true,true,true]
[null,20230426144589,{"$f":"ROW()","v":1733},"Narasimha Rao ",null,null,"Lead",null,null,null,null,null,null,null,null,null,null,null,"Oakland County, MI",true,true,true]
[null,20230426144590,{"$f":"ROW()","v":1734},"Nasca N Gray ",null,null,"Lead",null,null,null,null,null,null,null,null,null,null,null,"Cobb County, GA",true,true,true]
[null,20230426144591,{"$f":"ROW()","v":1735},"Natasha L Mayberry ",null,null,"Lead",null,null,null,null,null,null,null,null,null,null,null,"Cobb County, GA",true,true,true]
[null,20230426144592,{"$f":"ROW()","v":1736},"NATURES DREAM LLC",null,null,"Lead",null,null,null,null,null,null,null,null,null,null,null,"Cuyahoga County, OH",true,true,true]
[null,20230426144593,{"$f":"ROW()","v":1737},"Navarros WaLLCovering Etc",null,null,"Lead",null,null,null,null,null,null,null,null,null,null,null,"Charleston County, SC",true,true,true]
[null,20230426144594,{"$f":"ROW()","v":1738},"Neckel Jordan ",null,null,"Lead",null,null,null,null,null,null,null,null,null,null,null,"Cook County, IL",true,true,true]
[null,20230426144595,{"$f":"ROW()","v":1739},"Nedra L Friday (Haynes)",null,null,"Lead",null,null,null,null,"(704) 819-6311","(704) 736-2457","(704) 713-9393","14385 Saint Marys St","Detroit","MI",48227,null,true,false,false]
[null,20230426144596,{"$f":"ROW()","v":1740},"Neil C Watterson ",null,null,"Lead",null,null,null,null,null,null,null,null,null,null,null,"Horry County, SC",true,true,true]
[null,20230426144597,{"$f":"ROW()","v":1741},"Neil Shatzoff ",null,null,"Lead",null,null,null,null,null,null,null,null,null,null,null,"Brevard County, FL",true,true,true]
[null,20230426144598,{"$f":"ROW()","v":1742},"Neil Wright","","","Lead","MailList11","jdnwright_mortgagebanker@hotmail.com","neilw3434@gmail.com","allurevision@gmail.com","(517) 202-6601","(517) 749-6215","(517) 882-8179","1221 Cordova Club Dr","Cordova","TN","38018-2874",null,false,false,false]
[null,20230426144599,{"$f":"ROW()","v":1743},"Nerissa Goodman-session ",null,null,"Lead","MailList11","nerissasession@gmail.com","bachlor22@blackplanet.com","nwarne1@verizon.net","(318) 230-2831","(318) 636-0871","(318) 631-2683","751 Chicago Blvd","Detroit","MI",48202,null,false,false,false]
[null,20230426144600,{"$f":"ROW()","v":1744},"New Bangkok Cuisine Inc","Abdul Miah",null,"Lead","MailList11","miahah@hotmail.com","abdul.bronze@yahoo.com","bengalithuglife@hotmail.com","(586) 365-8957","(586) 489-6610","(313) 854-2007","13916 Barfield Dr","Warren","MI",48088,"Wayne County, MI",false,false,false]
[null,20230426144601,{"$f":"ROW()","v":1745},"New Beginnings Christian Academy Inc",null,null,"Lead",null,null,null,null,null,null,null,null,null,null,null,"Broward County, FL",true,true,true]
[null,20230426144602,{"$f":"ROW()","v":1746},"NIBLETT PHILLIP",null,null,"Lead",null,null,null,null,null,null,null,null,null,null,null,"Jefferson County, AL",true,true,true]
[null,20230426144603,{"$f":"ROW()","v":1747},"Nicholas Gerard","Mid South Oral Surgery","","Lead","MailList12","pgerard1279@gmail.com","plazear@blackplanet.com",null,"(901) 482-2903","(901) 746-9181","(406) 698-8206","1650 Bonnie Ln Ste 101","Cordova","TN","38016-0517",null,false,false,false]
[null,20230426144604,{"$f":"ROW()","v":1748},"Nicholas Martin ",null,null,"Lead",null,null,null,null,null,null,null,null,null,null,null,"Cook County, IL",true,true,true]
[null,20230426144605,{"$f":"ROW()","v":1749},"NICHOLAS PROPERTIES and DEVELOPMENTS INC",null,null,"Lead",null,null,null,null,null,null,null,null,null,null,null,"Cuyahoga County, OH",true,true,true]
[null,20230426144606,{"$f":"ROW()","v":1750},"NICHOLS JARROD D PC",null,null,"Lead",null,null,null,null,null,null,null,null,null,null,null,"Jefferson County, AL",true,true,true]
[null,20230426144607,{"$f":"ROW()","v":1751},"NICHOLS, JAKOB W",null,null,"Lead",null,null,null,null,null,null,null,null,null,null,null,"Summit County, OH",true,true,true]
[null,20230426144608,{"$f":"ROW()","v":1752},"NICK DAVISTON INSULATION INC",null,null,"Lead",null,null,null,null,null,null,null,null,null,null,null,"Jefferson County, AL",true,true,true]
[null,20230426144609,{"$f":"ROW()","v":1753},"Nick Daviston Insulation Inc.","",null,"Lead",null,null,null,null,"","","","Po Box 19124","Birmingham","AL",35219,null,true,true,false]
[null,20230426144610,{"$f":"ROW()","v":1754},"NICKERSON TREVOR",null,null,"Lead",null,null,null,null,null,null,null,null,null,null,null,"Harrison County, MS",true,true,true]
[null,20230426144611,{"$f":"ROW()","v":1755},"Nickolas D Hetherington ",null,null,"Lead",null,null,null,null,null,null,null,null,null,null,null,"Brevard County, FL",true,true,true]
[null,20230426144612,{"$f":"ROW()","v":1756},"NICKOLI MICHAEL J",null,null,"Lead",null,null,null,null,null,null,null,null,null,null,null,"Jefferson County, AL",true,true,true]
[null,20230426144613,{"$f":"ROW()","v":1757},"Nicole G Dooley ",null,null,"Lead","MailList12","miquemc05@yahoo.com",null,null,"(313) 676-3543","(313) 529-0209","(313) 693-8698","14780 Holmur St","Detroit","MI",48238,null,false,false,false]
[null,20230426144614,{"$f":"ROW()","v":1758},"Nicole Kalasho ",null,null,"Lead",null,null,null,null,null,null,null,null,null,null,null,"Oakland County, MI",true,true,true]
[null,20230426144615,{"$f":"ROW()","v":1759},"Nicole L Smith ",null,null,"Lead",null,null,null,null,null,null,null,null,null,null,null,"Cobb County, GA",true,true,true]
[null,20230426144616,{"$f":"ROW()","v":1760},"Nikita Griffin ",null,null,"Lead",null,null,null,null,null,null,null,null,null,null,null,"Cobb County, GA",true,true,true]
[null,20230426144617,{"$f":"ROW()","v":1761},"Nikor Management Llc",null,null,"Lead",null,null,null,null,null,null,null,null,null,null,null,"Franklin County, OH",true,true,true]
[null,20230426144618,{"$f":"ROW()","v":1762},"NIKSA DUANE",null,null,"Lead",null,null,null,null,null,null,null,null,null,null,null,"Cuyahoga County, OH",true,true,true]
[null,20230426144619,{"$f":"ROW()","v":1763},"Ninas Health Care Services Llc",null,null,"Lead",null,null,null,null,null,null,null,null,null,null,null,"Franklin County, OH",true,true,true]
[null,20230426144620,{"$f":"ROW()","v":1764},"Noe Mompoint ",null,null,"Lead",null,null,null,null,null,null,null,null,null,null,null,"Broward County, FL",true,true,true]
[null,20230426144621,{"$f":"ROW()","v":1765},"Noel Rose ",null,null,"Lead",null,null,null,null,null,null,null,null,null,null,null,"Broward County, FL",true,true,true]
[null,20230426144622,{"$f":"ROW()","v":1766},"Norma A Pleasance ",null,null,"Lead",null,null,null,null,null,null,null,null,null,null,null,"Cobb County, GA",true,true,true]
[null,20230426144623,{"$f":"ROW()","v":1767},"Norris Byrd ",null,null,"Lead",null,null,null,null,null,null,null,null,null,null,null,"Cobb County, GA",true,true,true]
[null,20230426144624,{"$f":"ROW()","v":1768},"Northlake Dental Clinic Pc",null,null,"Lead",null,null,null,null,null,null,null,null,null,null,null,"Cook County, IL",true,true,true]
[null,20230426144625,{"$f":"ROW()","v":1769},"Nunez Ricky M",null,null,"Lead",null,null,null,null,null,null,null,null,null,null,null,"Cook County, IL",true,true,true]
[null,20230426144626,{"$f":"ROW()","v":1770},"Nutricorp LLC",null,null,"Lead",null,null,null,null,null,null,null,null,null,null,null,"Miami-Dade County, FL",true,true,true]
[null,20230426144627,{"$f":"ROW()","v":1771},"Nych Co",null,null,"Lead",null,null,null,null,null,null,null,null,null,null,null,"Cook County, IL",true,true,true]
[null,20230426144628,{"$f":"ROW()","v":1772},"OAKDALE BAPTIST CHURCH",null,null,"Lead",null,null,null,null,null,null,null,null,null,null,null,"Rankin County, MS",true,true,true]
[null,20230426144629,{"$f":"ROW()","v":1773},"OBALONYE TANISHA",null,null,"Lead",null,null,null,null,null,null,null,null,null,null,null,"Cuyahoga County, OH",true,true,true]
[null,20230426144630,{"$f":"ROW()","v":1774},"Oberst David J",null,null,"Lead",null,null,null,null,null,null,null,null,null,null,null,"Franklin County, OH",true,true,true]
[null,20230426144631,{"$f":"ROW()","v":1775},"Obrien James M",null,null,"Lead",null,null,null,null,null,null,null,null,null,null,null,"Cook County, IL",true,true,true]
[null,20230426144632,{"$f":"ROW()","v":1776},"OCONNOR LAURA M",null,null,"Lead",null,null,null,null,null,null,null,null,null,null,null,"Jefferson County, AL",true,true,true]
[null,20230426144633,{"$f":"ROW()","v":1777},"Ocotillo Vista Inc",null,null,"Lead",null,null,null,null,null,null,null,null,null,null,null,"Miami-Dade County, FL",true,true,true]
[null,20230426144634,{"$f":"ROW()","v":1778},"Octavia and Main LLC Al",null,null,"Lead",null,null,null,null,null,null,null,null,null,null,null,"Charleston County, SC",true,true,true]
[null,20230426144635,{"$f":"ROW()","v":1779},"OFFICIAL INVESTIGATIONS AND SECURITY SERVICES INC\nTRI STATE MOBILE NOTARIES INC",null,null,"Lead",null,null,null,null,null,null,null,null,null,null,null,"Hamilton County, OH",true,true,true]
[null,20230426144636,{"$f":"ROW()","v":1780},"OFJA GROUP LLC",null,null,"Lead",null,null,null,null,null,null,null,null,null,null,null,"Summit County, OH",true,true,true]
[null,20230426144637,{"$f":"ROW()","v":1781},"OILFLOW PRODUCTION CHEMICALS INC",null,null,"Lead",null,null,null,null,null,null,null,null,null,null,null,"Madison County, MS",true,true,true]
[null,20230426144638,{"$f":"ROW()","v":1782},"OKAFOR DEAN O",null,null,"Lead",null,null,null,null,null,null,null,null,null,null,null,"Cuyahoga County, OH",true,true,true]
[null,20230426144639,{"$f":"ROW()","v":1783},"OLD SMOKEY BBQ INC",null,null,"Lead",null,null,null,null,null,null,null,null,null,null,null,"Jefferson County, AL",true,true,true]
[null,20230426144640,{"$f":"ROW()","v":1784},"Old Smokey BBQ Inc.","",null,"Lead",null,null,null,null,"","","","1031 Crest Rd","Leeds","AL",35094,null,true,true,false]
[null,20230426144641,{"$f":"ROW()","v":1785},"Oletha Jones ",null,null,"Lead",null,null,null,null,null,null,null,null,null,null,null,"Cook County, IL",true,true,true]
[null,20230426144642,{"$f":"ROW()","v":1786},"Oliver Adams ",null,null,"Lead",null,null,null,null,null,null,null,null,null,null,null,"Cobb County, GA",true,true,true]
[null,20230426144643,{"$f":"ROW()","v":1787},"Olson Samuel T",null,null,"Lead",null,null,null,null,null,null,null,null,null,null,null,"Franklin County, OH",true,true,true]
[null,20230426144644,{"$f":"ROW()","v":1788},"Omar Billy ",null,null,"Lead",null,null,null,null,null,null,null,null,null,null,null,"Cobb County, GA",true,true,true]
[null,20230426144645,{"$f":"ROW()","v":1789},"Omar Maani ",null,null,"Lead",null,null,null,null,null,null,null,null,null,null,null,"Cook County, IL",true,true,true]
[null,20230426144646,{"$f":"ROW()","v":1790},"Omar Robinson ",null,null,"Lead",null,null,null,null,null,null,null,null,null,null,null,"Broward County, FL",true,true,true]
[null,20230426144647,{"$f":"ROW()","v":1791},"OMEGA ELECTRIC LLC",null,null,"Lead",null,null,null,null,null,null,null,null,null,null,null,"Madison County, MS",true,true,true]
[null,20230426144648,{"$f":"ROW()","v":1792},"ON THE WAY NOW INC",null,null,"Lead",null,null,null,null,null,null,null,null,null,null,null,"Jefferson County, AL",true,true,true]
[null,20230426144649,{"$f":"ROW()","v":1793},"On The Way Now Inc.","",null,"Lead",null,null,null,null,"","","","3010 Taralaine Dr","Birmingham","AL",35216,null,true,true,false]
[null,20230426144650,{"$f":"ROW()","v":1794},"Once Upon A Quilt Where Dreams Come True Inc",null,null,"Lead",null,null,null,null,null,null,null,null,null,null,null,"Broward County, FL",true,true,true]
[null,20230426144651,{"$f":"ROW()","v":1795},"Oneill Brendan",null,null,"Lead",null,null,null,null,null,null,null,null,null,null,null,"Franklin County, OH",true,true,true]
[null,20230426144652,{"$f":"ROW()","v":1796},"Open MRI Of Pinellas Inc",null,null,"Lead",null,null,null,null,null,null,null,null,null,null,null,"Pinellas County, FL",true,true,true]
[null,20230426144653,{"$f":"ROW()","v":1797},"Or El Bensimon ",null,null,"Lead",null,null,null,null,null,null,null,null,null,null,null,"Broward County, FL",true,true,true]
[null,20230426144654,{"$f":"ROW()","v":1798},"Orafolarin Y Orafidiya ",null,null,"Lead",null,null,null,null,null,null,null,null,null,null,null,"Cook County, IL",true,true,true]
[null,20230426144655,{"$f":"ROW()","v":1799},"ORAHOSKE RICK",null,null,"Lead",null,null,null,null,null,null,null,null,null,null,null,"Cuyahoga County, OH",true,true,true]
[null,20230426144656,{"$f":"ROW()","v":1800},"Orlando W Adams Sr",null,null,"Lead","MailList12","orladams@yahoo.com","orlandocadams@gmail.com","hurrcne1@netzero.com","(847) 410-7378","(847) 966-0489","(224) 595-2225","7013 W Seward St","Niles","IL",60714,"Cook County, IL",false,false,false]
[null,20230426144657,{"$f":"ROW()","v":1801},"OROS JIM F JR PC",null,null,"Lead",null,null,null,null,null,null,null,null,null,null,null,"Jefferson County, AL",true,true,true]
[null,20230426144658,{"$f":"ROW()","v":1802},"Orozco Masonry Co Inc","Jose Orozco",null,"Lead",null,null,null,null,null,null,null,"14340 Hillcrest","Livonia","MI",48154,"Wayne County, MI",true,true,false]
[null,20230426144659,{"$f":"ROW()","v":1803},"ORTIZ RICHARD J",null,null,"Lead",null,null,null,null,null,null,null,null,null,null,null,"Cuyahoga County, OH",true,true,true]
[null,20230426144660,{"$f":"ROW()","v":1804},"Oscar Martinez Alonso ",null,null,"Lead",null,null,null,null,null,null,null,null,null,null,null,"Cobb County, GA",true,true,true]
[null,20230426144661,{"$f":"ROW()","v":1805},"Oseguera Inc.","",null,"Lead",null,null,null,null,"","","","1500 Lafayette Hwy","Roanoke","AL",36274,null,true,true,false]
[null,20230426144662,{"$f":"ROW()","v":1806},"Osman Bangura ",null,null,"Lead",null,null,null,null,null,null,null,null,null,null,null,"Broward County, FL",true,true,true]
[null,20230426144663,{"$f":"ROW()","v":1807},"Overall Body and Fitness Inc",null,null,"Lead",null,null,null,null,null,null,null,null,null,null,null,"Cook County, IL",true,true,true]
[null,20230426144664,{"$f":"ROW()","v":1808},"OWENS LANDSCAPE GROUP LLC",null,null,"Lead",null,null,null,null,null,null,null,null,null,null,null,"Jefferson County, AL",true,true,true]
[null,20230426144665,{"$f":"ROW()","v":1809},"Owens Malcolm I",null,null,"Lead",null,null,null,null,null,null,null,null,null,null,null,"Cook County, IL",true,true,true]
[null,20230426144666,{"$f":"ROW()","v":1810},"OWENS WILBY",null,null,"Lead",null,null,null,null,null,null,null,null,null,null,null,"Jefferson County, AL",true,true,true]
[null,20230426144667,{"$f":"ROW()","v":1811},"P237 LLC",null,null,"Lead",null,null,null,null,null,null,null,null,null,null,null,"Charleston County, SC",true,true,true]
[null,20230426144668,{"$f":"ROW()","v":1812},"Pa Pierinamontano ",null,null,"Lead",null,null,null,null,null,null,null,null,null,null,null,"Miami-Dade County, FL",true,true,true]
[null,20230426144669,{"$f":"ROW()","v":1813},"Palmetto Green Etc",null,null,"Lead",null,null,null,null,null,null,null,null,null,null,null,"Charleston County, SC",true,true,true]
[null,20230426144670,{"$f":"ROW()","v":1814},"Pamela A Jabari-Akil ",null,null,"Lead",null,null,null,null,null,null,null,null,null,null,null,"Cook County, IL",true,true,true]
[null,20230426144671,{"$f":"ROW()","v":1815},"Pamela Bell",null,null,"Lead",null,null,null,null,null,null,null,null,null,null,null,"DeSoto County, MS",true,true,true]
[null,20230426144672,{"$f":"ROW()","v":1816},"Pamela G Sylvester ",null,null,"Lead",null,null,null,null,null,null,null,null,null,null,null,"Sussex County, NJ",true,true,true]
[null,20230426144673,{"$f":"ROW()","v":1817},"Pamela Hopkins ",null,null,"Lead",null,null,null,null,null,null,null,null,null,null,null,"Genesee County, MI",true,true,true]
[null,20230426144674,{"$f":"ROW()","v":1818},"Pamela Ircema Sanchez ",null,null,"Lead",null,null,null,null,null,null,null,null,null,null,null,"Rockdale County, GA",true,true,true]
[null,20230426144675,{"$f":"ROW()","v":1819},"Pamela L Dagenhart ","Daybreak Personal Services","","Lead","MailList12","daybreakps@bellsouth.net","volunteer59@bellsouth.net",null,"(865) 483-8801","(423) 855-3438","(703) 330-7602","110 Newton Ln","Oak Ridge","TN","37830-8120",null,false,false,false]
[null,20230426144676,{"$f":"ROW()","v":1820},"Pamela R Oliver ",null,null,"Lead",null,null,null,null,null,null,null,null,null,null,null,"Broward County, FL",true,true,true]
[null,20230426144677,{"$f":"ROW()","v":1821},"Pamela Y Singleton ",null,null,"Lead",null,null,null,null,null,null,null,null,null,null,null,"Charleston County, SC",true,true,true]
[null,20230426144678,{"$f":"ROW()","v":1822},"Panos Andrew P",null,null,"Lead",null,null,null,null,null,null,null,null,null,null,null,"Franklin County, OH",true,true,true]
[null,20230426144679,{"$f":"ROW()","v":1823},"Park Wireless 29 Inc",null,null,"Lead",null,null,null,null,null,null,null,null,null,null,null,"Nassau County, FL",true,true,true]
[null,20230426144680,{"$f":"ROW()","v":1824},"PARKER TONYA",null,null,"Lead",null,null,null,null,null,null,null,null,null,null,null,"Jefferson County, AL",true,true,true]
[null,20230426144681,{"$f":"ROW()","v":1825},"PARKS SHARON D",null,null,"Lead",null,null,null,null,null,null,null,null,null,null,null,"Cuyahoga County, OH",true,true,true]
[null,20230426144682,{"$f":"ROW()","v":1826},"Parks Truck Repair LLC",null,null,"Lead",null,null,null,null,null,null,null,null,null,null,null,"Houston County, AL",true,true,true]
[null,20230426144683,{"$f":"ROW()","v":1827},"Parks Truck Repair, LLC","",null,"Lead",null,null,null,null,"","","","704 Murray Road","Dothan","AL",36303,null,true,true,false]
[null,20230426144684,{"$f":"ROW()","v":1828},"PARMA PRE SCHOOL INC",null,null,"Lead",null,null,null,null,null,null,null,null,null,null,null,"Cuyahoga County, OH",true,true,true]
[null,20230426144685,{"$f":"ROW()","v":1829},"Parnell Adam S",null,null,"Lead",null,null,null,null,null,null,null,null,null,null,null,"Cook County, IL",true,true,true]
[null,20230426144686,{"$f":"ROW()","v":1830},"PARRINO JOSEPH F",null,null,"Lead",null,null,null,null,null,null,null,null,null,null,null,"Cuyahoga County, OH",true,true,true]
[null,20230426144687,{"$f":"ROW()","v":1831},"Parris D Jackson ",null,null,"Lead",null,null,null,null,null,null,null,null,null,null,null,"Macomb County, MI",true,true,true]
[null,20230426144688,{"$f":"ROW()","v":1832},"Pas Ohana Llc",null,null,"Lead",null,null,null,null,null,null,null,null,null,null,null,"Franklin County, OH",true,true,true]
[null,20230426144689,{"$f":"ROW()","v":1833},"Pat and Mikes Fb LLC",null,null,"Lead",null,null,null,null,null,null,null,null,null,null,null,"Horry County, SC",true,true,true]
[null,20230426144690,{"$f":"ROW()","v":1834},"PATE RODNEY",null,null,"Lead",null,null,null,null,null,null,null,null,null,null,null,"Jefferson County, AL",true,true,true]
[null,20230426144691,{"$f":"ROW()","v":1835},"PATHWAY HEALTHCARE LLC",null,null,"Lead",null,null,null,null,null,null,null,null,null,null,null,"Jefferson County, AL",true,true,true]
[null,20230426144692,{"$f":"ROW()","v":1836},"Patio Emporium Corp Outdoor ",null,null,"Lead",null,null,null,null,null,null,null,null,null,null,null,"Miami-Dade County, FL",true,true,true]
[null,20230426144693,{"$f":"ROW()","v":1837},"Patmon Jewel Y",null,null,"Lead",null,null,null,null,null,null,null,null,null,null,null,"Franklin County, OH",true,true,true]
[null,20230426144694,{"$f":"ROW()","v":1838},"Patricia Adams ",null,null,"Lead",null,null,null,null,null,null,null,null,null,null,null,"Cobb County, GA",true,true,true]
[null,20230426144695,{"$f":"ROW()","v":1839},"Patricia Calhoun ",null,null,"Lead","MailList12","robbinsrule@msn.com","blackroses91473@att.net","robbinsrule@compuserve.com","(269) 964-4097","(269) 964-4435","(269) 969-0114","217 Virginia Ave","Battle Creek","MI",49037,null,false,false,false]
[null,20230426144696,{"$f":"ROW()","v":1840},"Patricia Calhoun ",null,null,"Lead","MailList12","pcalhoun@ole.com","calhounp50@yahoo.com","calhoun_patricia@att.net","(248) 499-8686","(248) 230-1906","(248) 253-1641","21 Karen Ct","Pontiac","MI",48340,null,false,false,false]
[null,20230426144697,{"$f":"ROW()","v":1841},"Patricia Darden ",null,null,"Lead",null,null,null,null,null,null,null,null,null,null,null,"Cobb County, GA",true,true,true]
[null,20230426144698,{"$f":"ROW()","v":1842},"Patricia Davis ",null,null,"Lead",null,null,null,null,null,null,null,null,null,null,null,"Cook County, IL",true,true,true]
[null,20230426144699,{"$f":"ROW()","v":1843},"Patricia Putignano ",null,null,"Lead",null,null,null,null,null,null,null,null,null,null,null,"Cook County, IL",true,true,true]
[null,20230426144700,{"$f":"ROW()","v":1844},"Patrick Anderson ",null,null,"Lead",null,null,null,null,null,null,null,null,null,null,null,"Mobile County, AL",true,true,true]
[null,20230426144701,{"$f":"ROW()","v":1845},"Patrick D Ryan","","","Lead","MailList12","pdrbaja@yahoo.com",null,null,"(971) 223-5525","(503) 336-4629","(503) 627-9881","8630 Sw Scholls Ferry Rd Pmb 152","Beaverton","OR",97008,null,false,false,false]
[null,20230426144702,{"$f":"ROW()","v":1846},"Patrick Donnely ",null,null,"Lead",null,null,null,null,null,null,null,null,null,null,null,"Cook County, IL",true,true,true]
[null,20230426144703,{"$f":"ROW()","v":1847},"PATRICK LESTER D",null,null,"Lead",null,null,null,null,null,null,null,null,null,null,null,"Rankin County, MS",true,true,true]
[null,20230426144704,{"$f":"ROW()","v":1848},"Patrick M Goss ",null,null,"Lead","MailList12","anglerdude@hotmail.com",null,null,"(734) 420-4402","(734) 927-4163","(248) 924-2313","17078 Dunswood Rd","Northville","MI",48168,"Wayne County, MI",false,false,false]
[null,20230426144705,{"$f":"ROW()","v":1849},"Patrick Mccallister ",null,null,"Lead",null,null,null,null,null,null,null,null,null,null,null,"Volusia County, FL",true,true,true]
[null,20230426144706,{"$f":"ROW()","v":1850},"Patterson Rodney",null,null,"Lead",null,null,null,null,null,null,null,null,null,null,null,"Franklin County, OH",true,true,true]
[null,20230426144707,{"$f":"ROW()","v":1851},"Paul E Jr Featherstone ",null,null,"Lead",null,null,null,null,"(313) 863-4306","(313) 307-8321","(313) 468-0137","19450 Tracey St","Detroit","MI",48235,"Wayne County, MI",true,false,false]
[null,20230426144708,{"$f":"ROW()","v":1852},"Paul J Kelsey ",null,null,"Lead",null,null,null,null,null,null,null,null,null,null,null,"Cook County, IL",true,true,true]
[null,20230426144709,{"$f":"ROW()","v":1853},"Paul Norwood ",null,null,"Lead",null,null,null,null,null,null,null,null,null,null,null,"Cobb County, GA",true,true,true]
[null,20230426144710,{"$f":"ROW()","v":1854},"Paul Rohan",null,null,"Lead",null,null,null,null,null,null,null,null,null,null,null,"Nassau County, FL",true,true,true]
[null,20230426144711,{"$f":"ROW()","v":1855},"Paula Houpe ",null,null,"Lead",null,null,null,null,null,null,null,null,null,null,null,"Charleston County, SC",true,true,true]
[null,20230426144712,{"$f":"ROW()","v":1856},"Pauline Malkin ",null,null,"Lead",null,null,null,null,null,null,null,null,null,null,null,"Genesee County, MI",true,true,true]
[null,20230426144713,{"$f":"ROW()","v":1857},"PAWLOSKI, MICHAEL",null,null,"Lead",null,null,null,null,null,null,null,null,null,null,null,"Loraine County, OH",true,true,true]
[null,20230426144714,{"$f":"ROW()","v":1858},"PAYNE MARCELLUS JR",null,null,"Lead",null,null,null,null,null,null,null,null,null,null,null,"Jefferson County, AL",true,true,true]
[null,20230426144715,{"$f":"ROW()","v":1859},"Pc Healthland ",null,null,"Lead",null,null,null,null,null,null,null,null,null,null,null,"Macomb County, MI",true,true,true]
[null,20230426144716,{"$f":"ROW()","v":1860},"PCRK OH MAUMEE 0653 LLC",null,null,"Lead",null,null,null,null,null,null,null,null,null,null,null,"Lucas County, OH",true,true,true]
[null,20230426144717,{"$f":"ROW()","v":1861},"PEARSON BROTHERS TIRE CENTER 3 LLC",null,null,"Lead",null,null,null,null,null,null,null,null,null,null,null,"Jefferson County, AL",true,true,true]
[null,20230426144718,{"$f":"ROW()","v":1862},"Pearson Brothers Tire Center 3, LLC","",null,"Lead",null,null,null,null,"","","","2429 Carraway Blvd","Birmingham","AL",35234,null,true,true,false]
[null,20230426144719,{"$f":"ROW()","v":1863},"Pedro A Rion ",null,null,"Lead",null,null,null,null,null,null,null,null,null,null,null,"Broward County, FL",true,true,true]
[null,20230426144720,{"$f":"ROW()","v":1864},"Pedro Cruz Pelcastre ",null,null,"Lead",null,null,null,null,null,null,null,null,null,null,null,"Cobb County, GA",true,true,true]
[null,20230426144721,{"$f":"ROW()","v":1865},"Peggy R Wall Inc.","",null,"Lead",null,null,null,null,"","","","1904 Delaware Ave","Jasper","AL",35501,null,true,true,false]
[null,20230426144722,{"$f":"ROW()","v":1866},"PELFREY TIMOTHY J  ",null,null,"Lead",null,null,null,null,null,null,null,null,null,null,null,"Stark County, OH",true,true,true]
[null,20230426144723,{"$f":"ROW()","v":1867},"PELHAM JOHN A",null,null,"Lead",null,null,null,null,null,null,null,null,null,null,null,"Jefferson County, AL",true,true,true]
[null,20230426144724,{"$f":"ROW()","v":1868},"PELHAM PHYLLIS J",null,null,"Lead",null,null,null,null,null,null,null,null,null,null,null,"Jefferson County, AL",true,true,true]
[null,20230426144725,{"$f":"ROW()","v":1869},"PELTON, JOHN",null,null,"Lead",null,null,null,null,null,null,null,null,null,null,null,"Loraine County, OH",true,true,true]
[null,20230426144726,{"$f":"ROW()","v":1870},"PERAZA ANGEL JOEL MALDONADO ",null,null,"Lead",null,null,null,null,null,null,null,null,null,null,null,"Montgomery County, OH",true,true,true]
[null,20230426144727,{"$f":"ROW()","v":1871},"Percola Brooks ",null,null,"Lead",null,null,null,null,null,null,null,null,null,null,null,"Macomb County, MI",true,true,true]
[null,20230426144728,{"$f":"ROW()","v":1872},"Percy A Wilson ",null,null,"Lead",null,null,null,null,"(313) 648-6462","(313) 834-7852","(313) 292-3272","12081 Dequindre St","Hamtramck","MI",48212,null,true,false,false]
[null,20230426144729,{"$f":"ROW()","v":1873},"Percy Squire Co Llc",null,null,"Lead",null,null,null,null,null,null,null,null,null,null,null,"Franklin County, OH",true,true,true]
[null,20230426144730,{"$f":"ROW()","v":1874},"PERFORMANCE ASPHALT PAVING INCORPORATED",null,null,"Lead",null,null,null,null,null,null,null,null,null,null,null,"Butler County, OH",true,true,true]
[null,20230426144731,{"$f":"ROW()","v":1875},"PERK WILLIAM",null,null,"Lead",null,null,null,null,null,null,null,null,null,null,null,"Cuyahoga County, OH",true,true,true]
[null,20230426144732,{"$f":"ROW()","v":1876},"PERKINS MATTHEW ET AL",null,null,"Lead",null,null,null,null,null,null,null,null,null,null,null,"Madison County, MS",true,true,true]
[null,20230426144733,{"$f":"ROW()","v":1877},"PERKINS THOMAS E",null,null,"Lead",null,null,null,null,null,null,null,null,null,null,null,"Butler County, OH",true,true,true]
[null,20230426144734,{"$f":"ROW()","v":1878},"PERRY TAMARO",null,null,"Lead",null,null,null,null,null,null,null,null,null,null,null,"Jefferson County, AL",true,true,true]
[null,20230426144735,{"$f":"ROW()","v":1879},"Perry W Freeman ",null,null,"Lead","MailList12","alis20@nyc.rr.com",null,null,"(803) 662-9247","(803) 391-0667","(337) 417-4747","2374 Northview Dr","Orangeburg","SC",29118,"Lexington County, SC",false,false,false]
[null,20230426144736,{"$f":"ROW()","v":1880},"Pet Spa Of Myrtle Beach LLC",null,null,"Lead",null,null,null,null,null,null,null,null,null,null,null,"Horry County, SC",true,true,true]
[null,20230426144737,{"$f":"ROW()","v":1881},"Pete and Shortys On The Park LLC",null,null,"Lead",null,null,null,null,null,null,null,null,null,null,null,"Pinellas County, FL",true,true,true]
[null,20230426144738,{"$f":"ROW()","v":1882},"Pete Churchill ",null,null,"Lead",null,null,null,null,null,null,null,null,null,null,null,"Horry County, SC",true,true,true]
[null,20230426144739,{"$f":"ROW()","v":1883},"Peter J Anadio ",null,null,"Lead",null,null,null,null,null,null,null,null,null,null,null,"Broward County, FL",true,true,true]
[null,20230426144740,{"$f":"ROW()","v":1884},"Peter Manescala ",null,null,"Lead",null,null,null,null,null,null,null,null,null,null,null,"Hillsborough County, FL",true,true,true]
[null,20230426144741,{"$f":"ROW()","v":1885},"Peter T Hingos ",null,null,"Lead",null,null,null,null,null,null,null,null,null,null,null,"Cobb County, GA",true,true,true]
[null,20230426144742,{"$f":"ROW()","v":1886},"Petersen Marjorie",null,null,"Lead",null,null,null,null,null,null,null,null,null,null,null,"Cook County, IL",true,true,true]
[null,20230426144743,{"$f":"ROW()","v":1887},"PETERSON MICHAEL ",null,null,"Lead",null,null,null,null,null,null,null,null,null,null,null,"Montgomery County, OH",true,true,true]
[null,20230426144744,{"$f":"ROW()","v":1888},"PETES PIZZA",null,null,"Lead",null,null,null,null,null,null,null,null,null,null,null,"Wood County, WV",true,true,true]
[null,20230426144745,{"$f":"ROW()","v":1889},"Peyton R Walters ",null,null,"Lead",null,null,null,null,null,null,null,null,null,null,null,"Broward County, FL",true,true,true]
[null,20230426144746,{"$f":"ROW()","v":1890},"Pham Tanya T",null,null,"Lead",null,null,null,null,null,null,null,null,null,null,null,"Franklin County, OH",true,true,true]
[null,20230426144747,{"$f":"ROW()","v":1891},"PHIL S FOODS LLC",null,null,"Lead",null,null,null,null,null,null,null,null,null,null,null,"Jefferson County, AL",true,true,true]
[null,20230426144748,{"$f":"ROW()","v":1892},"Philip Esformes ",null,null,"Lead","MailList12","philip.esformes@bellsouth.net","sherribesformes@aol.com",null,"(305) 865-6561","(847) 674-1702","(305) 865-8572","3525 W Peterson Ave #510","Chicago","IL",60659,"Cook County, IL",false,false,false]
[null,20230426144749,{"$f":"ROW()","v":1893},"Phillip A Sr Zavala ",null,null,"Lead",null,null,null,null,null,null,null,null,null,null,null,"Mobile County, AL",true,true,true]
[null,20230426144750,{"$f":"ROW()","v":1894},"Phillip L Friason ",null,null,"Lead",null,null,null,null,null,null,null,null,null,null,null,"Charleston County, SC",true,true,true]
[null,20230426144751,{"$f":"ROW()","v":1895},"Phoenix Integrated Health Llc",null,null,"Lead",null,null,null,null,null,null,null,null,null,null,null,"Franklin County, OH",true,true,true]
[null,20230426144752,{"$f":"ROW()","v":1896},"PHOENIX LLC",null,null,"Lead",null,null,null,null,null,null,null,null,null,null,null,"Jefferson County, AL",true,true,true]
[null,20230426144753,{"$f":"ROW()","v":1897},"Phuong N Dang",null,null,"Lead",null,null,null,null,null,null,null,"4348 N Oleander Ave","Norridge","IL",60706,"Cook County, IL",true,true,false]
[null,20230426144754,{"$f":"ROW()","v":1898},"Phuong N Dang ",null,null,"Lead",null,null,null,null,null,null,null,null,null,null,null,"Cook County, IL",true,true,true]
[null,20230426144755,{"$f":"ROW()","v":1899},"Phyllis Jones","",null,"Lead",null,null,null,null,"","","","5114 Andover Dr","Memphis","TN",38109,null,true,true,false]
[null,20230426144756,{"$f":"ROW()","v":1900},"PICKETT GWENDOLYN",null,null,"Lead",null,null,null,null,null,null,null,null,null,null,null,"Madison County, MS",true,true,true]
[null,20230426144757,{"$f":"ROW()","v":1901},"Pietro Cavataio ",null,null,"Lead",null,null,null,null,null,null,null,null,null,null,null,"Macomb County, MI",true,true,true]
[null,20230426144758,{"$f":"ROW()","v":1902},"PIGOTT PATRICK C",null,null,"Lead",null,null,null,null,null,null,null,null,null,null,null,"Madison County, MS",true,true,true]
[null,20230426144759,{"$f":"ROW()","v":1903},"Pillcorema Saico Fermin Orlando",null,null,"Lead",null,null,null,null,null,null,null,null,null,null,null,"Franklin County, OH",true,true,true]
[null,20230426144760,{"$f":"ROW()","v":1904},"Pillow Jason",null,null,"Lead",null,null,null,null,null,null,null,null,null,null,null,"Cook County, IL",true,true,true]
[null,20230426144761,{"$f":"ROW()","v":1905},"PINECREST LLC",null,null,"Lead",null,null,null,null,null,null,null,null,null,null,null,"\nCopiah County, MS",true,true,true]
[null,20230426144762,{"$f":"ROW()","v":1906},"PINEDA JOSE PENALOZA",null,null,"Lead",null,null,null,null,null,null,null,null,null,null,null,"Madison County, MS",true,true,true]
[null,20230426144763,{"$f":"ROW()","v":1907},"Pinnacle Maintenance Services Inc",null,null,"Lead",null,null,null,null,null,null,null,null,null,null,null,"Cobb County, GA",true,true,true]
[null,20230426144764,{"$f":"ROW()","v":1908},"PITMAN BETTY A",null,null,"Lead",null,null,null,null,null,null,null,null,null,null,null,"Stark County, OH",true,true,true]
[null,20230426144765,{"$f":"ROW()","v":1909},"PITTMAN, CHEMIKA L",null,null,"Lead",null,null,null,null,null,null,null,null,null,null,null,"Summit County, OH",true,true,true]
[null,20230426144766,{"$f":"ROW()","v":1910},"Pittner Kevin J",null,null,"Lead",null,null,null,null,null,null,null,null,null,null,null,"Cook County, IL",true,true,true]
[null,20230426144767,{"$f":"ROW()","v":1911},"PITTS BRANDON",null,null,"Lead",null,null,null,null,null,null,null,null,null,null,null,"Cuyahoga County, OH",true,true,true]
[null,20230426144768,{"$f":"ROW()","v":1912},"Playhouse Day Etc",null,null,"Lead",null,null,null,null,null,null,null,null,null,null,null,"Charleston County, SC",true,true,true]
[null,20230426144769,{"$f":"ROW()","v":1913},"POELKING CARPENTRY CORP",null,null,"Lead",null,null,null,null,null,null,null,null,null,null,null,"Cuyahoga County, OH",true,true,true]
[null,20230426144770,{"$f":"ROW()","v":1914},"Point Of Grace International Ministries Inc",null,null,"Lead",null,null,null,null,null,null,null,null,null,null,null,"Broward County, FL",true,true,true]
[null,20230426144771,{"$f":"ROW()","v":1915},"POLLNITZ RENETTA",null,null,"Lead",null,null,null,null,null,null,null,null,null,null,null,"Jefferson County, AL",true,true,true]
[null,20230426144772,{"$f":"ROW()","v":1916},"Porter Maxine F",null,null,"Lead",null,null,null,null,null,null,null,null,null,null,null,"Franklin County, OH",true,true,true]
[null,20230426144773,{"$f":"ROW()","v":1917},"Posso Consuelo I",null,null,"Lead",null,null,null,null,null,null,null,null,null,null,null,"Cook County, IL",true,true,true]
[null,20230426144774,{"$f":"ROW()","v":1918},"POTTS JAMES W II",null,null,"Lead",null,null,null,null,null,null,null,null,null,null,null,"Wood County, WV",true,true,true]
[null,20230426144775,{"$f":"ROW()","v":1919},"POWELL CURTIS M",null,null,"Lead",null,null,null,null,null,null,null,null,null,null,null,"Cuyahoga County, OH",true,true,true]
[null,20230426144776,{"$f":"ROW()","v":1920},"POWELL STANLEY K",null,null,"Lead",null,null,null,null,null,null,null,null,null,null,null,"Jefferson County, AL",true,true,true]
[null,20230426144777,{"$f":"ROW()","v":1921},"POWER STROKE PERFECTION LLC",null,null,"Lead",null,null,null,null,null,null,null,null,null,null,null,"Rankin County, MS",true,true,true]
[null,20230426144778,{"$f":"ROW()","v":1922},"PRECISION FIELD SERVICES LLC",null,null,"Lead",null,null,null,null,null,null,null,null,null,null,null,"Rankin County, MS",true,true,true]
[null,20230426144779,{"$f":"ROW()","v":1923},"Premier Staff Services",null,null,"Lead","MailList12","info@premierstaffservices.net",null,null,"248 809 6753",null,null,null,"16250 Northland Dr\nSouthfield MI 48075",null,null,"Wayne County, MI",false,false,false]
[null,20230426144780,{"$f":"ROW()","v":1924},"Premium Turf, LLC","",null,"Lead",null,null,null,null,"","","","301 Lakeview Ridge Cir","Dadeville","AL",36853,null,true,true,false]
[null,20230426144781,{"$f":"ROW()","v":1925},"Prestige Janitorial Services Of Michigan  ",null,null,"Lead",null,null,null,null,null,null,null,null,null,null,null,"Genesee County, MI",true,true,true]
[null,20230426144782,{"$f":"ROW()","v":1926},"Price Conzan",null,null,"Lead",null,null,null,null,null,null,null,null,null,null,null,"Franklin County, OH",true,true,true]
[null,20230426144783,{"$f":"ROW()","v":1927},"Price Conzan M",null,null,"Lead",null,null,null,null,null,null,null,null,null,null,null,"Franklin County, OH",true,true,true]
[null,20230426144784,{"$f":"ROW()","v":1928},"PRICE NICOLE B",null,null,"Lead",null,null,null,null,null,null,null,null,null,null,null,"Jefferson County, AL",true,true,true]
[null,20230426144785,{"$f":"ROW()","v":1929},"PRIMARY ROOFING INC",null,null,"Lead",null,null,null,null,null,null,null,null,null,null,null,"Cuyahoga County, OH",true,true,true]
[null,20230426144786,{"$f":"ROW()","v":1930},"PRO TECH SERVICE CO INC LLC",null,null,"Lead",null,null,null,null,null,null,null,null,null,null,null,"Jefferson County, AL",true,true,true]
[null,20230426144787,{"$f":"ROW()","v":1931},"PROCARE ACCIDENT and INJURY CENTER",null,null,"Lead",null,null,null,null,null,null,null,null,null,null,null,"Lucas County, OH",true,true,true]
[null,20230426144788,{"$f":"ROW()","v":1932},"Proda Technology LLC",null,null,"Lead",null,null,null,null,null,null,null,null,null,null,null,"Cobb County, GA",true,true,true]
[null,20230426144789,{"$f":"ROW()","v":1933},"Professional Services Ugobek ",null,null,"Lead",null,null,null,null,null,null,null,null,null,null,null,"Broward County, FL",true,true,true]
[null,20230426144790,{"$f":"ROW()","v":1934},"PROGRESSIVE INDUSTRIES INC",null,null,"Lead",null,null,null,null,null,null,null,null,null,null,null,"Monongalia County, VA",true,true,true]
[null,20230426144791,{"$f":"ROW()","v":1935},"Proper Sausages and Delicacies Inc",null,null,"Lead",null,null,null,null,null,null,null,null,null,null,null,"Miami-Dade County, FL",true,true,true]
[null,20230426144792,{"$f":"ROW()","v":1936},"PROVENZA, MARK R",null,null,"Lead",null,null,null,null,null,null,null,null,null,null,null,"Loraine County, OH",true,true,true]
[null,20230426144793,{"$f":"ROW()","v":1937},"Providence Learning And Development Center Inc",null,null,"Lead",null,null,null,null,null,null,null,null,null,null,null,"Mobile County, AL",true,true,true]
[null,20230426144794,{"$f":"ROW()","v":1938},"Psych Inc","Justin Anderson",null,"Lead","MailList12","mrflipbrown@hotmail.com","brandtcarter@hotmail.com","apprec980acw@yahoo.com","(404) 313-7290","(502) 365-3120","(502) 272-9718","2634 Alanmede Rd","Louisville","KY",40205,null,false,false,false]
[null,20230426144795,{"$f":"ROW()","v":1939},"PULLINS STEVE D",null,null,"Lead",null,null,null,null,null,null,null,null,null,null,null,"Meigs County, OH",true,true,true]
[null,20230426144796,{"$f":"ROW()","v":1940},"PUMPER, STEVEN W",null,null,"Lead",null,null,null,null,null,null,null,null,null,null,null,"Summit County, OH",true,true,true]
[null,20230426144797,{"$f":"ROW()","v":1941},"Purdy Jeffrey L",null,null,"Lead",null,null,null,null,null,null,null,null,null,null,null,"Franklin County, OH",true,true,true]
[null,20230426144798,{"$f":"ROW()","v":1942},"PURE QUALITY CARE LLC",null,null,"Lead",null,null,null,null,null,null,null,null,null,null,null,"Lucas County, OH",true,true,true]
[null,20230426144799,{"$f":"ROW()","v":1943},"Purple Orchid LLC",null,null,"Lead",null,null,null,null,"(313) 246-8301",null,null,"3200 Greenfield Rd, Unit 300 ","Dearborn","MI",48120,null,true,false,false]
[null,20230426144800,{"$f":"ROW()","v":1944},"QB Telcom Inc.","",null,"Lead",null,null,null,null,"","","","45217 Al Highway 75 N","Crossville","AL",35962,null,true,true,false]
[null,20230426144801,{"$f":"ROW()","v":1945},"Qs Restaurant Group LLC",null,null,"Lead",null,null,null,null,null,null,null,null,null,null,null,"Hillsborough County, FL",true,true,true]
[null,20230426144802,{"$f":"ROW()","v":1946},"QUALITY BUSINESS SOLUTIONS INC",null,null,"Lead",null,null,null,null,null,null,null,null,null,null,null,"Loraine County, OH",true,true,true]
[null,20230426144803,{"$f":"ROW()","v":1947},"Quinten L Crisp","",null,"Lead",null,null,null,null,null,null,null,"","","","","Lee County, MS",true,true,true]
[null,20230426144804,{"$f":"ROW()","v":1948},"R Allen Southern ",null,null,"Lead",null,null,null,null,null,null,null,null,null,null,null,"Platte County, MO",true,true,true]
[null,20230426144805,{"$f":"ROW()","v":1949},"R D BUTTERMORE and SON INC",null,null,"Lead",null,null,null,null,null,null,null,null,null,null,null,"Wood County, WV",true,true,true]
[null,20230426144806,{"$f":"ROW()","v":1950},"R&R Of Marion Llc",null,null,"Lead",null,null,null,null,null,null,null,null,null,null,null,"Franklin County, OH",true,true,true]
[null,20230426144807,{"$f":"ROW()","v":1951},"RAAB ANDREW T",null,null,"Lead",null,null,null,null,null,null,null,null,null,null,null,"Jefferson County, AL",true,true,true]
[null,20230426144808,{"$f":"ROW()","v":1952},"Rafael Garcia",null,null,"Lead","MailList12","rg478n@yahoo.com","rafaelgarcia50@gmail.com","rafael.colon@hotmail.com","(773) 929-2799","(773) 742-5131","(773) 539-9564","4716 W 89th Pl","Hometown","IL",60456,"Cook County, IL",false,false,false]
[null,20230426144809,{"$f":"ROW()","v":1953},"Rafael Garcia ",null,null,"Lead",null,null,null,null,null,null,null,null,null,null,null,"Cook County, IL",true,true,true]
[null,20230426144810,{"$f":"ROW()","v":1954},"Rafael Paulino ",null,null,"Lead",null,null,null,null,null,null,null,null,null,null,null,"Hillsborough County, FL",true,true,true]
[null,20230426144811,{"$f":"ROW()","v":1955},"RAGE A HAIR COMPANY",null,null,"Lead",null,null,null,null,null,null,null,null,null,null,null,"Wood County, WV",true,true,true]
[null,20230426144812,{"$f":"ROW()","v":1956},"Ragland Terrie L",null,null,"Lead",null,null,null,null,null,null,null,null,null,null,null,"Franklin County, OH",true,true,true]
[null,20230426144814,{"$f":"ROW()","v":1957},"Raheem Kyser ",null,null,"Lead",null,null,null,null,null,null,null,null,null,null,null,"Albany County, NY",true,true,true]
[null,20230426144815,{"$f":"ROW()","v":1958},"Rahsaan M Abraham ",null,null,"Lead",null,null,null,null,null,null,null,null,null,null,null,"Cook County, IL",true,true,true]
[null,20230426144816,{"$f":"ROW()","v":1959},"RAINWATER JOHNNY M",null,null,"Lead",null,null,null,null,null,null,null,"4148 SPRING VALLEY DR S",null,null,null,null,true,true,false]
[null,20230426144817,{"$f":"ROW()","v":1960},"Ralph K Jennings ",null,null,"Lead",null,null,null,null,null,null,null,null,null,null,null,"Macomb County, MI",true,true,true]
[null,20230426144818,{"$f":"ROW()","v":1961},"Ralph L Lynch ",null,null,"Lead",null,null,null,null,null,null,null,null,null,null,null,"Broward County, FL",true,true,true]
[null,20230426144819,{"$f":"ROW()","v":1962},"RALPH LEAKE AGENCY INC",null,null,"Lead",null,null,null,null,null,null,null,null,null,null,null,"Rankin County, MS",true,true,true]
[null,20230426144820,{"$f":"ROW()","v":1963},"Ralph Wilson Law Pc  ",null,null,"Lead",null,null,null,null,null,null,null,null,null,null,null,"Horry County, SC",true,true,true]
[null,20230426144821,{"$f":"ROW()","v":1964},"Rami Jachi ",null,null,"Lead",null,null,null,null,null,null,null,null,null,null,null,"Cook County, IL",true,true,true]
[null,20230426144822,{"$f":"ROW()","v":1965},"Ramos A Diaz",null,null,"Lead",null,null,null,null,null,null,null,null,null,null,null,"Cook County, IL",true,true,true]
[null,20230426144823,{"$f":"ROW()","v":1966},"RAMSEY JOSHUA",null,null,"Lead",null,null,null,null,null,null,null,null,null,null,null,"Harrison County, WV",true,true,true]
[null,20230426144824,{"$f":"ROW()","v":1967},"RAMSEYS WELDING LLC",null,null,"Lead",null,null,null,null,null,null,null,null,null,null,null,"Harrison County, WV",true,true,true]
[null,20230426144825,{"$f":"ROW()","v":1968},"Randall C Miller ",null,null,"Lead",null,null,null,null,null,null,null,null,null,null,null,"Pinellas County, FL",true,true,true]
[null,20230426144826,{"$f":"ROW()","v":1969},"RANDALL MARKETING and DESIGN INC",null,null,"Lead",null,null,null,null,null,null,null,null,null,null,null,"Cuyahoga County, OH",true,true,true]
[null,20230426144827,{"$f":"ROW()","v":1970},"Rangeway Carriers, LLC","",null,"Lead",null,null,null,null,"","","","2377 Us Hwy 78","Moody","AL",35004,null,true,true,false]
[null,20230426144828,{"$f":"ROW()","v":1971},"Ransom Inst Brokage Ltd",null,null,"Lead",null,null,null,null,null,null,null,null,null,null,null,"Cook County, IL",true,true,true]
[null,20230426144829,{"$f":"ROW()","v":1972},"RAPID RESPONSE PROPERTY MAINTENANCE ",null,null,"Lead",null,null,null,null,null,null,null,null,null,null,null,"Montgomery County, OH",true,true,true]
[null,20230426144830,{"$f":"ROW()","v":1973},"Rasheika Singleton ",null,null,"Lead","MailList12","teachforever1@yahoo.com","sugarandspices@msn.com","ed@edgallimore.com","(773) 729-9004","(708) 248-6292","(708) 747-2623","6148 S Champlain Ave","Chicago","IL",60637,"Cook County, IL",false,false,false]
[null,20230426144831,{"$f":"ROW()","v":1974},"Ray Caulk ",null,null,"Lead",null,null,null,null,null,null,null,null,null,null,null,"Horry County, SC",true,true,true]
[null,20230426144832,{"$f":"ROW()","v":1975},"Ray Pesta ",null,null,"Lead",null,null,null,null,null,null,null,null,null,null,null,"Genesee County, MI",true,true,true]
[null,20230426144833,{"$f":"ROW()","v":1976},"Raymond Cobb","",null,"Lead","MailList12","taykatken@yahoo.com","cprather83@yahoo.com","ricobbray40@bellsouth.net","(901) 643-8072","(901) 282-9120","(901) 315-7714","2144 Wellons Ave","Memphis","TN",38127,null,false,false,false]
[null,20230426144834,{"$f":"ROW()","v":1977},"Raymond Riley ",null,null,"Lead",null,null,null,null,null,null,null,null,null,null,null,"Cook County, IL",true,true,true]
[null,20230426144835,{"$f":"ROW()","v":1978},"Razvan N Olaru ",null,null,"Lead",null,null,null,null,null,null,null,null,null,null,null,"Madison County, AL",true,true,true]
[null,20230426144836,{"$f":"ROW()","v":1979},"Ready To Go Trucking Inc",null,null,"Lead",null,null,null,null,null,null,null,null,null,null,null,"Broward County, FL",true,true,true]
[null,20230426144837,{"$f":"ROW()","v":1980},"Rebar Carpentry Corps",null,null,"Lead",null,null,null,null,null,null,null,null,null,null,null,"Miami-Dade County, FL",true,true,true]
[null,20230426144838,{"$f":"ROW()","v":1981},"Rebecca E Garrett ",null,null,"Lead",null,null,null,null,null,null,null,null,null,null,null,"Cobb County, GA",true,true,true]
[null,20230426144839,{"$f":"ROW()","v":1982},"Rebecca Harper ",null,null,"Lead",null,null,null,null,null,null,null,null,null,null,null,"Macomb County, MI",true,true,true]
[null,20230426144840,{"$f":"ROW()","v":1983},"Rebecca L Jones ",null,null,"Lead",null,null,null,null,null,null,null,null,null,null,null,"Madison County, AL",true,true,true]
[null,20230426144841,{"$f":"ROW()","v":1984},"Rebekah Garcia ","David D  Garcia ",null,"Lead","MailList12","bsp528@yahoo.com","sdruihet@hotmail.com","beckypennethy@tivejo.com","(734) 674-3734","(248) 249-5443","(903) 286-2567","30916 Sibley Rd","Romulus","MI",48174,null,false,false,false]
[null,20230426144842,{"$f":"ROW()","v":1985},"Red Hot Inc Daves ",null,null,"Lead",null,null,null,null,null,null,null,null,null,null,null,"Cook County, IL",true,true,true]
[null,20230426144843,{"$f":"ROW()","v":1986},"REECE PLUMBING and GAS LLC",null,null,"Lead",null,null,null,null,null,null,null,null,null,null,null,"Rankin County, MS",true,true,true]
[null,20230426144844,{"$f":"ROW()","v":1987},"REES DAVID",null,null,"Lead",null,null,null,null,null,null,null,null,null,null,null,"Monongalia County, VA",true,true,true]
[null,20230426144845,{"$f":"ROW()","v":1988},"REEVES ADAM",null,null,"Lead",null,null,null,null,null,null,null,null,null,null,null,"Harrison County, WV",true,true,true]
[null,20230426144846,{"$f":"ROW()","v":1989},"Regina Hedrick ",null,null,"Lead",null,null,null,null,null,null,null,null,null,null,null,"Cook County, IL",true,true,true]
[null,20230426144847,{"$f":"ROW()","v":1990},"Regina M Planes ",null,null,"Lead",null,null,null,null,null,null,null,null,null,null,null,"Pinellas County, FL",true,true,true]
[null,20230426144848,{"$f":"ROW()","v":1991},"Reizen Richard",null,null,"Lead","MailList12","richardr@gouldratner.com","rreizen@gouldratner.com",null,"(312) 805-2428","(773) 561-2428","(312) 630-9600","2530 N Talman Ave #b","Chicago","IL",60647,"Cook County, IL",false,false,false]
[null,20230426144849,{"$f":"ROW()","v":1992},"RELIABLE CONCRETE SCANNING and CUTTING  LLC",null,null,"Lead",null,null,null,null,null,null,null,null,null,null,null,"Harrison County, MS",true,true,true]
[null,20230426144850,{"$f":"ROW()","v":1993},"RENAISSANCE DESIGN INC",null,null,"Lead",null,null,null,null,null,null,null,null,null,null,null,"Summit County, OH",true,true,true]
[null,20230426144851,{"$f":"ROW()","v":1994},"Rene Rivas Cruz ",null,null,"Lead","MailList12","ldyambra2@yahoo.com",null,null,"(336) 769-7719","(336) 650-9783","(336) 784-9853","2715 Konnoak Dr","Winston Salem","NC",27127,"Lexington County, SC",false,false,false]
[null,20230426144852,{"$f":"ROW()","v":1995},"Renee Moise ",null,null,"Lead",null,null,null,null,null,null,null,null,null,null,null,"Broward County, FL",true,true,true]
[null,20230426144853,{"$f":"ROW()","v":1996},"Renee Wellman ",null,null,"Lead",null,null,null,null,null,null,null,null,null,null,null,"Broward County, FL",true,true,true]
[null,20230426144854,{"$f":"ROW()","v":1997},"REPUBLIC STEEL",null,null,"Lead",null,null,null,null,null,null,null,null,null,null,null,"Stark County, OH",true,true,true]
[null,20230426144855,{"$f":"ROW()","v":1998},"Restaurant and Lounge Corp Titie ",null,null,"Lead",null,null,null,null,null,null,null,null,null,null,null,"Broward County, FL",true,true,true]
[null,20230426144856,{"$f":"ROW()","v":1999},"RESTORING HOPE COUNSELING AND COACHING INC",null,null,"Lead",null,null,null,null,null,null,null,null,null,null,null,"Hamilton County, OH",true,true,true]
[null,20230426144857,{"$f":"ROW()","v":2000},"RETAIL WHOLESALE AND DEPT STORE INTL UNION LLC",null,null,"Lead",null,null,null,null,null,null,null,null,null,null,null,"Jefferson County, AL",true,true,true]
[null,20230426144858,{"$f":"ROW()","v":2001},"Retiever Holdings LLC",null,null,"Lead",null,null,null,null,null,null,null,null,null,null,null,"Cobb County, GA",true,true,true]
[null,20230426144859,{"$f":"ROW()","v":2002},"REVILL and ASSOCIATES LLC",null,null,"Lead",null,null,null,null,null,null,null,null,null,null,null,"Jefferson County, AL",true,true,true]
[null,20230426144860,{"$f":"ROW()","v":2003},"Revill and Associates, LLC","",null,"Lead",null,null,null,null,"","","","2027 2Nd Ave N Ste A","Birmingham","AL",35203,null,true,true,false]
[null,20230426144861,{"$f":"ROW()","v":2004},"REVILL LAW FIRM",null,null,"Lead",null,null,null,null,null,null,null,null,null,null,null,"Jefferson County, AL",true,true,true]
[null,20230426144862,{"$f":"ROW()","v":2005},"RF Knox Co Inc",null,null,"Lead",null,null,null,null,null,null,null,null,null,null,null,"Cobb County, GA",true,true,true]
[null,20230426144863,{"$f":"ROW()","v":2006},"Rhapzody E Barreiro ",null,null,"Lead",null,null,null,null,null,null,null,null,null,null,null,"Cobb County, GA",true,true,true]
[null,20230426144864,{"$f":"ROW()","v":2007},"Ricardo Beaton ",null,null,"Lead",null,null,null,null,null,null,null,null,null,null,null,"Miami-Dade County, FL",true,true,true]
[null,20230426144866,{"$f":"ROW()","v":2008},"Ricardo Frazile ",null,null,"Lead",null,null,null,null,null,null,null,null,null,null,null,"Broward County, FL",true,true,true]
[null,20230426144867,{"$f":"ROW()","v":2009},"Riccio Matthew",null,null,"Lead",null,null,null,null,null,null,null,null,null,null,null,"Cook County, IL",true,true,true]
[null,20230426144868,{"$f":"ROW()","v":2010},"Rice James W",null,null,"Lead",null,null,null,null,null,null,null,null,null,null,null,"Franklin County, OH",true,true,true]
[null,20230426144869,{"$f":"ROW()","v":2011},"Richard A Gaetano ",null,null,"Lead",null,null,null,null,null,null,null,null,null,null,null,"Macomb County, MI",true,true,true]
[null,20230426144870,{"$f":"ROW()","v":2012},"Richard B Burt ",null,null,"Lead",null,null,null,null,null,null,null,null,null,null,null,"Albany County, NY",true,true,true]
[null,20230426144871,{"$f":"ROW()","v":2013},"Richard Clark ",null,null,"Lead",null,null,null,null,null,null,null,null,null,null,null,"Cook County, IL",true,true,true]
[null,20230426144872,{"$f":"ROW()","v":2014},"Richard Coon ",null,null,"Lead",null,null,null,null,null,null,null,null,null,null,null,"Cobb County, GA",true,true,true]
[null,20230426144873,{"$f":"ROW()","v":2015},"Richard D Locke ",null,null,"Lead",null,null,null,null,null,null,null,null,null,null,null,"Macomb County, MI",true,true,true]
[null,20230426144874,{"$f":"ROW()","v":2016},"Richard E Sr Brown",null,null,"Lead",null,null,null,null,null,null,null,null,null,null,null,"DeSoto County, MS",true,true,true]
[null,20230426144875,{"$f":"ROW()","v":2017},"Richard G Sharpe ",null,null,"Lead",null,null,null,null,null,null,null,null,null,null,null,"Volusia County, FL",true,true,true]
[null,20230426144876,{"$f":"ROW()","v":2018},"Richard J Pearl ",null,null,"Lead",null,null,null,null,null,null,null,null,null,null,null,"Cook County, IL",true,true,true]
[null,20230426144877,{"$f":"ROW()","v":2019},"Richard J Reynolds ",null,null,"Lead",null,null,null,null,null,null,null,null,null,null,null,"Cobb County, GA",true,true,true]
[null,20230426144878,{"$f":"ROW()","v":2020},"Richard L Valero ",null,null,"Lead",null,null,null,null,null,null,null,null,null,null,null,"Cobb County, GA",true,true,true]
[null,20230426144879,{"$f":"ROW()","v":2021},"Richard Mccormick ",null,null,"Lead",null,null,null,null,null,null,null,null,null,null,null,"Hillsborough County, FL",true,true,true]
[null,20230426144880,{"$f":"ROW()","v":2022},"Richard R Morton ",null,null,"Lead",null,null,null,null,null,null,null,null,null,null,null,"Rockdale County, GA",true,true,true]
[null,20230426144881,{"$f":"ROW()","v":2023},"Richard Reizen ",null,null,"Lead",null,null,null,null,null,null,null,null,null,null,null,"Cook County, IL",true,true,true]
[null,20230426144882,{"$f":"ROW()","v":2024},"Richard W Wilhelmsen ",null,null,"Lead","MailList12","rwilhelmsen1972@gmail.com",null,null,"(734) 469-8363","(734) 452-9067","(248) 482-7014","29150 Bretton St","Livonia","MI",48152,null,false,false,false]
[null,20230426144883,{"$f":"ROW()","v":2025},"Rickey Stokes ",null,null,"Lead",null,null,null,null,null,null,null,null,null,null,null,"Houston County, AL",true,true,true]
[null,20230426144884,{"$f":"ROW()","v":2026},"Rickie W Jackson","","","Lead","MailList12","rickwjackson865@gmail.com","tvlakes87@worldnet.att.net","aimee422@earthlink.com","(865) 924-3272","(865) 922-6896","(865) 922-0880","180 WATERVIEW DR APT 602","Oak Ridge","TN",37830,null,false,false,false]
[null,20230426144885,{"$f":"ROW()","v":2027},"Ricky M Nunez ",null,null,"Lead",null,null,null,null,null,null,null,null,null,null,null,"Cook County, IL",true,true,true]
[null,20230426144886,{"$f":"ROW()","v":2028},"Ricky Stokes News LLC",null,null,"Lead",null,null,null,null,null,null,null,null,null,null,null,"Houston County, AL",true,true,true]
[null,20230426144887,{"$f":"ROW()","v":2029},"Ricky Stokes News, LLC","",null,"Lead","MailList12","rstokes1450@gmail.com",null,null,"(334) 790-1729","(334) 790-7290","(334) 712-9988","109 E Adams Street","Dothan","AL",36303,null,false,false,false]
[null,20230426144888,{"$f":"ROW()","v":2030},"RIVERA GILBERT",null,null,"Lead",null,null,null,null,null,null,null,null,null,null,null,"Cuyahoga County, OH",true,true,true]
[null,20230426144889,{"$f":"ROW()","v":2031},"Rivers III Inc Al",null,null,"Lead",null,null,null,null,null,null,null,null,null,null,null,"Charleston County, SC",true,true,true]
[null,20230426144890,{"$f":"ROW()","v":2032},"RJ HEATING and COOLING CO INC",null,null,"Lead",null,null,null,null,null,null,null,null,null,null,null,"Cuyahoga County, OH",true,true,true]
[null,20230426144891,{"$f":"ROW()","v":2033},"Rk 42468 Investments Inc",null,null,"Lead",null,null,null,null,null,null,null,null,null,null,null,"Broward County, FL",true,true,true]
[null,20230426144892,{"$f":"ROW()","v":2034},"Road 1 Inc","Jewel E Snelgrove   ",null,"Lead","MailList12","jewells1127@yahoo.com",null,null,"(803) 319-8543","(803) 771-4469","(803) 794-5155","816 Chris Dr","West Columbia  ","SC",29169,"Lexington County, SC",false,false,false]
[null,20230426144893,{"$f":"ROW()","v":2035},"Robert Bell",null,null,"Lead","MailList12","tongyabell@yahoo.com","bro_bell32@yahoo.com","rwaldo@capecod.net","(217) 257-7670","(217) 223-6535","(773) 519-5433","201 Wayside Ave","Decatur","IL",62521,"Cook County, IL",false,false,false]
[null,20230426144894,{"$f":"ROW()","v":2036},"Robert Bell ",null,null,"Lead",null,null,null,null,null,null,null,null,null,null,null,"Cook County, IL",true,true,true]
[null,20230426144895,{"$f":"ROW()","v":2037},"Robert E Bradbury ","Melody J Bradbury ",null,"Lead","MailList12","robertbradbury930@yahoo.com","rsturcke@centurytel.net",null,"(502) 931-1594","(814) 302-4030","(941) 776-1461","9615 Arrowridge Dr","Louisville","KY",40229,null,false,false,false]
[null,20230426144896,{"$f":"ROW()","v":2038},"Robert Fitzpatrick","",null,"Lead",null,null,null,null,"","","","4792 Twin Eagles Cir W Apt 102","Memphis","TN",38125,null,true,true,false]
[null,20230426144897,{"$f":"ROW()","v":2039},"Robert G Durkin ",null,null,"Lead",null,null,null,null,null,null,null,null,null,null,null,"Cook County, IL",true,true,true]
[null,20230426144898,{"$f":"ROW()","v":2040},"Robert H Geller ",null,null,"Lead",null,null,null,null,null,null,null,null,null,null,null,"Cook County, IL",true,true,true]
[null,20230426144899,{"$f":"ROW()","v":2041},"Robert I Garvin ",null,null,"Lead",null,null,null,null,null,null,null,null,null,null,null,"Macomb County, MI",true,true,true]
[null,20230426144900,{"$f":"ROW()","v":2042},"Robert J Butler ",null,null,"Lead",null,null,null,null,null,null,null,null,null,null,null,"Brevard County, FL",true,true,true]
[null,20230426144901,{"$f":"ROW()","v":2043},"Robert J Tibbles ",null,null,"Lead",null,null,null,null,null,null,null,null,null,null,null,"Madison County, AL",true,true,true]
[null,20230426144902,{"$f":"ROW()","v":2044},"Robert L Lewis ",null,null,"Lead",null,null,null,null,null,null,null,null,null,null,null,"Genesee County, MI",true,true,true]
[null,20230426144903,{"$f":"ROW()","v":2045},"Robert L Marchese ",null,null,"Lead","MailList12","islabob@aol.com","rmarchese@lycos.com",null,"(727) 867-4374","(313) 977-8204","(586) 268-8567","5633 La Puerta Del Sol Blvd S","Saint Petersburg","FL",33715,"Wayne County, MI",false,false,false]
[null,20230426144904,{"$f":"ROW()","v":2046},"Robert Laster, Et Al",null,null,"Lead",null,null,null,null,null,null,null,null,null,null,null,"DeSoto County, MS",true,true,true]
[null,20230426144905,{"$f":"ROW()","v":2047},"Robert M Walden ",null,null,"Lead",null,null,null,null,null,null,null,null,null,null,null,"Charleston County, SC",true,true,true]
[null,20230426144906,{"$f":"ROW()","v":2048},"Robert P Walsky ",null,null,"Lead",null,null,null,null,null,null,null,null,null,null,null,"Broward County, FL",true,true,true]
[null,20230426144907,{"$f":"ROW()","v":2049},"Robert Stern ","",null,"Lead",null,null,null,null,null,null,null,"","","","","Jackson County, MS",true,true,true]
[null,20230426144908,{"$f":"ROW()","v":2050},"Robert W Sr Lort ",null,null,"Lead",null,null,null,null,null,null,null,null,null,null,null,"Volusia County, FL",true,true,true]
[null,20230426144909,{"$f":"ROW()","v":2051},"Robert Williams ",null,null,"Lead",null,null,null,null,null,null,null,null,null,null,null,"Cook County, IL",true,true,true]
[null,20230426144910,{"$f":"ROW()","v":2052},"ROBERTS PAUL",null,null,"Lead",null,null,null,null,null,null,null,null,null,null,null,"Jefferson County, AL",true,true,true]
[null,20230426144911,{"$f":"ROW()","v":2053},"ROBERTS PAUL A",null,null,"Lead",null,null,null,null,null,null,null,null,null,null,null,"Jefferson County, AL",true,true,true]
[null,20230426144912,{"$f":"ROW()","v":2054},"Robin Hooper ",null,null,"Lead",null,null,null,null,null,null,null,"8975 Heritage Ln #514","Temple Terr","FL",33617,"Hillsborough County, FL",true,true,false]
[null,20230426144913,{"$f":"ROW()","v":2055},"Robin M Myrick","","30 2014-2016 Ttl: $90,732.85","Lead","MailList12","robinmyrick@hotmail.com","robin.myrick@yahoo.com",null,"(865) 607-0263","(865) 977-6586","(708) 250-4115","1213 W Lamar Alexander Pkwy","Maryville","TN",37801,null,false,false,false]
[null,20230426144914,{"$f":"ROW()","v":2056},"ROBINSON NEHEMIAH K",null,null,"Lead",null,null,null,null,null,null,null,null,null,null,null,"Jefferson County, AL",true,true,true]
[null,20230426144915,{"$f":"ROW()","v":2057},"ROBINSON SAMUEL D",null,null,"Lead",null,null,null,null,null,null,null,null,null,null,null,"Jefferson County, AL",true,true,true]
[null,20230426144916,{"$f":"ROW()","v":2058},"ROBINSON SENECA",null,null,"Lead",null,null,null,null,null,null,null,null,null,null,null,"Jefferson County, AL",true,true,true]
[null,20230426144917,{"$f":"ROW()","v":2059},"ROBLEDO JOSE ALBERTO",null,null,"Lead",null,null,null,null,null,null,null,null,null,null,null,"Butler County, OH",true,true,true]
[null,20230426144918,{"$f":"ROW()","v":2060},"Roc A Yauilla ",null,null,"Lead","MailList12","bugsytjl1@tivejo.com",null,null,"(803) 755-0633","(803) 755-1035","(803) 739-0587","4931 Fish Hatchery Rd","Lexington","SC",29073,"Lexington County, SC",false,false,false]
[null,20230426144919,{"$f":"ROW()","v":2061},"Rochelle Franklin ",null,null,"Lead",null,null,null,null,null,null,null,null,null,null,null,"Volusia County, FL",true,true,true]
[null,20230426144920,{"$f":"ROW()","v":2062},"Rochte Gregory R",null,null,"Lead",null,null,null,null,null,null,null,null,null,null,null,"Franklin County, OH",true,true,true]
[null,20230426144921,{"$f":"ROW()","v":2063},"ROCKET TRANSPORTATION",null,null,"Lead",null,null,null,null,null,null,null,null,null,null,null,"Lucas County, OH",true,true,true]
[null,20230426144922,{"$f":"ROW()","v":2064},"Rocks Masonry Inc",null,null,"Lead",null,null,null,null,null,null,null,null,null,null,null,"Madison County, AL",true,true,true]
[null,20230426144923,{"$f":"ROW()","v":2065},"Rocks Masonry Inc.","",null,"Lead",null,null,null,null,"","","","470 Monroe Rd","Meridianville","AL",35759,null,true,true,false]
[null,20230426144924,{"$f":"ROW()","v":2066},"Roderick T West",null,null,"Lead",null,null,null,null,null,null,null,null,null,null,null,"DeSoto County, MS",true,true,true]
[null,20230426144925,{"$f":"ROW()","v":2067},"Rodger L Harding ",null,null,"Lead","MailList12","rodgerharding@msn.com","rodgwgerharding74@msn.com","rodgerharding41@msn.com","(313) 205-5363","(313) 205-0553","(313) 492-2514","28600 7 Mile Rd","Livonia","MI",48152,null,false,false,false]
[null,20230426144926,{"$f":"ROW()","v":2068},"Rodney G Patterson ",null,null,"Lead","MailList12","rodney9663@aol.com","esenshel@gmail.com","gerrittnyc@aol.com","(917) 806-2378","(212) 387-9663","(323) 930-9632","195 Stanton St #s5","New York","NY",10002,"Cook County, IL",false,false,false]
[null,20230426144927,{"$f":"ROW()","v":2069},"Rodney Patterson ",null,null,"Lead",null,null,null,null,null,null,null,null,null,null,null,"Cook County, IL",true,true,true]
[null,20230426144928,{"$f":"ROW()","v":2070},"Rodney Tatum ",null,null,"Lead","MailList12","pamt328@aol.com",null,null,"(313) 283-4550","(313) 274-2531","(313) 588-6780","510 Tobin Dr #207","Inkster","MI",48141,null,false,false,false]
[null,20230426144929,{"$f":"ROW()","v":2071},"Rodricas Heath ",null,null,"Lead",null,null,null,null,null,null,null,null,null,null,null,"Cobb County, GA",true,true,true]
[null,20230426144930,{"$f":"ROW()","v":2072},"Rodrigo Mendoza Hernandez","","","Lead","MailList12","moralesrigo69@yahoo.com","trodrigo.moralesj74@netzero.net",null,"(303) 801-8716","(303) 375-6521","(209) 814-1119","111 Pembroke Rd","Oak Ridge","TN",37830,null,false,false,false]
[null,20230426144931,{"$f":"ROW()","v":2073},"Rodriguez Tammie L",null,null,"Lead",null,null,null,null,null,null,null,null,null,null,null,"Cook County, IL",true,true,true]
[null,20230426144932,{"$f":"ROW()","v":2074},"Roger A and Jennifer M Jarrell II","","Returned Not deliverable as addressed","Lead","MailList12","jarrelln@cfw.com","vmirog@gmail.com",null,"(304) 444-2476","(304) 590-4966","(304) 590-4660","107 Gates Dr, Unit L","Oak Ridge","TN",37830,null,false,false,false]
[null,20230426144933,{"$f":"ROW()","v":2075},"Roger A Ihm ",null,null,"Lead",null,null,null,null,null,null,null,null,null,null,null,"Broward County, FL",true,true,true]
[null,20230426144934,{"$f":"ROW()","v":2076},"Roger Ihm ",null,null,"Lead",null,null,null,null,null,null,null,null,null,null,null,"Broward County, FL",true,true,true]
[null,20230426144935,{"$f":"ROW()","v":2077},"ROLLINS ALFONSO",null,null,"Lead",null,null,null,null,null,null,null,null,null,null,null,"Cuyahoga County, OH",true,true,true]
[null,20230426144936,{"$f":"ROW()","v":2078},"Romat Ventures Inc",null,null,"Lead",null,null,null,null,null,null,null,null,null,null,null,"Hillsborough County, FL",true,true,true]
[null,20230426144937,{"$f":"ROW()","v":2079},"Romney Martinez ",null,null,"Lead",null,null,null,null,null,null,null,null,null,null,null,"Broward County, FL",true,true,true]
[null,20230426144938,{"$f":"ROW()","v":2080},"Ronald and Carnon Travis","","","Lead","MailList12","rcranesr@go.com","rb137@webtv.net","ronald.crane@cs.com","(850) 607-1951","(850) 456-9013","(850) 332-6789","5311 Ridge Laurel Ter","Memphis","TN",38125,null,false,false,false]
[null,20230426144939,{"$f":"ROW()","v":2081},"Ronald A Et Al Currence",null,null,"Lead",null,null,null,null,null,null,null,null,null,null,null,"DeSoto County, MS",true,true,true]
[null,20230426144940,{"$f":"ROW()","v":2082},"Ronald Brozic ",null,null,"Lead",null,null,null,null,null,null,null,null,null,null,null,"Broward County, FL",true,true,true]
[null,20230426144941,{"$f":"ROW()","v":2083},"Ronald D Robinson ",null,null,"Lead",null,null,null,null,null,null,null,null,null,null,null,"Cobb County, GA",true,true,true]
[null,20230426144942,{"$f":"ROW()","v":2084},"Ronald L Wilson ",null,null,"Lead",null,null,null,null,null,null,null,null,null,null,null,"Madison County, AL",true,true,true]
[null,20230426144943,{"$f":"ROW()","v":2085},"Ronald R Fasel ",null,null,"Lead",null,null,null,null,null,null,null,null,null,null,null,"Cook County, IL",true,true,true]
[null,20230426144944,{"$f":"ROW()","v":2086},"Rony Desamours ",null,null,"Lead",null,null,null,null,null,null,null,null,null,null,null,"Broward County, FL",true,true,true]
[null,20230426144945,{"$f":"ROW()","v":2087},"Rosanne G Kanger ",null,null,"Lead",null,null,null,null,null,null,null,null,null,null,null,"Cobb County, GA",true,true,true]
[null,20230426144946,{"$f":"ROW()","v":2088},"Rosario Tr Biordi ",null,null,"Lead",null,null,null,null,null,null,null,null,null,null,null,"Brevard County, FL",true,true,true]
[null,20230426144947,{"$f":"ROW()","v":2089},"Rose Group Inc",null,null,"Lead",null,null,null,null,null,null,null,null,null,null,null,"Volusia County, FL",true,true,true]
[null,20230426144948,{"$f":"ROW()","v":2090},"Rosevelt E Daniel","Henri L Daniel",null,"Lead",null,null,null,null,null,null,null,null,null,null,null,"Broward County, FL",true,true,true]
[null,20230426144949,{"$f":"ROW()","v":2091},"Rosmond E Gordon ",null,null,"Lead",null,null,null,null,null,null,null,null,null,null,null,"Cobb County, GA",true,true,true]
[null,20230426144950,{"$f":"ROW()","v":2092},"Ross B Glickman ",null,null,"Lead",null,null,null,null,null,null,null,null,null,null,null,"Cook County, IL",true,true,true]
[null,20230426144951,{"$f":"ROW()","v":2093},"Ross Burns ",null,null,"Lead",null,null,null,null,null,null,null,null,null,null,null,"Cook County, IL",true,true,true]
[null,20230426144952,{"$f":"ROW()","v":2094},"Ross Glickman ",null,null,"Lead",null,null,null,null,null,null,null,null,null,null,null,"Cook County, IL",true,true,true]
[null,20230426144953,{"$f":"ROW()","v":2095},"ROYAL LESA SMITH",null,null,"Lead",null,null,null,null,null,null,null,null,null,null,null,"\nCopiah County, MS",true,true,true]
[null,20230426144954,{"$f":"ROW()","v":2096},"Roza P Komorowska ",null,null,"Lead",null,null,null,null,null,null,null,null,null,null,null,"Cook County, IL",true,true,true]
[null,20230426144955,{"$f":"ROW()","v":2097},"Ruby Lewis ",null,null,"Lead","MailList12","rubyann1215@gmail.com","blakevictoria@sbc.net",null,"(313) 643-3750","(313) 340-9271","(313) 659-9661","6334 Webb St","Detroit","MI",48204,null,false,false,false]
[null,20230426144956,{"$f":"ROW()","v":2098},"RUE DENNIS A ",null,null,"Lead",null,null,null,null,null,null,null,null,null,null,null,"Montgomery County, OH",true,true,true]
[null,20230426144957,{"$f":"ROW()","v":2099},"RUGLEY JERRY",null,null,"Lead",null,null,null,null,null,null,null,null,null,null,null,"Cuyahoga County, OH",true,true,true]
[null,20230426144958,{"$f":"ROW()","v":2100},"RUMOR",null,null,"Lead",null,null,null,null,null,null,null,null,null,null,null,"Cuyahoga County, OH",true,true,true]
[null,20230426144959,{"$f":"ROW()","v":2101},"Russell Joseph",null,null,"Lead",null,null,null,null,null,null,null,null,null,null,null,"Franklin County, OH",true,true,true]
[null,20230426144960,{"$f":"ROW()","v":2102},"Russell Management Group LLC",null,null,"Lead",null,null,null,null,null,null,null,null,null,null,null,"Madison County, AL",true,true,true]
[null,20230426144961,{"$f":"ROW()","v":2103},"Ryan Cybulski ",null,null,"Lead",null,null,null,null,null,null,null,null,null,null,null,"Cook County, IL",true,true,true]
[null,20230426144962,{"$f":"ROW()","v":2104},"S 1 Medical Holdings LLC",null,null,"Lead",null,null,null,null,null,null,null,null,null,null,null,"Charleston County, SC",true,true,true]
[null,20230426144963,{"$f":"ROW()","v":2105},"S Indomenico ",null,null,"Lead",null,null,null,null,null,null,null,null,null,null,null,"Cook County, IL",true,true,true]
[null,20230426144964,{"$f":"ROW()","v":2106},"S&A LLC",null,null,"Lead",null,null,null,null,null,null,null,null,null,null,null,"Jefferson County, AL",true,true,true]
[null,20230426144965,{"$f":"ROW()","v":2107},"SAB LLC",null,null,"Lead",null,null,null,null,null,null,null,null,null,null,null,"Cuyahoga County, OH",true,true,true]
[null,20230426144966,{"$f":"ROW()","v":2108},"SAFFORD BUILDING CO",null,null,"Lead",null,null,null,null,null,null,null,null,null,null,null,"Jefferson County, AL",true,true,true]
[null,20230426144967,{"$f":"ROW()","v":2109},"SAFFORD CLIFFORD G",null,null,"Lead",null,null,null,null,null,null,null,null,null,null,null,"Jefferson County, AL",true,true,true]
[null,20230426144968,{"$f":"ROW()","v":2110},"Saif Hallak ",null,null,"Lead",null,null,null,null,null,null,null,null,null,null,null,"Macomb County, MI",true,true,true]
[null,20230426144969,{"$f":"ROW()","v":2111},"Saif Matti ",null,null,"Lead",null,null,null,null,null,null,null,null,null,null,null,"Macomb County, MI",true,true,true]
[null,20230426144970,{"$f":"ROW()","v":2112},"Saira Aziz ",null,null,"Lead",null,null,null,null,null,null,null,null,null,null,null,"Cobb County, GA",true,true,true]
[null,20230426144971,{"$f":"ROW()","v":2113},"Sake Miami Lakes Corp Sushi ",null,null,"Lead",null,null,null,null,null,null,null,null,null,null,null,"Miami-Dade County, FL",true,true,true]
[null,20230426144972,{"$f":"ROW()","v":2114},"Salam Slim ",null,null,"Lead","MailList12","sslieem21@frontiernet.net","zslim@comcast.net","sami2076@hotmail.com","(313) 690-0069","(313) 563-3606","(313) 318-9525","26904 Kingswood Dr","Dearborn Heights","MI",48127,null,false,false,false]
[null,20230426144973,{"$f":"ROW()","v":2115},"Salam Zehra Slim ",null,null,"Lead","MailList15","sslieem21@frontiernet.net","zslim@comcast.net","sami2076@hotmail.com","(313) 690-0069","(313) 563-3606","(313) 318-9525","26904 Kingswood Dr","Dearborn Heights","MI",48127,null,false,false,false]
[null,20230426144974,{"$f":"ROW()","v":2116},"Salman Khan ",null,null,"Lead",null,null,null,null,null,null,null,null,null,null,null,"Cook County, IL",true,true,true]
[null,20230426144975,{"$f":"ROW()","v":2117},"Salomon A Martel ",null,null,"Lead",null,null,null,null,"(502) 294-2388","(253) 941-5339","(404) 921-4155","6003 Catheen Way","Louisville","KY",40213,null,true,false,false]
[null,20230426144976,{"$f":"ROW()","v":2118},"SAMIA TRANSPORTATION INC",null,null,"Lead",null,null,null,null,null,null,null,null,null,null,null,"Summit County, OH",true,true,true]
[null,20230426144977,{"$f":"ROW()","v":2119},"Sammie Sutton ",null,null,"Lead",null,null,null,null,null,null,null,null,null,null,null,"Cook County, IL",true,true,true]
[null,20230426144978,{"$f":"ROW()","v":2120},"SAMPLE, VANESSA J",null,null,"Lead",null,null,null,null,null,null,null,null,null,null,null,"Lucas County, OH",true,true,true]
[null,20230426144979,{"$f":"ROW()","v":2121},"Samuel Cohen ",null,null,"Lead",null,null,null,null,null,null,null,null,null,null,null,"Broward County, FL",true,true,true]
[null,20230426144980,{"$f":"ROW()","v":2122},"Samuel D Henley Jr",null,null,"Lead",null,null,null,null,null,null,null,null,null,null,null,"Madison County, AL",true,true,true]
[null,20230426144981,{"$f":"ROW()","v":2123},"Samuel F Maguire ",null,null,"Lead",null,null,null,null,null,null,null,null,null,null,null,"Cobb County, GA",true,true,true]
[null,20230426144982,{"$f":"ROW()","v":2124},"Samuel Leggett ",null,null,"Lead",null,null,null,null,null,null,null,null,null,null,null,"Cook County, IL",true,true,true]
[null,20230426144983,{"$f":"ROW()","v":2125},"Samuel T Johnson","","","Lead","MailList12","medical.johnson@gmail.com",null,null,"(901) 476-4781","(901) 545-9986","(901) 475-4752","111 Paulette Cir","Covington","TN",38019,null,false,false,false]
[null,20230426144984,{"$f":"ROW()","v":2126},"Sandra Anderson ",null,null,"Lead",null,null,null,null,null,null,null,null,null,null,null,"Cook County, IL",true,true,true]
[null,20230426144985,{"$f":"ROW()","v":2127},"Sandra Hillis",null,null,"Lead",null,null,null,null,null,null,null,null,null,null,null,"Muskegon County, MI",true,true,true]
[null,20230426144986,{"$f":"ROW()","v":2128},"Sandra Ojo ",null,null,"Lead",null,null,null,null,null,null,null,null,null,null,null,"Sussex County, NJ",true,true,true]
[null,20230426144987,{"$f":"ROW()","v":2129},"SANFORD THOMAS G",null,null,"Lead",null,null,null,null,null,null,null,null,null,null,null,"Stark County, OH",true,true,true]
[null,20230426144988,{"$f":"ROW()","v":2130},"SANNER JERRY M ",null,null,"Lead",null,null,null,null,null,null,null,null,null,null,null,"Montgomery County, OH",true,true,true]
[null,20230426144989,{"$f":"ROW()","v":2131},"Sara Mouayed ",null,null,"Lead",null,null,null,null,null,null,null,null,null,null,null,"Cook County, IL",true,true,true]
[null,20230426144990,{"$f":"ROW()","v":2132},"Sarah E Parsons ",null,null,"Lead","MailList12","sarahparsons@live.com","dr.sarahparsons@gmail.com",null,"(502) 214-0198","(423) 833-5896","(859) 272-8110","9703 Southern Breeze Ln","Louisville","KY",40299,null,false,false,false]
[null,20230426144991,{"$f":"ROW()","v":2133},"Sarah E Welscher ","Keith A Welscher ",null,"Lead","MailList12","keithwelscher@yahoo.com",null,null,"(502) 436-9664","(502) 287-2162","(502) 810-9428","9703 Southern Breeze Ln","Louisville","KY",40299,"Jefferson County, KY",false,false,false]
[null,20230426144992,{"$f":"ROW()","v":2134},"Satheriea Davis ",null,null,"Lead",null,null,null,null,null,null,null,null,null,null,null,"Cook County, IL",true,true,true]
[null,20230426144993,{"$f":"ROW()","v":2135},"Saul Sauceda ",null,null,"Lead",null,null,null,null,null,null,null,null,null,null,null,"Cobb County, GA",true,true,true]
[null,20230426144994,{"$f":"ROW()","v":2136},"Savar Jonathan S",null,null,"Lead",null,null,null,null,null,null,null,null,null,null,null,"Franklin County, OH",true,true,true]
[null,20230426144995,{"$f":"ROW()","v":2137},"SAWYER MYCHAEL M ",null,null,"Lead",null,null,null,null,null,null,null,null,null,null,null,"Montgomery County, OH",true,true,true]
[null,20230426144996,{"$f":"ROW()","v":2138},"SAXON TARA J",null,null,"Lead",null,null,null,null,null,null,null,null,null,null,null,"Cuyahoga County, OH",true,true,true]
[null,20230426144997,{"$f":"ROW()","v":2139},"SCALABRINO MICHAEL JR",null,null,"Lead",null,null,null,null,null,null,null,null,null,null,null,"Cuyahoga County, OH",true,true,true]
[null,20230426144998,{"$f":"ROW()","v":2140},"SCHMERR CAROL",null,null,"Lead",null,null,null,null,null,null,null,null,null,null,null,"Butler County, OH",true,true,true]
[null,20230426144999,{"$f":"ROW()","v":2141},"SCHMIDT WILLIAM",null,null,"Lead",null,null,null,null,null,null,null,null,null,null,null,"Cuyahoga County, OH",true,true,true]
[null,20230426145000,{"$f":"ROW()","v":2142},"School Of Clarkston Montessori ",null,null,"Lead",null,null,null,null,null,null,null,null,null,null,null,"Oakland County, MI",true,true,true]
[null,20230426145001,{"$f":"ROW()","v":2143},"Schuler and Sons Llc",null,null,"Lead",null,null,null,null,null,null,null,null,null,null,null,"Franklin County, OH",true,true,true]
[null,20230426145002,{"$f":"ROW()","v":2144},"SCOTT CARY C",null,null,"Lead",null,null,null,null,null,null,null,null,null,null,null,"Cuyahoga County, OH",true,true,true]
[null,20230426145003,{"$f":"ROW()","v":2145},"Scott Ensminger ",null,null,"Lead",null,null,null,null,null,null,null,null,null,null,null,"Horry County, SC",true,true,true]
[null,20230426145004,{"$f":"ROW()","v":2146},"Scott H Ballou ",null,null,"Lead",null,null,null,null,null,null,null,null,null,null,null,"Broward County, FL",true,true,true]
[null,20230426145005,{"$f":"ROW()","v":2147},"Scott J Bishop ",null,null,"Lead",null,null,null,null,null,null,null,null,null,null,null,"Albany County, NY",true,true,true]
[null,20230426145006,{"$f":"ROW()","v":2148},"SCOTT KENNETH",null,null,"Lead",null,null,null,null,null,null,null,null,null,null,null,"Jefferson County, AL",true,true,true]
[null,20230426145007,{"$f":"ROW()","v":2149},"Scott M Balot ",null,null,"Lead",null,null,null,null,null,null,null,null,null,null,null,"Cobb County, GA",true,true,true]
[null,20230426145008,{"$f":"ROW()","v":2150},"Scott M Wayne ",null,null,"Lead","MailList12","w.scott@greatlips.net","scottw3958@aol.com",null,"(248) 563-5108","(248) 476-0474","(248) 737-4790","19705 Farmington Rd","Livonia","MI",48152,null,false,false,false]
[null,20230426145009,{"$f":"ROW()","v":2151},"Scott R Sanders ",null,null,"Lead",null,null,null,null,null,null,null,null,null,null,null,"Cook County, IL",true,true,true]
[null,20230426145010,{"$f":"ROW()","v":2152},"Scott Solomon ",null,null,"Lead",null,null,null,null,null,null,null,null,null,null,null,"Albany County, NY",true,true,true]
[null,20230426145011,{"$f":"ROW()","v":2153},"Screentech Inc",null,null,"Lead",null,null,null,null,null,null,null,null,null,null,null,"Houston County, AL",true,true,true]
[null,20230426145012,{"$f":"ROW()","v":2154},"Screentech Inc.","",null,"Lead",null,null,null,null,"","","","383 Kelley Dr","Dothan","AL",36303,null,true,true,false]
[null,20230426145013,{"$f":"ROW()","v":2155},"Sean A Williams ",null,null,"Lead",null,null,null,null,null,null,null,null,null,null,null,"Miami-Dade County, FL",true,true,true]
[null,20230426145014,{"$f":"ROW()","v":2156},"Seawall Services Inc",null,null,"Lead",null,null,null,null,null,null,null,null,null,null,null,"Pinellas County, FL",true,true,true]
[null,20230426145015,{"$f":"ROW()","v":2157},"Segrid A Williams ",null,null,"Lead",null,null,null,null,null,null,null,null,null,null,null,"Broward County, FL",true,true,true]
[null,20230426145016,{"$f":"ROW()","v":2158},"Seneca T Bryant ",null,null,"Lead",null,null,null,null,null,null,null,null,null,null,null,"Albany County, NY",true,true,true]
[null,20230426145017,{"$f":"ROW()","v":2159},"SERGENT WILLIAM B",null,null,"Lead",null,null,null,null,null,null,null,null,null,null,null,"Butler County, OH",true,true,true]
[null,20230426145018,{"$f":"ROW()","v":2160},"SERGENT WILLIAM B  ",null,null,"Lead",null,null,null,null,null,null,null,null,null,null,null,"Butler County, OH",true,true,true]
[null,20230426145019,{"$f":"ROW()","v":2161},"Sergio Lopes ",null,null,"Lead",null,null,null,null,null,null,null,null,null,null,null,"Broward County, FL",true,true,true]
[null,20230426145020,{"$f":"ROW()","v":2162},"Service Station Pierson ",null,null,"Lead",null,null,null,null,null,null,null,null,null,null,null,"Genesee County, MI",true,true,true]
[null,20230426145021,{"$f":"ROW()","v":2163},"Set Go Inc",null,null,"Lead",null,null,null,null,null,null,null,null,null,null,null,"Oakland County, MI",true,true,true]
[null,20230426145022,{"$f":"ROW()","v":2164},"Seth Luckman ",null,null,"Lead",null,null,null,null,null,null,null,null,null,null,null,"Broward County, FL",true,true,true]
[null,20230426145023,{"$f":"ROW()","v":2165},"Sez Aerospace Usa LLC",null,null,"Lead",null,null,null,null,null,null,null,null,null,null,null,"Mobile County, AL",true,true,true]
[null,20230426145024,{"$f":"ROW()","v":2166},"SHAFER ROOFING LLC",null,null,"Lead",null,null,null,null,null,null,null,null,null,null,null,"Stark County, OH",true,true,true]
[null,20230426145025,{"$f":"ROW()","v":2167},"Shaffer Donald E",null,null,"Lead",null,null,null,null,null,null,null,null,null,null,null,"Franklin County, OH",true,true,true]
[null,20230426145026,{"$f":"ROW()","v":2168},"Shaher M Ismail ",null,null,"Lead",null,null,null,null,null,null,null,null,null,null,null,"Cook County, IL",true,true,true]
[null,20230426145027,{"$f":"ROW()","v":2169},"Shakia Lamons ",null,null,"Lead",null,null,null,null,null,null,null,null,null,null,null,"Cobb County, GA",true,true,true]
[null,20230426145028,{"$f":"ROW()","v":2170},"Shameca Whitfield ",null,null,"Lead","MailList12","christina.whitfield34@gmail.com","shamecaso_sexy21@yahoo.com","whitfieldchristina27@gmail.com","(313) 883-3076","(313) 252-1009","(248) 678-2906","115 Richton St","Highland Park","MI",48203,"Wayne County, MI",false,false,false]
[null,20230426145029,{"$f":"ROW()","v":2171},"SHAMSI BASHA KARIM",null,null,"Lead",null,null,null,null,null,null,null,null,null,null,null,"Jefferson County, AL",true,true,true]
[null,20230426145030,{"$f":"ROW()","v":2172},"Shanda R Laster",null,null,"Lead",null,null,null,null,null,null,null,null,null,null,null,"DeSoto County, MS",true,true,true]
[null,20230426145031,{"$f":"ROW()","v":2173},"Shandel Currie ","Shahna R Currie ",null,"Lead","MailList12","srcurrie251a@yahoo.com","scurrie@emich.edu","strac5@hotmail.com","(313) 397-9285","(734) 335-6672","(734) 595-8262","6111 Swan Lake Dr","Romulus","MI",48174,null,false,false,false]
[null,20230426145032,{"$f":"ROW()","v":2174},"Shannon D Schofield ",null,null,"Lead","MailList12","sschofield@gmail.com","william.schofield4@comcast.net",null,"(239) 404-5271","(239) 561-5941","(312) 265-1635","5622 N Kenton Ave","Chicago","IL",60646,"Cook County, IL",false,false,false]
[null,20230426145033,{"$f":"ROW()","v":2175},"Shannon J Bell",null,null,"Lead",null,null,null,null,null,null,null,null,null,null,null,"Cullman County, AL",true,true,true]
[null,20230426145034,{"$f":"ROW()","v":2176},"Shantel D Bell",null,null,"Lead",null,null,null,null,null,null,null,null,null,null,null,"Cullman County, AL",true,true,true]
[null,20230426145035,{"$f":"ROW()","v":2177},"Sharon Hughes ",null,null,"Lead",null,null,null,null,null,null,null,null,null,null,null,"Cobb County, GA",true,true,true]
[null,20230426145036,{"$f":"ROW()","v":2178},"Sharon K Purrvis ",null,null,"Lead",null,null,null,null,null,null,null,null,null,null,null,"Cobb County, GA",true,true,true]
[null,20230426145037,{"$f":"ROW()","v":2179},"Sharpnack Stephen",null,null,"Lead",null,null,null,null,null,null,null,null,null,null,null,"Franklin County, OH",true,true,true]
[null,20230426145038,{"$f":"ROW()","v":2180},"Shatereka N Thomas","",null,"Lead","MailList12","tori26.tt@gmail.com","ctarver819@att.net",null,"(334) 448-9492","(706) 289-4827","(706) 615-3965","3102 S Railroad St","Phenix City","AL",36867,null,false,false,false]
[null,20230426145039,{"$f":"ROW()","v":2181},"SHAW, HAROLD R",null,null,"Lead",null,null,null,null,null,null,null,null,null,null,null,"Summit County, OH",true,true,true]
[null,20230426145040,{"$f":"ROW()","v":2182},"Shawn D Weber ",null,null,"Lead",null,null,null,null,null,null,null,null,null,null,null,"Broward County, FL",true,true,true]
[null,20230426145041,{"$f":"ROW()","v":2183},"Shawn K Spier ",null,null,"Lead",null,null,null,null,null,null,null,null,null,null,null,"Madison County, AL",true,true,true]
[null,20230426145042,{"$f":"ROW()","v":2184},"Sheban Sheban ",null,null,"Lead",null,null,null,null,null,null,null,null,null,null,null,"Cook County, IL",true,true,true]
[null,20230426145043,{"$f":"ROW()","v":2185},"SHEELY WALLACE E",null,null,"Lead",null,null,null,null,null,null,null,null,null,null,null,"Harrison County, MS",true,true,true]
[null,20230426145044,{"$f":"ROW()","v":2186},"Sheila Moore ",null,null,"Lead","MailList12","gamechick31@compuserve.com","renaepayton@hotmail.com","renaepayton@yahoo.com","(864) 557-2837","(864) 557-1668","(864) 873-9065","221 Jasmine Ln","Seneca","SC",29672,"Lexington County, SC",false,false,false]
[null,20230426145045,{"$f":"ROW()","v":2187},"Shelby Timmons ",null,null,"Lead",null,null,null,null,null,null,null,null,null,null,null,"Madison County, AL",true,true,true]
[null,20230426145046,{"$f":"ROW()","v":2188},"Shellia Jackson","",null,"Lead","MailList12","lovelylovelysexy@yahoo.com","brights@lebonheur.org","sheila.bright@adelphia.net","(901) 517-7883","(662) 470-5484","(901) 542-0149","4364 Millbranch Rd","Memphis","TN","38116-6752",null,false,false,false]
[null,20230426145047,{"$f":"ROW()","v":2189},"Shelly Reiger-Boroday ",null,null,"Lead",null,null,null,null,null,null,null,null,null,null,null,"Broward County, FL",true,true,true]
[null,20230426145048,{"$f":"ROW()","v":2190},"Shelonda V Dilworth ",null,null,"Lead",null,null,null,null,null,null,null,null,null,null,null,"Cook County, IL",true,true,true]
[null,20230426145049,{"$f":"ROW()","v":2191},"Shequeta Y Jackson ",null,null,"Lead",null,null,null,null,null,null,null,null,null,null,null,"Genesee County, MI",true,true,true]
[null,20230426145050,{"$f":"ROW()","v":2192},"Sherman Daniel D",null,null,"Lead",null,null,null,null,null,null,null,null,null,null,null,"Cook County, IL",true,true,true]
[null,20230426145051,{"$f":"ROW()","v":2193},"Sherman W Mathews ",null,null,"Lead",null,null,null,null,null,null,null,null,null,null,null,"Charleston County, SC",true,true,true]
[null,20230426145052,{"$f":"ROW()","v":2194},"Sheryl J Cook ",null,null,"Lead",null,null,null,null,null,null,null,null,null,null,null,"Cobb County, GA",true,true,true]
[null,20230426145053,{"$f":"ROW()","v":2195},"SHETLER MOVING and STORAGE INCORPORATED",null,null,"Lead",null,null,null,null,null,null,null,null,null,null,null,"Butler County, OH",true,true,true]
[null,20230426145054,{"$f":"ROW()","v":2196},"SHIDLER ADAM D",null,null,"Lead",null,null,null,null,null,null,null,null,null,null,null,"Butler County, OH",true,true,true]
[null,20230426145055,{"$f":"ROW()","v":2197},"Shirelle L Malone ",null,null,"Lead",null,null,null,null,"(815) 558-5860","(815) 968-0000","(815) 874-7217","PO Box 871","Rockford","IL",61105,null,true,false,false]
[null,20230426145056,{"$f":"ROW()","v":2198},"Shirley A Marzan ",null,null,"Lead",null,null,null,null,null,null,null,null,null,null,null,"Pinellas County, FL",true,true,true]
[null,20230426145057,{"$f":"ROW()","v":2199},"SHISLER JEFFREY",null,null,"Lead",null,null,null,null,null,null,null,null,null,null,null,"Monongalia County, VA",true,true,true]
[null,20230426145058,{"$f":"ROW()","v":2200},"Shivley Pat J",null,null,"Lead",null,null,null,null,null,null,null,null,null,null,null,"Franklin County, OH",true,true,true]
[null,20230426145059,{"$f":"ROW()","v":2201},"Shore Acres Plant Farm Inc",null,null,"Lead",null,null,null,null,null,null,null,null,null,null,null,"Mobile County, AL",true,true,true]
[null,20230426145060,{"$f":"ROW()","v":2202},"SHORTY ANDERSON AUTO SERVICE CO INC",null,null,"Lead",null,null,null,null,null,null,null,null,null,null,null,"Monongalia County, VA",true,true,true]
[null,20230426145061,{"$f":"ROW()","v":2203},"Shurkela Mason ",null,null,"Lead",null,null,null,null,null,null,null,null,null,null,null,"Genesee County, MI",true,true,true]
[null,20230426145062,{"$f":"ROW()","v":2204},"SHUSTER, KAREN L",null,null,"Lead",null,null,null,null,null,null,null,null,null,null,null,"Loraine County, OH",true,true,true]
[null,20230426145063,{"$f":"ROW()","v":2205},"Siafa Lazarus F",null,null,"Lead",null,null,null,null,null,null,null,null,null,null,null,"Franklin County, OH",true,true,true]
[null,20230426145064,{"$f":"ROW()","v":2206},"Side By Side Construction","Andrew Tuck",null,"Lead","MailList15","drew-t@comcast.net",null,null,"(810) 632-2242","(810) 695-9873","(231) 499-8276","11720 Kerns Way","Fenton","MI","48430-3546","Genesee County, MI",false,false,false]
[null,20230426145065,{"$f":"ROW()","v":2207},"Sidney N Jr Clouston ",null,null,"Lead","MailList15","cloustonenergy@aol.com","oclouston@yahoo.com","oclouston@live.com","(503) 320-9136","(305) 490-4630","(503) 642-1886","1840 Hanover St","Lincoln Park   ","MI",48146,null,false,false,false]
[null,20230426145066,{"$f":"ROW()","v":2208},"SILVA LINDA I CAMARILLO ",null,null,"Lead",null,null,null,null,null,null,null,null,null,null,null,"Montgomery County, OH",true,true,true]
[null,20230426145067,{"$f":"ROW()","v":2209},"Silvia Salon and Spa Inc Al",null,null,"Lead",null,null,null,null,null,null,null,null,null,null,null,"Charleston County, SC",true,true,true]
[null,20230426145068,{"$f":"ROW()","v":2210},"SIMMONS EARLENE M",null,null,"Lead",null,null,null,null,null,null,null,null,null,null,null,"Rankin County, MS",true,true,true]
[null,20230426145069,{"$f":"ROW()","v":2211},"Simplify Healthcare Staffing LLC",null,null,"Lead",null,null,null,null,null,null,null,null,null,null,null,"Volusia County, FL",true,true,true]
[null,20230426145070,{"$f":"ROW()","v":2212},"Singleton Rasheika",null,null,"Lead",null,null,null,null,null,null,null,null,null,null,null,"Cook County, IL",true,true,true]
[null,20230426145071,{"$f":"ROW()","v":2213},"SJSSH SAKURA",null,null,"Lead",null,null,null,null,null,null,null,null,null,null,null,"Jefferson County, AL",true,true,true]
[null,20230426145072,{"$f":"ROW()","v":2214},"SKALL DAVID W",null,null,"Lead",null,null,null,null,null,null,null,null,null,null,null,"Cuyahoga County, OH",true,true,true]
[null,20230426145073,{"$f":"ROW()","v":2215},"Slightly North Of Etc",null,null,"Lead",null,null,null,null,null,null,null,null,null,null,null,"Charleston County, SC",true,true,true]
[null,20230426145074,{"$f":"ROW()","v":2216},"SMITH and ALSPAUGH PC",null,null,"Lead",null,null,null,null,null,null,null,null,null,null,null,"Jefferson County, AL",true,true,true]
[null,20230426145075,{"$f":"ROW()","v":2217},"SMITH ALFRED C",null,null,"Lead",null,null,null,null,null,null,null,null,null,null,null,"Cuyahoga County, OH",true,true,true]
[null,20230426145076,{"$f":"ROW()","v":2218},"SMITH BOYS TIMBER INC",null,null,"Lead",null,null,null,null,null,null,null,null,null,null,null,"Madison County, MS",true,true,true]
[null,20230426145077,{"$f":"ROW()","v":2219},"SMITH DONNA M",null,null,"Lead",null,null,null,null,null,null,null,null,null,null,null,"Madison County, MS",true,true,true]
[null,20230426145078,{"$f":"ROW()","v":2220},"SMITH GARY",null,null,"Lead",null,null,null,null,null,null,null,null,null,null,null,"Cuyahoga County, OH",true,true,true]
[null,20230426145079,{"$f":"ROW()","v":2221},"Smith Jeanine M",null,null,"Lead",null,null,null,null,null,null,null,null,null,null,null,"Cook County, IL",true,true,true]
[null,20230426145080,{"$f":"ROW()","v":2222},"SMITH JOAN TRUSTEE",null,null,"Lead",null,null,null,null,null,null,null,null,null,null,null,"Cuyahoga County, OH",true,true,true]
[null,20230426145081,{"$f":"ROW()","v":2223},"SMITH JOHNNIE K ET AL",null,null,"Lead",null,null,null,null,null,null,null,null,null,null,null,"Madison County, MS",true,true,true]
[null,20230426145082,{"$f":"ROW()","v":2224},"SMITH MATTHEW K",null,null,"Lead",null,null,null,null,null,null,null,null,null,null,null,"Monongalia County, VA",true,true,true]
[null,20230426145083,{"$f":"ROW()","v":2225},"SMITH NADINE Y",null,null,"Lead",null,null,null,null,null,null,null,null,null,null,null,"Jefferson County, AL",true,true,true]
[null,20230426145084,{"$f":"ROW()","v":2226},"SMITH RHONDA",null,null,"Lead",null,null,null,null,null,null,null,null,null,null,null,"Stark County, OH",true,true,true]
[null,20230426145085,{"$f":"ROW()","v":2227},"Smith Vance",null,null,"Lead",null,null,null,null,null,null,null,null,null,null,null,"Cook County, IL",true,true,true]
[null,20230426145086,{"$f":"ROW()","v":2228},"Smothers Enterprises LLC",null,null,"Lead",null,null,null,null,null,null,null,null,null,null,null,"Madison County, AL",true,true,true]
[null,20230426145087,{"$f":"ROW()","v":2229},"Smsk Aurora Llc",null,null,"Lead",null,null,null,null,"(630) 892-8800",null,null,"1340 N River St ","Aurora","IL",60506,"Cook County, IL",true,false,false]
[null,20230426145088,{"$f":"ROW()","v":2230},"Sneak A Peek Ultrasound Llc",null,null,"Lead",null,null,null,null,null,null,null,null,null,null,null,"Franklin County, OH",true,true,true]
[null,20230426145089,{"$f":"ROW()","v":2231},"SNITIL GARY M",null,null,"Lead",null,null,null,null,null,null,null,null,null,null,null,"Cuyahoga County, OH",true,true,true]
[null,20230426145090,{"$f":"ROW()","v":2232},"Sohail Mohammad",null,null,"Lead",null,null,null,null,null,null,null,null,null,null,null,"Cook County, IL",true,true,true]
[null,20230426145091,{"$f":"ROW()","v":2233},"Solar Technology Corp Unlimited ",null,null,"Lead",null,null,null,null,null,null,null,null,null,null,null,"Broward County, FL",true,true,true]
[null,20230426145092,{"$f":"ROW()","v":2234},"SOLTIS, DAVON F",null,null,"Lead",null,null,null,null,null,null,null,null,null,null,null,"Summit County, OH",true,true,true]
[null,20230426145093,{"$f":"ROW()","v":2235},"Somersault General Contractors Llc",null,null,"Lead",null,null,null,null,null,null,null,null,null,null,null,"Franklin County, OH",true,true,true]
[null,20230426145094,{"$f":"ROW()","v":2236},"Sonja R Dowdy","","","Lead","MailList15","sonja1dowdy@yahoo.com",null,null,"(901) 860-0587","(901) 756-7022","(901) 800-1216","1047 June Rd Apt 1","Memphis","TN","38119-3725",null,false,false,false]
[null,20230426145096,{"$f":"ROW()","v":2237},"Sonya R Cole ","",null,"Lead",null,null,null,null,"(502) 445-0131","(502) 243-2528","(502) 882-1271","3801 Garwood Pl","Louisville","KY",40241,null,true,false,false]
[null,20230426145097,{"$f":"ROW()","v":2238},"SOUL UTIONS INC ",null,null,"Lead",null,null,null,null,null,null,null,null,null,null,null,"Montgomery County, OH",true,true,true]
[null,20230426145098,{"$f":"ROW()","v":2239},"Sourinha Keomanyvanh",null,null,"Lead",null,null,null,null,null,null,null,null,null,null,null,"Franklin County, OH",true,true,true]
[null,20230426145099,{"$f":"ROW()","v":2240},"Southern Diesel Service LLC",null,null,"Lead",null,null,null,null,null,null,null,null,null,null,null,"Horry County, SC",true,true,true]
[null,20230426145100,{"$f":"ROW()","v":2241},"Southland Eye Assoc Pc",null,null,"Lead",null,null,null,null,null,null,null,null,null,null,null,"Cook County, IL",true,true,true]
[null,20230426145101,{"$f":"ROW()","v":2242},"Spa @ West Ashley",null,null,"Lead",null,null,null,null,null,null,null,null,null,null,null,"Charleston County, SC",true,true,true]
[null,20230426145102,{"$f":"ROW()","v":2243},"SPADE KREATIONS LLC",null,null,"Lead",null,null,null,null,null,null,null,null,null,null,null,"Hamilton County, OH",true,true,true]
[null,20230426145103,{"$f":"ROW()","v":2244},"SPARKS MARTY",null,null,"Lead",null,null,null,null,null,null,null,null,null,null,null,"Jefferson County, AL",true,true,true]
[null,20230426145104,{"$f":"ROW()","v":2245},"SPARKS SONYA",null,null,"Lead",null,null,null,null,null,null,null,null,null,null,null,"Jefferson County, AL",true,true,true]
[null,20230426145105,{"$f":"ROW()","v":2246},"Special Home Care Services LLC",null,null,"Lead",null,null,null,null,null,null,null,null,null,null,null,"Miami-Dade County, FL",true,true,true]
[null,20230426145106,{"$f":"ROW()","v":2247},"Spiro Arsenis ",null,null,"Lead",null,null,null,null,null,null,null,null,null,null,null,"Cook County, IL",true,true,true]
[null,20230426145107,{"$f":"ROW()","v":2248},"Spiro Marchelos ",null,null,"Lead",null,null,null,null,null,null,null,null,null,null,null,"Broward County, FL",true,true,true]
[null,20230426145108,{"$f":"ROW()","v":2249},"SPRINGTIME FLOWERS LLC",null,null,"Lead",null,null,null,null,null,null,null,null,null,null,null,"Summit County, OH",true,true,true]
[null,20230426145109,{"$f":"ROW()","v":2250},"Squid Ink Pro LLC",null,null,"Lead",null,null,null,null,null,null,null,null,null,null,null,"Pinellas County, FL",true,true,true]
[null,20230426145110,{"$f":"ROW()","v":2251},"Squire Percy",null,null,"Lead",null,null,null,null,null,null,null,null,null,null,null,"Franklin County, OH",true,true,true]
[null,20230426145111,{"$f":"ROW()","v":2252},"Squires Rose",null,null,"Lead",null,null,null,null,null,null,null,null,null,null,null,"Franklin County, OH",true,true,true]
[null,20230426145112,{"$f":"ROW()","v":2253},"St Florian Clinic Inc.","",null,"Lead",null,null,null,null,"","","","3600 County Road 61","Florence","AL",35634,null,true,true,false]
[null,20230426145113,{"$f":"ROW()","v":2254},"St Matthew Christian Childcare Llc",null,null,"Lead","MailList15","st.matthewchristianchildcare@yahoo.com",null,null,"(502) 709-4339",null,null,"1133 Lavista Way","Louisville","KY",40219,"Jefferson County, KY",false,false,false]
[null,20230426145114,{"$f":"ROW()","v":2255},"Stacey W Harrison ",null,null,"Lead",null,null,null,null,null,null,null,null,null,null,null,"Houston County, AL",true,true,true]
[null,20230426145115,{"$f":"ROW()","v":2256},"Stacy R Frye ",null,null,"Lead",null,null,null,null,null,null,null,null,null,null,null,"Cobb County, GA",true,true,true]
[null,20230426145116,{"$f":"ROW()","v":2257},"STAGGS, THOMAS L JR",null,null,"Lead",null,null,null,null,null,null,null,null,null,null,null,"Summit County, OH",true,true,true]
[null,20230426145117,{"$f":"ROW()","v":2258},"Stanley L Strong ",null,null,"Lead",null,null,null,null,null,null,null,null,null,null,null,"Cook County, IL",true,true,true]
[null,20230426145118,{"$f":"ROW()","v":2259},"Stanton M Mack ",null,null,"Lead","MailList15","stanmack@aol.com","stanmack@gmail.com","lisamarielmm@aol.com","(803) 261-3399","(803) 749-7826","(843) 280-0066","351 Heatherstone Rd","Columbia","SC",29212,"Lexington County, SC",false,false,false]
[null,20230426145119,{"$f":"ROW()","v":2260},"STARK PRIMARY CARE LLC",null,null,"Lead",null,null,null,null,null,null,null,null,null,null,null,"Stark County, OH",true,true,true]
[null,20230426145120,{"$f":"ROW()","v":2261},"Starrbella Inc",null,null,"Lead",null,null,null,null,null,null,null,null,null,null,null,"Cook County, IL",true,true,true]
[null,20230426145121,{"$f":"ROW()","v":2262},"States Internal Revenue Service United ",null,null,"Lead",null,null,null,null,null,null,null,null,null,null,null,"Broward County, FL",true,true,true]
[null,20230426145122,{"$f":"ROW()","v":2263},"STEC BRETT A",null,null,"Lead",null,null,null,null,null,null,null,null,null,null,null,"Cuyahoga County, OH",true,true,true]
[null,20230426145123,{"$f":"ROW()","v":2264},"STEDMIRE JASON V",null,null,"Lead",null,null,null,null,null,null,null,null,null,null,null,"Cuyahoga County, OH",true,true,true]
[null,20230426145124,{"$f":"ROW()","v":2265},"Steele Erin N",null,null,"Lead",null,null,null,null,null,null,null,null,null,null,null,"Franklin County, OH",true,true,true]
[null,20230426145125,{"$f":"ROW()","v":2266},"Stefanie S Pender ",null,null,"Lead",null,null,null,null,null,null,null,null,null,null,null,"Oakland County, MI",true,true,true]
[null,20230426145126,{"$f":"ROW()","v":2267},"Steinmetz Christopher B",null,null,"Lead",null,null,null,null,null,null,null,null,null,null,null,"Cook County, IL",true,true,true]
[null,20230426145127,{"$f":"ROW()","v":2268},"STENSON DAVID E ",null,null,"Lead",null,null,null,null,null,null,null,null,null,null,null,"Montgomery County, OH",true,true,true]
[null,20230426145128,{"$f":"ROW()","v":2269},"Stephan J Robson ",null,null,"Lead",null,null,null,null,null,null,null,null,null,null,null,"Broward County, FL",true,true,true]
[null,20230426145129,{"$f":"ROW()","v":2270},"Stephanie K Dean ",null,null,"Lead",null,null,null,null,null,null,null,null,null,null,null,"Houston County, AL",true,true,true]
[null,20230426145130,{"$f":"ROW()","v":2271},"Stephanie M Ghingher ",null,null,"Lead",null,null,null,null,null,null,null,null,null,null,null,"Pinellas County, FL",true,true,true]
[null,20230426145131,{"$f":"ROW()","v":2272},"Stephanie Ray ",null,null,"Lead",null,null,null,null,null,null,null,null,null,null,null,"Madison County, AL",true,true,true]
[null,20230426145132,{"$f":"ROW()","v":2273},"Stephen Anderson ",null,null,"Lead",null,null,null,null,null,null,null,null,null,null,null,"Cook County, IL",true,true,true]
[null,20230426145133,{"$f":"ROW()","v":2274},"Stephen E Brackett ",null,null,"Lead",null,null,null,null,null,null,null,null,null,null,null,"Oakland County, MI",true,true,true]
[null,20230426145134,{"$f":"ROW()","v":2275},"Stephen Hauff ",null,null,"Lead",null,null,null,null,null,null,null,null,null,null,null,"Cook County, IL",true,true,true]
[null,20230426145135,{"$f":"ROW()","v":2276},"Stephen Looper ",null,null,"Lead",null,null,null,null,null,null,null,null,null,null,null,"Charleston County, SC",true,true,true]
[null,20230426145136,{"$f":"ROW()","v":2277},"Stephen Meskan ",null,null,"Lead",null,null,null,null,null,null,null,null,null,null,null,"Cook County, IL",true,true,true]
[null,20230426145137,{"$f":"ROW()","v":2278},"Stephen W Looper ",null,null,"Lead",null,null,null,null,null,null,null,null,null,null,null,"Charleston County, SC",true,true,true]
[null,20230426145138,{"$f":"ROW()","v":2279},"STERLING CATHIE J",null,null,"Lead",null,null,null,null,null,null,null,null,null,null,null,"Stark County, OH",true,true,true]
[null,20230426145139,{"$f":"ROW()","v":2280},"Steve and Diann Ailsworth","","","Lead","MailList15","ailsworthd@yahoo.com",null,null,"(901) 849-4919","(901) 357-0634","(901) 417-7391","5965 Cedar Ridge Dr","Olive Branch","MS","38654-6947",null,false,false,false]
[null,20230426145140,{"$f":"ROW()","v":2281},"Steve Ailsworth",null,null,"Lead",null,null,null,null,null,null,null,null,null,null,null,"DeSoto County, MS",true,true,true]
[null,20230426145141,{"$f":"ROW()","v":2282},"Steve Cumbie ",null,null,"Lead",null,null,null,null,null,null,null,null,null,null,null,"Mobile County, AL",true,true,true]
[null,20230426145142,{"$f":"ROW()","v":2283},"Steve Et Al Ailsworth",null,null,"Lead",null,null,null,null,null,null,null,null,null,null,null,"DeSoto County, MS",true,true,true]
[null,20230426145143,{"$f":"ROW()","v":2284},"Steven A Stosur ",null,null,"Lead",null,null,null,null,null,null,null,null,null,null,null,"Cook County, IL",true,true,true]
[null,20230426145144,{"$f":"ROW()","v":2285},"Steven A Williams ",null,null,"Lead",null,null,null,null,null,null,null,null,null,null,null,"Madison County, AL",true,true,true]
[null,20230426145145,{"$f":"ROW()","v":2286},"Steven B Magrogan ",null,null,"Lead",null,null,null,null,null,null,null,null,null,null,null,"Cobb County, GA",true,true,true]
[null,20230426145146,{"$f":"ROW()","v":2287},"Steven J Heather Rooker ",null,null,"Lead","MailList15","steve.rooker@energymat.us",null,null,"(248) 361-0162","(248) 474-4521","(248) 474-6177","37605 Northland St","Livonia","MI",48152,null,false,false,false]
[null,20230426145147,{"$f":"ROW()","v":2288},"Steven M Crimando ",null,null,"Lead",null,null,null,null,null,null,null,null,null,null,null,"Sussex County, NJ",true,true,true]
[null,20230426145148,{"$f":"ROW()","v":2289},"Steven M Such","","1040 2017/18/20 - 15979 . 90","Lead","MailList15","ssuch81@gmail.com","ssuch716@gmail.com",null,"(865) 206-7581","(865) 332-9188","(727) 831-9986","1920 Princeton Rd","Maryville","TN",37801,null,false,false,false]
[null,20230426145149,{"$f":"ROW()","v":2290},"Steven N Katz ",null,null,"Lead",null,null,null,null,null,null,null,null,null,null,null,"Cobb County, GA",true,true,true]
[null,20230426145150,{"$f":"ROW()","v":2291},"Steven W Bauman ",null,null,"Lead",null,null,null,null,null,null,null,null,null,null,null,"Charleston County, SC",true,true,true]
[null,20230426145151,{"$f":"ROW()","v":2292},"Steven Younce ",null,null,"Lead",null,null,null,null,null,null,null,null,null,null,null,"Genesee County, MI",true,true,true]
[null,20230426145152,{"$f":"ROW()","v":2293},"STEVENS CHARLES M III",null,null,"Lead",null,null,null,null,null,null,null,null,null,null,null,"Madison County, MS",true,true,true]
[null,20230426145153,{"$f":"ROW()","v":2294},"STOKES ANTHONY",null,null,"Lead",null,null,null,null,null,null,null,null,null,null,null,"Cuyahoga County, OH",true,true,true]
[null,20230426145154,{"$f":"ROW()","v":2295},"Stop Poppin ",null,null,"Lead",null,null,null,null,null,null,null,null,null,null,null,"Rockdale County, GA",true,true,true]
[null,20230426145155,{"$f":"ROW()","v":2296},"STRATACACHE INC ",null,null,"Lead",null,null,null,null,null,null,null,null,null,null,null,"Montgomery County, OH",true,true,true]
[null,20230426145156,{"$f":"ROW()","v":2297},"STRIBLING GLEN H",null,null,"Lead",null,null,null,null,null,null,null,null,null,null,null,"\nCopiah County, MS",true,true,true]
[null,20230426145157,{"$f":"ROW()","v":2298},"Sturtz Andrew C",null,null,"Lead",null,null,null,null,null,null,null,null,null,null,null,"Cook County, IL",true,true,true]
[null,20230426145158,{"$f":"ROW()","v":2299},"SUBCITY MAPLE LLC",null,null,"Lead",null,null,null,null,null,null,null,null,null,null,null,"Cuyahoga County, OH",true,true,true]
[null,20230426145159,{"$f":"ROW()","v":2300},"SUBCITY RESTAURANTS LLC",null,null,"Lead",null,null,null,null,null,null,null,null,null,null,null,"Cuyahoga County, OH",true,true,true]
[null,20230426145160,{"$f":"ROW()","v":2301},"Sue Cabadas Dds Llc ","Susan M Cabadas",null,"Lead","MailList15","cabadassue@hushmail.com","mariseline7068@gmail.com",null,"(313) 382-8893","(313) 386-1776","(313) 617-9081","14838 Belmont Ave","Allen Park","MI",48101,"Wayne County, MI",false,false,false]
[null,20230426145161,{"$f":"ROW()","v":2302},"Sulfur Operations Support","",null,"Lead",null,null,null,null,null,null,null,"","","","","Jackson County, MS",true,true,true]
[null,20230426145162,{"$f":"ROW()","v":2303},"Sulley Leonard",null,null,"Lead",null,null,null,null,null,null,null,null,null,null,null,"Cook County, IL",true,true,true]
[null,20230426145163,{"$f":"ROW()","v":2304},"Sullivan Lawrence P",null,null,"Lead",null,null,null,null,null,null,null,null,null,null,null,"Franklin County, OH",true,true,true]
[null,20230426145164,{"$f":"ROW()","v":2305},"Sunday Nwankpa ",null,null,"Lead","MailList15","icocoltd@ymail.com","ceyx33@gmail.com",null,"(708) 781-3342","(708) 409-0356","(708) 836-9913","1506 Mandel Ave","Westchester","IL",60154,"Cook County, IL",false,false,false]
[null,20230426145165,{"$f":"ROW()","v":2306},"SUPREME BEVERAGE COMPANY INC",null,null,"Lead",null,null,null,null,null,null,null,null,null,null,null,"Jefferson County, AL",true,true,true]
[null,20230426145166,{"$f":"ROW()","v":2307},"Susan Nelson ",null,null,"Lead",null,null,null,null,null,null,null,null,null,null,null,"Broward County, FL",true,true,true]
[null,20230426145167,{"$f":"ROW()","v":2308},"Sushi Bar Management Llc","Mahmoud Mazloum",null,"Lead",null,null,null,null,null,null,null,"130 Maple St","Wyandotte","MI",48192,"Wayne County, MI",true,true,false]
[null,20230426145168,{"$f":"ROW()","v":2309},"Suzan K Brown ","John H Brown",null,"Lead","MailList15","suzbro248@aol.com","piassapassa2008@gmail.com",null,"(248) 470-3364","(248) 987-6766","(248) 945-4901","17436 Louise St","Southfield","MI",48075,null,false,false,false]
[null,20230426145169,{"$f":"ROW()","v":2310},"Suzette M Heathcote ",null,null,"Lead",null,null,null,null,null,null,null,"9245 Douglas Ave","Kalamazoo","MI",49009,null,true,true,false]
[null,20230426145170,{"$f":"ROW()","v":2311},"Sw 5Th Ct Partnership 52 ",null,null,"Lead",null,null,null,null,null,null,null,null,null,null,null,"Broward County, FL",true,true,true]
[null,20230426145171,{"$f":"ROW()","v":2312},"Sweet Mama S, LLC","",null,"Lead",null,null,null,null,"","","","2961 Dauphin Island Pkwy","Mobile","AL","605-3836",null,true,true,false]
[null,20230426145172,{"$f":"ROW()","v":2313},"Sweet Mamas LLC",null,null,"Lead",null,null,null,null,null,null,null,null,null,null,null,"Mobile County, AL",true,true,true]
[null,20230426145173,{"$f":"ROW()","v":2314},"SWIGER ANNETTE",null,null,"Lead",null,null,null,null,null,null,null,null,null,null,null,"Harrison County, WV",true,true,true]
[null,20230426145174,{"$f":"ROW()","v":2315},"SWIGER GREG A",null,null,"Lead",null,null,null,null,null,null,null,null,null,null,null,"Harrison County, WV",true,true,true]
[null,20230426145175,{"$f":"ROW()","v":2316},"Swik Transportation","",null,"Lead",null,null,null,null,"","","","10815 Douglas Rd","Grand Bay","AL",36541,null,true,true,false]
[null,20230426145176,{"$f":"ROW()","v":2317},"SYKES KRISTIE",null,null,"Lead",null,null,null,null,null,null,null,null,null,null,null,"Jefferson County, AL",true,true,true]
[null,20230426145177,{"$f":"ROW()","v":2318},"T C Wisinski ",null,null,"Lead",null,null,null,null,null,null,null,null,null,null,null,"Sussex County, NJ",true,true,true]
[null,20230426145178,{"$f":"ROW()","v":2319},"Tachera Small ",null,null,"Lead",null,null,null,null,null,null,null,null,null,null,null,"Cook County, IL",true,true,true]
[null,20230426145179,{"$f":"ROW()","v":2320},"TADKA LLC ET AL",null,null,"Lead",null,null,null,null,null,null,null,null,null,null,null,"Madison County, MS",true,true,true]
[null,20230426145180,{"$f":"ROW()","v":2321},"Tag Auto Repair Inc",null,null,"Lead",null,null,null,null,null,null,null,null,null,null,null,"Madison County, AL",true,true,true]
[null,20230426145181,{"$f":"ROW()","v":2322},"Tage I Larsen ",null,null,"Lead",null,null,null,null,null,null,null,null,null,null,null,"Cook County, IL",true,true,true]
[null,20230426145182,{"$f":"ROW()","v":2323},"Takashi Hirano ",null,null,"Lead",null,null,null,null,null,null,null,null,null,null,null,"Cook County, IL",true,true,true]
[null,20230426145183,{"$f":"ROW()","v":2324},"Takeover Marketing Management Group Llc",null,null,"Lead",null,null,null,null,null,null,null,null,null,null,null,"Franklin County, OH",true,true,true]
[null,20230426145184,{"$f":"ROW()","v":2325},"Takesha Bynes ",null,null,"Lead",null,null,null,null,null,null,null,null,null,null,null,"Broward County, FL",true,true,true]
[null,20230426145185,{"$f":"ROW()","v":2326},"Talli Restaurants LLC",null,null,"Lead",null,null,null,null,null,null,null,null,null,null,null,"Madison County, AL",true,true,true]
[null,20230426145186,{"$f":"ROW()","v":2327},"Tamara D Slye Jones ",null,null,"Lead",null,null,null,null,null,null,null,null,null,null,null,"Cobb County, GA",true,true,true]
[null,20230426145187,{"$f":"ROW()","v":2328},"Tamara Tipton ",null,null,"Lead",null,null,null,null,null,null,null,null,null,null,null,"Genesee County, MI",true,true,true]
[null,20230426145188,{"$f":"ROW()","v":2329},"Tammie L Rodriguez ",null,null,"Lead","MailList15","tpfaffbrown@worldnet.att.net","tamara.rodriguez@att.net","tamlbrown@yahoo.com","(715) 748-0790","(715) 965-8652","(815) 765-1986","County Road M","Rib Lake","WI",54470,"Cook County, IL",false,false,false]
[null,20230426145189,{"$f":"ROW()","v":2330},"Tammy Decker ",null,null,"Lead",null,null,null,null,null,null,null,null,null,null,null,"Macomb County, MI",true,true,true]
[null,20230426145190,{"$f":"ROW()","v":2331},"Tammy E Bolton ",null,null,"Lead",null,null,null,null,null,null,null,null,null,null,null,"Mobile County, AL",true,true,true]
[null,20230426145191,{"$f":"ROW()","v":2332},"TANKS TARON S",null,null,"Lead",null,null,null,null,null,null,null,null,null,null,null,"Cuyahoga County, OH",true,true,true]
[null,20230426145192,{"$f":"ROW()","v":2333},"Tanya L Bennett ",null,null,"Lead","MailList15","tanyabennett1971@yahoo.com","tanya.bennett97@yahoo.com",null,"(312) 428-0272","(773) 801-0654","(773) 224-6977","10350 Dickens St #1e","Westchester","IL",60154,"Cook County, IL",false,false,false]
[null,20230426145193,{"$f":"ROW()","v":2334},"Targa Development Inc",null,null,"Lead",null,null,null,null,null,null,null,null,null,null,null,"Broward County, FL",true,true,true]
[null,20230426145194,{"$f":"ROW()","v":2335},"Tarsha Elmore-Dantzler ",null,null,"Lead",null,null,null,null,null,null,null,null,null,null,null,"Charleston County, SC",true,true,true]
[null,20230426145195,{"$f":"ROW()","v":2336},"TAXX REVOLUTION",null,null,"Lead",null,null,null,null,null,null,null,null,null,null,null,"Jefferson County, AL",true,true,true]
[null,20230426145196,{"$f":"ROW()","v":2337},"TAYLOR BLAKE A",null,null,"Lead",null,null,null,null,null,null,null,null,null,null,null,"Cuyahoga County, OH",true,true,true]
[null,20230426145197,{"$f":"ROW()","v":2338},"TDRLLC",null,null,"Lead",null,null,null,null,null,null,null,null,null,null,null,"Harrison County, MS",true,true,true]
[null,20230426145198,{"$f":"ROW()","v":2339},"Teaching Center Excellerated ",null,null,"Lead",null,null,null,null,null,null,null,null,null,null,null,"Pinellas County, FL",true,true,true]
[null,20230426145199,{"$f":"ROW()","v":2340},"TEAM BEHAVIORAL HEALTH",null,null,"Lead",null,null,null,null,null,null,null,null,null,null,null,"Hamilton County, OH",true,true,true]
[null,20230426145200,{"$f":"ROW()","v":2341},"Tech And Innovation Inc Ignite ",null,null,"Lead",null,null,null,null,null,null,null,null,null,null,null,"Cook County, IL",true,true,true]
[null,20230426145201,{"$f":"ROW()","v":2342},"TEETS KELLI V",null,null,"Lead",null,null,null,null,null,null,null,null,null,null,null,"Monongalia County, VA",true,true,true]
[null,20230426145202,{"$f":"ROW()","v":2343},"TEETS ROBERT L JR",null,null,"Lead",null,null,null,null,null,null,null,null,null,null,null,"Monongalia County, VA",true,true,true]
[null,20230426145203,{"$f":"ROW()","v":2344},"Temidayo Ojo ",null,null,"Lead",null,null,null,null,null,null,null,null,null,null,null,"Sussex County, NJ",true,true,true]
[null,20230426145204,{"$f":"ROW()","v":2345},"Tennessee Valley Builders Inc",null,null,"Lead",null,null,null,null,null,null,null,null,null,null,null,"Madison County, AL",true,true,true]
[null,20230426145205,{"$f":"ROW()","v":2346},"Tennessee Valley Builders Inc.","",null,"Lead",null,null,null,null,"","","","2809 Newby Rd Sw Ste 109","Huntsville","AL",35805,null,true,true,false]
[null,20230426145206,{"$f":"ROW()","v":2347},"Tennessee Valley Press Inc.","",null,"Lead",null,null,null,null,"","","","11 Moulton St E","Decatur","AL","5601-2309",null,true,true,false]
[null,20230426145207,{"$f":"ROW()","v":2348},"Teresa A Brooks ",null,null,"Lead",null,null,null,null,null,null,null,null,null,null,null,"Broward County, FL",true,true,true]
[null,20230426145208,{"$f":"ROW()","v":2349},"Teresa Pipkins ",null,null,"Lead",null,null,null,null,null,null,null,null,null,null,null,"Mobile County, AL",true,true,true]
[null,20230426145209,{"$f":"ROW()","v":2350},"Terrie K Christopher ",null,null,"Lead",null,null,null,null,null,null,null,null,null,null,null,"Volusia County, FL",true,true,true]
[null,20230426145210,{"$f":"ROW()","v":2351},"Terry B Judy ",null,null,"Lead",null,null,null,null,"(843) 869-3457","(843) 763-1285","(843) 631-0097","104 Cedarlane Pkwy","West Columbia","SC",29170,"Lexington County, SC",true,false,false]
[null,20230426145211,{"$f":"ROW()","v":2352},"Terry E Elsner ",null,null,"Lead",null,null,null,null,null,null,null,null,null,null,null,"Cobb County, GA",true,true,true]
[null,20230426145212,{"$f":"ROW()","v":2353},"Terry McDaniel",null,null,"Lead",null,null,null,null,null,null,null,null,null,null,null,"Muskegon County, MI",true,true,true]
[null,20230426145213,{"$f":"ROW()","v":2354},"Terry S Souvenir ",null,null,"Lead",null,null,null,null,null,null,null,null,null,null,null,"Broward County, FL",true,true,true]
[null,20230426145214,{"$f":"ROW()","v":2355},"Teverbaugh Ava M",null,null,"Lead",null,null,null,null,null,null,null,null,null,null,null,"Cook County, IL",true,true,true]
[null,20230426145215,{"$f":"ROW()","v":2356},"Tevin J Fulmore ",null,null,"Lead",null,null,null,null,null,null,null,null,null,null,null,"Charleston County, SC",true,true,true]
[null,20230426145216,{"$f":"ROW()","v":2357},"Tevin Shane Souffranc ",null,null,"Lead",null,null,null,null,null,null,null,null,null,null,null,"Broward County, FL",true,true,true]
[null,20230426145217,{"$f":"ROW()","v":2358},"TFI Inc",null,null,"Lead",null,null,null,null,null,null,null,null,null,null,null,"Muskegon County, MI",true,true,true]
[null,20230426145218,{"$f":"ROW()","v":2359},"The Railyard","",null,"Lead",null,null,null,null,"","","","209 A Second Ave Se","Decatur","AL",35601,null,true,true,false]
[null,20230426145219,{"$f":"ROW()","v":2360},"Thelma J Ware ",null,null,"Lead","MailList15","bsp528@yahoo.com","sdruihet@hotmail.com","beckypennethy@tivejo.com","(734) 674-3734","(248) 249-5443","(903) 286-2567",null,null,null,null,"Wayne County, MI",false,false,false]
[null,20230426145220,{"$f":"ROW()","v":2361},"Theodore Brunsvold ",null,null,"Lead",null,null,null,null,"(312) 501-1512","(312) 988-4018","(312) 835-9997","1449 N Mohawk St","Chicago","IL",60610,"Cook County, IL",true,false,false]
[null,20230426145221,{"$f":"ROW()","v":2362},"Theodore S Jr Wright ",null,null,"Lead",null,null,null,null,"(773) 777-2620","(630) 789-3693","(708) 366-5923","4757 W Montrose Ave","Chicago","IL",60641,"Cook County, IL",true,false,false]
[null,20230426145222,{"$f":"ROW()","v":2363},"Theresa Pappan ",null,null,"Lead",null,null,null,null,null,null,null,null,null,null,null,"Sussex County, NJ",true,true,true]
[null,20230426145223,{"$f":"ROW()","v":2364},"Theron L Wells ",null,null,"Lead",null,null,null,null,null,null,null,null,null,null,null,"Miami-Dade County, FL",true,true,true]
[null,20230426145225,{"$f":"ROW()","v":2365},"Thesignchef Dot Com Inc",null,null,"Lead",null,null,null,null,null,null,null,null,null,null,null,"Charleston County, SC",true,true,true]
[null,20230426145226,{"$f":"ROW()","v":2366},"Thiago Rodriguez Goncalves ",null,null,"Lead",null,null,null,null,null,null,null,null,null,null,null,"Cobb County, GA",true,true,true]
[null,20230426145227,{"$f":"ROW()","v":2367},"Thomas A Graskewicz ",null,null,"Lead",null,null,null,null,null,null,null,null,null,null,null,"Macomb County, MI",true,true,true]
[null,20230426145228,{"$f":"ROW()","v":2368},"Thomas A Hoyt ","",null,"Lead","MailList15","thomashoyt@live.com",null,null,"(314) 276-2017","(636) 240-6429","(315) 622-0786","10300 Meeting St #203","Prospect","KY",40059,null,false,false,false]
[null,20230426145229,{"$f":"ROW()","v":2369},"THOMAS CATENA R",null,null,"Lead",null,null,null,null,null,null,null,null,null,null,null,"Rankin County, MS",true,true,true]
[null,20230426145230,{"$f":"ROW()","v":2370},"Thomas Grysztar ",null,null,"Lead",null,null,null,null,"(773) 876-0650","(773) 631-0264","(773) 631-0265","5761 N Elston Ave #1","Chicago","IL",60646,"Cook County, IL",true,false,false]
[null,20230426145231,{"$f":"ROW()","v":2371},"Thomas James D",null,null,"Lead",null,null,null,null,null,null,null,null,null,null,null,"Franklin County, OH",true,true,true]
[null,20230426145232,{"$f":"ROW()","v":2372},"THOMAS JERRY W",null,null,"Lead",null,null,null,null,null,null,null,null,null,null,null,"Rankin County, MS",true,true,true]
[null,20230426145233,{"$f":"ROW()","v":2373},"THOMAS KEVIN J ",null,null,"Lead",null,null,null,null,null,null,null,null,null,null,null,"Montgomery County, OH",true,true,true]
[null,20230426145234,{"$f":"ROW()","v":2374},"Thomas Larry W",null,null,"Lead",null,null,null,null,null,null,null,null,null,null,null,"Franklin County, OH",true,true,true]
[null,20230426145235,{"$f":"ROW()","v":2375},"Thomas M Mccartney ",null,null,"Lead",null,null,null,null,null,null,null,null,null,null,null,"Cook County, IL",true,true,true]
[null,20230426145236,{"$f":"ROW()","v":2376},"Thomas Pearson ","Wanra M Pearson",null,"Lead","MailList15","magicwan33@sbcglobal.net",null,null,"(313) 535-5081","(313) 333-3790","(313) 543-2923","11387 Riverdale","Redford","MI",48239,"Wayne County, MI",false,false,false]
[null,20230426145237,{"$f":"ROW()","v":2377},"Thomas Zinschlag ",null,null,"Lead",null,null,null,null,null,null,null,null,null,null,null,"Cook County, IL",true,true,true]
[null,20230426145238,{"$f":"ROW()","v":2378},"Threading Salon Unique ",null,null,"Lead",null,null,null,null,null,null,null,null,null,null,null,"Cobb County, GA",true,true,true]
[null,20230426145239,{"$f":"ROW()","v":2379},"THURMAN BONITA",null,null,"Lead",null,null,null,null,null,null,null,null,null,null,null,"Butler County, OH",true,true,true]
[null,20230426145240,{"$f":"ROW()","v":2380},"Tia A Hughley ",null,null,"Lead",null,null,null,null,null,null,null,null,null,null,null,"Cobb County, GA",true,true,true]
[null,20230426145241,{"$f":"ROW()","v":2381},"Tichaona P Wiggins ",null,null,"Lead",null,null,null,null,null,null,null,null,null,null,null,"Cobb County, GA",true,true,true]
[null,20230426145242,{"$f":"ROW()","v":2382},"Tiffanie P Wilson ",null,null,"Lead",null,null,null,null,null,null,null,null,null,null,null,"Cook County, IL",true,true,true]
[null,20230426145243,{"$f":"ROW()","v":2383},"Tig Professional Svcs LLC",null,null,"Lead",null,null,null,null,null,null,null,null,null,null,null,"Charleston County, SC",true,true,true]
[null,20230426145244,{"$f":"ROW()","v":2384},"Timothy C Coyle ",null,null,"Lead",null,null,null,null,null,null,null,null,null,null,null,"Charleston County, SC",true,true,true]
[null,20230426145245,{"$f":"ROW()","v":2385},"Timothy Linsenmeyer ",null,null,"Lead",null,null,null,null,null,null,null,null,null,null,null,"Cook County, IL",true,true,true]
[null,20230426145246,{"$f":"ROW()","v":2386},"Timothy Patrick ",null,null,"Lead",null,null,null,null,null,null,null,null,null,null,null,"Sussex County, NJ",true,true,true]
[null,20230426145247,{"$f":"ROW()","v":2387},"Timothy R Kuban ",null,null,"Lead","MailList15","harley6298@comcast.net","nugentnut@cox-internet.com","harley66298@yahoo.com","(708) 827-5445","(219) 393-9382","(708) 769-3333","9006 S Maple Ln","Hickory Hills","IL",60457,"Cook County, IL",false,false,false]
[null,20230426145248,{"$f":"ROW()","v":2388},"Timothy R Mazur ",null,null,"Lead",null,null,null,null,null,null,null,null,null,null,null,"Cobb County, GA",true,true,true]
[null,20230426145249,{"$f":"ROW()","v":2389},"Timothy V Collins ",null,null,"Lead",null,null,null,null,null,null,null,null,null,null,null,"Cobb County, GA",true,true,true]
[null,20230426145250,{"$f":"ROW()","v":2390},"Timothy Wiley","",null,"Lead","MailList15","r-martinez34@hotmail.com",null,null,"(901) 562-4483","(901) 438-1992","(901) 949-4496","6270 Staffordshire Rd","Bartlett","TN",38134,null,false,false,false]
[null,20230426145251,{"$f":"ROW()","v":2391},"Tina Slater ",null,null,"Lead",null,null,null,null,null,null,null,null,null,null,null,"Pinellas County, FL",true,true,true]
[null,20230426145252,{"$f":"ROW()","v":2392},"TINY STEPS ACADEMY LLC",null,null,"Lead",null,null,null,null,null,null,null,null,null,null,null,"Harrison County, MS",true,true,true]
[null,20230426145253,{"$f":"ROW()","v":2393},"Tiny Tassel LLC",null,null,"Lead",null,null,null,null,null,null,null,null,null,null,null,"Charleston County, SC",true,true,true]
[null,20230426145254,{"$f":"ROW()","v":2394},"Tires Dannys ",null,null,"Lead",null,null,null,null,null,null,null,null,null,null,null,"Cobb County, GA",true,true,true]
[null,20230426145255,{"$f":"ROW()","v":2395},"TKC TRANSPORT LLC",null,null,"Lead",null,null,null,null,null,null,null,null,null,null,null,"Rankin County, MS",true,true,true]
[null,20230426145256,{"$f":"ROW()","v":2396},"TLC HOMES",null,null,"Lead",null,null,null,null,null,null,null,null,null,null,null,"Summit County, OH",true,true,true]
[null,20230426145257,{"$f":"ROW()","v":2397},"Todd H Magnusson ",null,null,"Lead",null,null,null,null,null,null,null,null,null,null,null,"Brevard County, FL",true,true,true]
[null,20230426145258,{"$f":"ROW()","v":2398},"TOLEDO YACHT CLUB",null,null,"Lead",null,null,null,null,null,null,null,null,null,null,null,"Lucas County, OH",true,true,true]
[null,20230426145259,{"$f":"ROW()","v":2399},"Tom Ahrens Inc",null,null,"Lead",null,null,null,null,null,null,null,null,null,null,null,"Cobb County, GA",true,true,true]
[null,20230426145260,{"$f":"ROW()","v":2400},"Tomlinson Toni M",null,null,"Lead",null,null,null,null,null,null,null,null,null,null,null,"Franklin County, OH",true,true,true]
[null,20230426145261,{"$f":"ROW()","v":2401},"Tommy Hammock ",null,null,"Lead",null,null,null,null,null,null,null,null,null,null,null,"Horry County, SC",true,true,true]
[null,20230426145262,{"$f":"ROW()","v":2402},"TOMMY KEENER LLC",null,null,"Lead",null,null,null,null,null,null,null,null,null,null,null,"Monongalia County, VA",true,true,true]
[null,20230426145263,{"$f":"ROW()","v":2403},"TONEY STEMBRIDGE, TAMMY R",null,null,"Lead",null,null,null,null,null,null,null,null,null,null,null,"Summit County, OH",true,true,true]
[null,20230426145264,{"$f":"ROW()","v":2404},"Toni Stewart","","","Lead","MailList15","tonistewart311@gmail.com",null,null,"(312) 259-1599","(773) 827-1811","(773) 777-6353","4811 Sturbridge Ln","Memphis","TN","38141-8550",null,false,false,false]
[null,20230426145265,{"$f":"ROW()","v":2405},"Tonia L Powell ",null,null,"Lead",null,null,null,null,null,null,null,null,null,null,null,"Mobile County, AL",true,true,true]
[null,20230426145266,{"$f":"ROW()","v":2406},"Tony L Hairston ",null,null,"Lead",null,null,null,null,null,null,null,null,null,null,null,"Madison County, AL",true,true,true]
[null,20230426145267,{"$f":"ROW()","v":2407},"Tony Marshall ",null,null,"Lead",null,null,null,null,null,null,null,null,null,null,null,"Macomb County, MI",true,true,true]
[null,20230426145268,{"$f":"ROW()","v":2408},"Tonya Jordan Motley ",null,null,"Lead",null,null,null,null,null,null,null,null,null,null,null,"Albany County, NY",true,true,true]
[null,20230426145269,{"$f":"ROW()","v":2409},"Tonys Pest Killers Llc",null,null,"Lead",null,null,null,null,null,null,null,null,null,null,null,"Cook County, IL",true,true,true]
[null,20230426145270,{"$f":"ROW()","v":2410},"Torres Jose O Avila",null,null,"Lead",null,null,null,null,null,null,null,null,null,null,null,"Franklin County, OH",true,true,true]
[null,20230426145271,{"$f":"ROW()","v":2411},"Torres Oscar E",null,null,"Lead",null,null,null,null,null,null,null,null,null,null,null,"Franklin County, OH",true,true,true]
[null,20230426145272,{"$f":"ROW()","v":2412},"Totalbuildouts Inc",null,null,"Lead",null,null,null,null,null,null,null,null,null,null,null,"Miami-Dade County, FL",true,true,true]
[null,20230426145273,{"$f":"ROW()","v":2413},"TOTH ROBERT S",null,null,"Lead",null,null,null,null,null,null,null,null,null,null,null,"Cuyahoga County, OH",true,true,true]
[null,20230426145274,{"$f":"ROW()","v":2414},"Toya M Griffin ",null,null,"Lead",null,null,null,null,null,null,null,null,null,null,null,"Cook County, IL",true,true,true]
[null,20230426145275,{"$f":"ROW()","v":2415},"TOZZI RIK S",null,null,"Lead",null,null,null,null,null,null,null,null,null,null,null,"Jefferson County, AL",true,true,true]
[null,20230426145276,{"$f":"ROW()","v":2416},"Tracey M Harris ",null,null,"Lead",null,null,null,null,null,null,null,null,null,null,null,"Cook County, IL",true,true,true]
[null,20230426145277,{"$f":"ROW()","v":2417},"Tracey Stallworth ",null,null,"Lead",null,null,null,null,null,null,null,null,null,null,null,"Wayne County, MI",true,true,true]
[null,20230426145278,{"$f":"ROW()","v":2418},"Tracy Luckman ",null,null,"Lead",null,null,null,null,null,null,null,null,null,null,null,"Broward County, FL",true,true,true]
[null,20230426145279,{"$f":"ROW()","v":2419},"Trae J Berger ",null,null,"Lead",null,null,null,null,null,null,null,null,null,null,null,"Cobb County, GA",true,true,true]
[null,20230426145280,{"$f":"ROW()","v":2420},"TRAINER ASHLEY",null,null,"Lead",null,null,null,null,null,null,null,null,null,null,null,"Jefferson County, AL",true,true,true]
[null,20230426145281,{"$f":"ROW()","v":2421},"Tranquility Carriers Inc",null,null,"Lead",null,null,null,null,null,null,null,null,null,null,null,"Rockdale County, GA",true,true,true]
[null,20230426145282,{"$f":"ROW()","v":2422},"Travis R Powers ","Nicole Powers ",null,"Lead",null,null,null,null,"(917) 647-9406","(212) 842-0466","(502) 451-0402","252 7th Ave #s","New York","NY",10001,null,true,false,false]
[null,20230426145283,{"$f":"ROW()","v":2423},"Tremaine R R Fowler ",null,null,"Lead","MailList15","gegefow@gmail.com","liv4money@yahoo.com",null,"(708) 629-9165","(773) 855-9724","(773) 966-5205","1507 E 53rd St #162","Chicago","IL",60615,"Cook County, IL",false,false,false]
[null,20230426145284,{"$f":"ROW()","v":2424},"Tria A Murphy ",null,null,"Lead",null,null,null,null,null,null,null,null,null,null,null,"Cook County, IL",true,true,true]
[null,20230426145285,{"$f":"ROW()","v":2425},"Tricia Hopson",null,null,"Lead",null,null,null,null,null,null,null,null,null,null,null,"DeSoto County, MS",true,true,true]
[null,20230426145286,{"$f":"ROW()","v":2426},"TRICOUNTY VISITING NURSES LLC",null,null,"Lead",null,null,null,null,null,null,null,null,null,null,null,"Hamilton County, OH",true,true,true]
[null,20230426145287,{"$f":"ROW()","v":2427},"TRI-EISC LLC","Keith Delany",null,"Lead","MailList15","mattf@mac.com",null,null,"(502) 451-3178",null,null," 2103 Reynolds Lane","Louisville","KY",40218,"Jefferson County, KY",false,false,false]
[null,20230426145288,{"$f":"ROW()","v":2428},"Trio Motors Inc",null,null,"Lead",null,null,null,null,null,null,null,null,null,null,null,"Genesee County, MI",true,true,true]
[null,20230426145289,{"$f":"ROW()","v":2429},"Trip Medical Transport Service Llc",null,null,"Lead",null,null,null,null,null,null,null,null,null,null,null,"Franklin County, OH",true,true,true]
[null,20230426145290,{"$f":"ROW()","v":2430},"Trojan Plbg Co Inc",null,null,"Lead",null,null,null,null,null,null,null,null,null,null,null,"Cook County, IL",true,true,true]
[null,20230426145291,{"$f":"ROW()","v":2431},"Troy Guinn ","",null,"Lead",null,null,null,null,"(502) 298-3858","(502) 489-5302","(502) 423-0927"," 9811 Phoenix Trl","Louisville","KY",40223,null,true,false,false]
[null,20230426145292,{"$f":"ROW()","v":2432},"Troy Henry ",null,null,"Lead",null,null,null,null,null,null,null,null,null,null,null,"Cook County, IL",true,true,true]
[null,20230426145293,{"$f":"ROW()","v":2433},"Troy Rachel","Rachel Trucking Company","","Lead","MailList15","rachall.trey91@gmail.com",null,null,"(423) 268-1197","(423) 768-0079","(423) 725-3551","1943 Falls Dr","Memphis","TN","38116-8026",null,false,false,false]
[null,20230426145294,{"$f":"ROW()","v":2434},"Trucking Corp European ",null,null,"Lead",null,null,null,null,null,null,null,null,null,null,null,"Macomb County, MI",true,true,true]
[null,20230426145295,{"$f":"ROW()","v":2435},"TRUNG AND NHUNG LLC",null,null,"Lead",null,null,null,null,null,null,null,null,null,null,null,"Loraine County, OH",true,true,true]
[null,20230426145296,{"$f":"ROW()","v":2436},"Tunde Adetunji ",null,null,"Lead",null,null,null,null,null,null,null,null,null,null,null,"Cobb County, GA",true,true,true]
[null,20230426145297,{"$f":"ROW()","v":2437},"Tung Y John Moran ",null,null,"Lead",null,null,null,null,null,null,null,null,null,null,null,"Brevard County, FL",true,true,true]
[null,20230426145298,{"$f":"ROW()","v":2438},"Turab H T and Anjum Jafri S ",null,null,"Lead",null,null,null,null,null,null,null,null,null,null,null,"Albany County, NY",true,true,true]
[null,20230426145299,{"$f":"ROW()","v":2439},"Turkish Imports Inc","Ramzi Thabath",null,"Lead",null,null,null,null,"(734) 620-3331","(313) 429-3722","(734) 560-6105","29198 Florence St","Garden City","MI",48135,"Wayne County, MI",true,false,false]
[null,20230426145300,{"$f":"ROW()","v":2440},"Tuwanna Dennis ",null,null,"Lead",null,null,null,null,null,null,null,null,null,null,null,"Cook County, IL",true,true,true]
[null,20230426145301,{"$f":"ROW()","v":2441},"TWYMAN MARLON D ",null,null,"Lead",null,null,null,null,null,null,null,null,null,null,null,"Montgomery County, OH",true,true,true]
[null,20230426145302,{"$f":"ROW()","v":2442},"TWYMON KIMBERLY",null,null,"Lead",null,null,null,null,null,null,null,null,null,null,null,"Jefferson County, AL",true,true,true]
[null,20230426145303,{"$f":"ROW()","v":2443},"TWYMON LYNN",null,null,"Lead",null,null,null,null,null,null,null,null,null,null,null,"Jefferson County, AL",true,true,true]
[null,20230426145304,{"$f":"ROW()","v":2444},"Tyrone C Ingram ",null,null,"Lead",null,null,null,null,null,null,null,null,null,null,null,"Macomb County, MI",true,true,true]
[null,20230426145305,{"$f":"ROW()","v":2445},"U S A MOTORCARS INC",null,null,"Lead",null,null,null,null,null,null,null,null,null,null,null,"Cuyahoga County, OH",true,true,true]
[null,20230426145306,{"$f":"ROW()","v":2446},"Ulysses L Hernandez ",null,null,"Lead",null,null,null,null,null,null,null,null,null,null,null,"Macomb County, MI",true,true,true]
[null,20230426145307,{"$f":"ROW()","v":2447},"UNIQUE FILMS TINT and DETAIL CENTER LLC",null,null,"Lead",null,null,null,null,null,null,null,null,null,null,null,"Jefferson County, AL",true,true,true]
[null,20230426145308,{"$f":"ROW()","v":2448},"Unisex Ltd Marias ",null,null,"Lead",null,null,null,null,null,null,null,null,null,null,null,"Cook County, IL",true,true,true]
[null,20230426145309,{"$f":"ROW()","v":2449},"United States Assn Of Cdc Inc",null,null,"Lead",null,null,null,null,null,null,null,null,null,null,null,"Broward County, FL",true,true,true]
[null,20230426145310,{"$f":"ROW()","v":2450},"United Sundry Co LLC",null,null,"Lead",null,null,null,null,null,null,null,null,null,null,null,"Broward County, FL",true,true,true]
[null,20230426145311,{"$f":"ROW()","v":2451},"UNIVERSAL HEATING and COOLING ",null,null,"Lead",null,null,null,null,null,null,null,null,null,null,null,"Montgomery County, OH",true,true,true]
[null,20230426145312,{"$f":"ROW()","v":2452},"Upper Peninsula Masonic Assoc  ",null,null,"Lead",null,null,null,null,null,null,null,null,null,null,null,"Marquette County, MI",true,true,true]
[null,20230426145313,{"$f":"ROW()","v":2453},"Urgent Medical Center Inc",null,null,"Lead",null,null,null,null,null,null,null,null,null,null,null,"Broward County, FL",true,true,true]
[null,20230426145314,{"$f":"ROW()","v":2454},"URSETTI BONNIE B",null,null,"Lead",null,null,null,null,null,null,null,null,null,null,null,"Cuyahoga County, OH",true,true,true]
[null,20230426145315,{"$f":"ROW()","v":2455},"Us Corporation Umbanda ",null,null,"Lead",null,null,null,null,null,null,null,null,null,null,null,"Miami-Dade County, FL",true,true,true]
[null,20230426145316,{"$f":"ROW()","v":2456},"Uzys Drywall Inc",null,null,"Lead",null,null,null,null,null,null,null,null,null,null,null,"Franklin County, OH",true,true,true]
[null,20230426145317,{"$f":"ROW()","v":2457},"V and S Tile LLC",null,null,"Lead",null,null,null,null,null,null,null,null,null,null,null,"Albany County, NY",true,true,true]
[null,20230426145318,{"$f":"ROW()","v":2458},"Vabview Llc","Troy Alexander Smith",null,"Lead","MailList15","troyatgsmith@yahoo.com","dulcineab4@aol.com","familycourtheroes@hotmail.com","(502) 767-7378","(502) 254-9427","(805) 320-6770","10210 Davinhurst Ct Louisville"," Ky 40241",null,null,"Jefferson County, KY",false,false,false]
[null,20230426145319,{"$f":"ROW()","v":2459},"VACCARO, FRANK S",null,null,"Lead",null,null,null,null,null,null,null,null,null,null,null,"Summit County, OH",true,true,true]
[null,20230426145320,{"$f":"ROW()","v":2460},"Vance Smith ",null,null,"Lead",null,null,null,null,null,null,null,null,null,null,null,"Cook County, IL",true,true,true]
[null,20230426145321,{"$f":"ROW()","v":2461},"Vandutch Inc",null,null,"Lead",null,null,null,null,null,null,null,null,null,null,null,"Broward County, FL",true,true,true]
[null,20230426145322,{"$f":"ROW()","v":2462},"Vanessa Martin ",null,null,"Lead",null,null,null,null,null,null,null,null,null,null,null,"Albany County, NY",true,true,true]
[null,20230426145323,{"$f":"ROW()","v":2463},"Vavra Law P C",null,null,"Lead",null,null,null,null,null,null,null,null,null,null,null,"Charleston County, SC",true,true,true]
[null,20230426145324,{"$f":"ROW()","v":2464},"Vendetta Tiara Thomas Sr",null,null,"Lead","MailList15","v3ndtthomas@gmail.com","vendtthomas@gmail.com","vendettathomas89@gmail.com","(708) 446-6326","(312) 882-7306","(773) 355-0484","11519 S Racine Ave","Chicago","IL",60643,"Cook County, IL",false,false,false]
[null,20230426145325,{"$f":"ROW()","v":2465},"Vend-Rite Mfg Co Inc",null,null,"Lead",null,null,null,null,null,null,null,null,null,null,null,"Cook County, IL",true,true,true]
[null,20230426145326,{"$f":"ROW()","v":2466},"VENTURE BOY INDUSTRIES LLC",null,null,"Lead",null,null,null,null,null,null,null,null,null,null,null,"Jefferson County, AL",true,true,true]
[null,20230426145327,{"$f":"ROW()","v":2467},"Vernon M Jr Anderson ",null,null,"Lead",null,null,null,null,null,null,null,null,null,null,null,"Brevard County, FL",true,true,true]
[null,20230426145328,{"$f":"ROW()","v":2468},"VERSACON INC",null,null,"Lead",null,null,null,null,null,null,null,null,null,null,null,"Jefferson County, AL",true,true,true]
[null,20230426145329,{"$f":"ROW()","v":2469},"Veterans Construction Services Inc","Neal W and Diane M Krantz",null,"Lead","MailList15","nealjr@ksai.us","nealkrantz@earthlink.net","nealkrantzjr@gmail.com","(734) 812-3838","(313) 255-0057","(248) 987-6148","30126 Bretton","Livonia","MI",48152,null,false,false,false]
[null,20230426145330,{"$f":"ROW()","v":2470},"VF CONTRACTING LLC",null,null,"Lead",null,null,null,null,null,null,null,null,null,null,null,"Cuyahoga County, OH",true,true,true]
[null,20230426145331,{"$f":"ROW()","v":2471},"Victor M Lopez Santaella ",null,null,"Lead",null,null,null,null,null,null,null,null,null,null,null,"Cobb County, GA",true,true,true]
[null,20230426145332,{"$f":"ROW()","v":2472},"Victorian Court Llc",null,null,"Lead",null,null,null,null,null,null,null,null,null,null,null,"Franklin County, OH",true,true,true]
[null,20230426145333,{"$f":"ROW()","v":2473},"VICTORY AIR MECHANICAL LLC",null,null,"Lead",null,null,null,null,null,null,null,null,null,null,null,"Hamilton County, OH",true,true,true]
[null,20230426145334,{"$f":"ROW()","v":2474},"Village Auto Care Ltd",null,null,"Lead",null,null,null,null,null,null,null,null,null,null,null,"Franklin County, OH",true,true,true]
[null,20230426145335,{"$f":"ROW()","v":2475},"VILLAGE VETERINARY HOSPITAL",null,null,"Lead",null,null,null,null,null,null,null,null,null,null,null,"Lucas County, OH",true,true,true]
[null,20230426145336,{"$f":"ROW()","v":2476},"Vincent Scott ",null,null,"Lead",null,null,null,null,null,null,null,null,null,null,null,"Rockdale County, GA",true,true,true]
[null,20230426145337,{"$f":"ROW()","v":2477},"Vip Supreme Staffing Llc",null,null,"Lead",null,null,null,null,null,null,null,null,null,null,null,"Franklin County, OH",true,true,true]
[null,20230426145338,{"$f":"ROW()","v":2478},"Virtus Inc",null,null,"Lead",null,null,null,null,null,null,null,null,null,null,null,"Rockdale County, GA",true,true,true]
[null,20230426145339,{"$f":"ROW()","v":2479},"Vivian Lawrence ",null,null,"Lead","MailList15","vivianlawrence2014@gmail.com","vivianlawrence2010@yahoo.com","whiteboyeddie@gmail.com","(708) 221-3199","(773) 538-0717","(773) 285-9185","1317 Whitcomb St","Gary","IN",46404,"Cook County, IL",false,false,false]
[null,20230426145340,{"$f":"ROW()","v":2480},"VO TOMMY ",null,null,"Lead",null,null,null,null,null,null,null,null,null,null,null,"Montgomery County, OH",true,true,true]
[null,20230426145341,{"$f":"ROW()","v":2481},"Volta Group LLC",null,null,"Lead",null,null,null,null,null,null,null,null,null,null,null,"Miami-Dade County, FL",true,true,true]
[null,20230426145342,{"$f":"ROW()","v":2482},"VULCAN INDUSTRIAL SUPPLY INC",null,null,"Lead",null,null,null,null,null,null,null,null,null,null,null,"Jefferson County, AL",true,true,true]
[null,20230426145343,{"$f":"ROW()","v":2483},"W C Jennings Company Inc",null,null,"Lead",null,null,null,null,null,null,null,null,null,null,null,"Horry County, SC",true,true,true]
[null,20230426145344,{"$f":"ROW()","v":2484},"W2M LLC",null,null,"Lead",null,null,null,null,null,null,null,null,null,null,null,"Houston County, AL",true,true,true]
[null,20230426145345,{"$f":"ROW()","v":2485},"Wade Excavating and Contracting Inc",null,null,"Lead",null,null,null,null,null,null,null,null,null,null,null,"Madison County, AL",true,true,true]
[null,20230426145346,{"$f":"ROW()","v":2486},"WAGES JODY JOSEPH",null,null,"Lead",null,null,null,null,null,null,null,null,null,null,null,"Rankin County, MS",true,true,true]
[null,20230426145347,{"$f":"ROW()","v":2487},"WAGGENER CHARLES JR",null,null,"Lead",null,null,null,null,null,null,null,null,null,null,null,"Jefferson County, AL",true,true,true]
[null,20230426145348,{"$f":"ROW()","v":2488},"WALKER JASON K ",null,null,"Lead",null,null,null,null,null,null,null,null,null,null,null,"Montgomery County, OH",true,true,true]
[null,20230426145349,{"$f":"ROW()","v":2489},"WALKER M L",null,null,"Lead",null,null,null,null,null,null,null,null,null,null,null,"Rankin County, MS",true,true,true]
[null,20230426145350,{"$f":"ROW()","v":2490},"Walker V LLC Rj ",null,null,"Lead",null,null,null,null,null,null,null,null,null,null,null,"Charleston County, SC",true,true,true]
[null,20230426145351,{"$f":"ROW()","v":2491},"WALKER WILLIAM",null,null,"Lead",null,null,null,null,null,null,null,null,null,null,null,"Cuyahoga County, OH",true,true,true]
[null,20230426145352,{"$f":"ROW()","v":2492},"Walter Carla Lucy ",null,null,"Lead",null,null,null,null,"(313) 863-3982","(313) 207-7055",null,"15473 Mendota St","Detroit   ","MI",48238,null,true,false,false]
[null,20230426145353,{"$f":"ROW()","v":2493},"Walter Simmons ",null,null,"Lead",null,null,null,null,null,null,null,null,null,null,null,"Oakland County, MI",true,true,true]
[null,20230426145354,{"$f":"ROW()","v":2494},"Walter Zuniga ",null,null,"Lead",null,null,null,null,null,null,null,null,null,null,null,"Cook County, IL",true,true,true]
[null,20230426145355,{"$f":"ROW()","v":2495},"WALTERS BUILDING CO LLC",null,null,"Lead",null,null,null,null,null,null,null,null,null,null,null,"Summit County, OH",true,true,true]
[null,20230426145356,{"$f":"ROW()","v":2496},"WALTERS REBECCA",null,null,"Lead",null,null,null,null,null,null,null,null,null,null,null,"Wetzel County, WV",true,true,true]
[null,20230426145357,{"$f":"ROW()","v":2497},"WALTERS ROBERT",null,null,"Lead",null,null,null,null,null,null,null,null,null,null,null,"Wetzel County, WV",true,true,true]
[null,20230426145358,{"$f":"ROW()","v":2498},"WALTON ARNETT L",null,null,"Lead",null,null,null,null,null,null,null,null,null,null,null,"Cuyahoga County, OH",true,true,true]
[null,20230426145359,{"$f":"ROW()","v":2499},"Wanda Cushinberry",null,null,"Lead","MailList15","wfarmer@adasmckinley.org","iwfarmern40@adasmckinley.org","lowfarmer66@adasmckinley.org","(773) 842-2658","(773) 224-7937","(773) 417-2061","1224 N East Ave","Oak Park","IL",60302,"Cook County, IL",false,false,false]
[null,20230426145360,{"$f":"ROW()","v":2500},"Wanda Cushinberry ",null,null,"Lead",null,null,null,null,null,null,null,null,null,null,null,"Cook County, IL",true,true,true]
[null,20230426145361,{"$f":"ROW()","v":2501},"WARE DARLENE BRITTON",null,null,"Lead",null,null,null,null,null,null,null,null,null,null,null,"Cuyahoga County, OH",true,true,true]
[null,20230426145362,{"$f":"ROW()","v":2502},"Warner Merrill ",null,null,"Lead",null,null,null,null,null,null,null,null,null,null,null,"Mobile County, AL",true,true,true]
[null,20230426145363,{"$f":"ROW()","v":2503},"Warrior River Truck Parts","",null,"Lead",null,null,null,null,null,null,null,"","","","","Lee County, MS",true,true,true]
[null,20230426145364,{"$f":"ROW()","v":2504},"Washer Alan J",null,null,"Lead",null,null,null,null,null,null,null,null,null,null,null,"Cook County, IL",true,true,true]
[null,20230426145365,{"$f":"ROW()","v":2505},"WATKINS, JOHN",null,null,"Lead",null,null,null,null,null,null,null,null,null,null,null,"Summit County, OH",true,true,true]
[null,20230426145366,{"$f":"ROW()","v":2506},"WAXMAN GARY",null,null,"Lead",null,null,null,null,null,null,null,null,null,null,null,"Cuyahoga County, OH",true,true,true]
[null,20230426145367,{"$f":"ROW()","v":2507},"Wayne B Wilson ",null,null,"Lead",null,null,null,null,null,null,null,null,null,null,null,"Charleston County, SC",true,true,true]
[null,20230426145368,{"$f":"ROW()","v":2508},"WBD REALTY LLC",null,null,"Lead",null,null,null,null,null,null,null,null,null,null,null,"Jefferson County, AL",true,true,true]
[null,20230426145369,{"$f":"ROW()","v":2509},"WC FENCE INC",null,null,"Lead",null,null,null,null,null,null,null,null,null,null,null,"Wood County, WV",true,true,true]
[null,20230426145370,{"$f":"ROW()","v":2510},"WEIL THOMAN MOVING AND STORAGE CO",null,null,"Lead",null,null,null,null,null,null,null,null,null,null,null,"Hamilton County, OH",true,true,true]
[null,20230426145371,{"$f":"ROW()","v":2511},"Wells Tequisha",null,null,"Lead",null,null,null,null,null,null,null,null,null,null,null,"Franklin County, OH",true,true,true]
[null,20230426145372,{"$f":"ROW()","v":2512},"Wendell Acevedo ",null,null,"Lead",null,null,null,null,null,null,null,null,null,null,null,"Cobb County, GA",true,true,true]
[null,20230426145373,{"$f":"ROW()","v":2513},"Wendi Napieraj ",null,null,"Lead",null,null,null,null,null,null,null,null,null,null,null,"Oakland County, MI",true,true,true]
[null,20230426145374,{"$f":"ROW()","v":2514},"Wendy Bell ",null,null,"Lead",null,null,null,null,null,null,null,null,null,null,null,"Miami-Dade County, FL",true,true,true]
[null,20230426145376,{"$f":"ROW()","v":2515},"WERTZ JAMES R",null,null,"Lead",null,null,null,null,null,null,null,null,null,null,null,"Butler County, OH",true,true,true]
[null,20230426145377,{"$f":"ROW()","v":2516},"WEST SIDE SUBS LLC",null,null,"Lead",null,null,null,null,null,null,null,null,null,null,null,"Hamilton County, OH",true,true,true]
[null,20230426145378,{"$f":"ROW()","v":2517},"WESTLAKE KATHLEEN B",null,null,"Lead",null,null,null,null,null,null,null,null,null,null,null,"Cuyahoga County, OH",true,true,true]
[null,20230426145379,{"$f":"ROW()","v":2518},"Whet Your Palette Llc","Judith Kennedy Zinner",null,"Lead",null,"jkzinner@gmail.com","bigtimk@yahoo.com","anchorage@whetyourpalette.com","(502) 554-0545","(502) 742-6892","(502) 438-8865","1415 Evergreen Rd","Louisville","KY","40223-1470","Jefferson County, KY",false,false,false]
[null,20230426145380,{"$f":"ROW()","v":2519},"WHISTLE STOP CAFE",null,null,"Lead",null,null,null,null,null,null,null,null,null,null,null,"Harrison County, MS",true,true,true]
[null,20230426145381,{"$f":"ROW()","v":2520},"White Glove Executive Services Inc",null,null,"Lead",null,null,null,null,null,null,null,null,null,null,null,"Franklin County, OH",true,true,true]
[null,20230426145382,{"$f":"ROW()","v":2521},"WHITE SHALANDRIA S",null,null,"Lead",null,null,null,null,null,null,null,null,null,null,null,"Jefferson County, AL",true,true,true]
[null,20230426145383,{"$f":"ROW()","v":2522},"WHITEHEAD SAMUEL L",null,null,"Lead",null,null,null,null,null,null,null,null,null,null,null,"Madison County, MS",true,true,true]
[null,20230426145384,{"$f":"ROW()","v":2523},"Whitman Kam ",null,null,"Lead",null,null,null,null,null,null,null,null,null,null,null,"Cook County, IL",true,true,true]
[null,20230426145385,{"$f":"ROW()","v":2524},"WIGAL BUILDERS LLC",null,null,"Lead",null,null,null,null,null,null,null,null,null,null,null,"Wood County, WV",true,true,true]
[null,20230426145386,{"$f":"ROW()","v":2525},"WIGGINS, CRAIG",null,null,"Lead",null,null,null,null,null,null,null,null,null,null,null,"Summit County, OH",true,true,true]
[null,20230426145387,{"$f":"ROW()","v":2526},"Wilgens Saintvil ",null,null,"Lead",null,null,null,null,null,null,null,null,null,null,null,"Broward County, FL",true,true,true]
[null,20230426145388,{"$f":"ROW()","v":2527},"Wilkins Fitness Equipment Al",null,null,"Lead",null,null,null,null,null,null,null,null,null,null,null,"Charleston County, SC",true,true,true]
[null,20230426145389,{"$f":"ROW()","v":2528},"WILKINSON LEON ",null,null,"Lead",null,null,null,null,null,null,null,null,null,null,null,"Montgomery County, OH",true,true,true]
[null,20230426145390,{"$f":"ROW()","v":2529},"Will D Berrian ",null,null,"Lead",null,null,null,null,null,null,null,null,null,null,null,"Cobb County, GA",true,true,true]
[null,20230426145391,{"$f":"ROW()","v":2530},"Will Jr Watkins ",null,null,"Lead",null,null,null,null,null,null,null,null,null,null,null,"Genesee County, MI",true,true,true]
[null,20230426145392,{"$f":"ROW()","v":2531},"Will L and Wanda L Timmons","",null,"Lead",null,"wwbjt4@bellsouth.net","willtimmons@address.com","wlt2change@aol.com","(901) 753-4869","(901) 409-5154","(901) 489-6385","7454 Kylan Dr","Memphis","TN","38125-4323",null,false,false,false]
[null,20230426145393,{"$f":"ROW()","v":2532},"WILL REPAIR INC",null,null,"Lead",null,null,null,null,null,null,null,null,null,null,null,"Cuyahoga County, OH",true,true,true]
[null,20230426145394,{"$f":"ROW()","v":2533},"Willaim W Alcorn ",null,null,"Lead",null,null,null,null,null,null,null,null,null,null,null,"Cook County, IL",true,true,true]
[null,20230426145395,{"$f":"ROW()","v":2534},"William and Janice Mitchell","","","Lead",null,"baw2003@earthlink.net","bkwilliams84@sbcglobal.net","bearlyhere2016@yahoo.com","(281) 608-3132","(901) 523-0417","(312) 913-1920","4972 Le Chateau Cv","Memphis","TN","38125-3910",null,false,false,false]
[null,20230426145396,{"$f":"ROW()","v":2535},"William A Chavez ",null,null,"Lead",null,null,null,null,null,null,null,null,null,null,null,"Miami-Dade County, FL",true,true,true]
[null,20230426145398,{"$f":"ROW()","v":2536},"William A Helms ",null,null,"Lead",null,"whelms@gmail.com","classiccarpetman@aol.com","classiccarpetman1@gmail.com","(502) 245-6969","(502) 933-3716","(502) 536-0247","8707 Cottingham Way","Louisville","KY",40258,"Jefferson County, KY",false,false,false]
[null,20230426145399,{"$f":"ROW()","v":2537},"William C Henry ",null,null,"Lead",null,null,null,null,null,null,null,null,null,null,null,"Oakland County, MI",true,true,true]
[null,20230426145400,{"$f":"ROW()","v":2538},"William Copeland",null,null,"Lead",null,null,null,null,null,null,null,null,null,null,null,"DeSoto County, MS",true,true,true]
[null,20230426145401,{"$f":"ROW()","v":2539},"William G Young ",null,null,"Lead",null,null,null,null,null,null,null,null,null,null,null,"Cook County, IL",true,true,true]
[null,20230426145402,{"$f":"ROW()","v":2540},"William Iv Wallace ",null,null,"Lead",null,null,null,null,null,null,null,null,null,null,null,"Broward County, FL",true,true,true]
[null,20230426145403,{"$f":"ROW()","v":2541},"William J Motley ",null,null,"Lead",null,null,null,null,null,null,null,null,null,null,null,"Cook County, IL",true,true,true]
[null,20230426145404,{"$f":"ROW()","v":2542},"William Joseph Platt Sr",null,null,"Lead",null,"bplatt@accessgroupchicago.com","plattdds@aol.com","billchic01@aol.com","(773) 929-7320","(773) 401-2321","(773) 325-2406",null,"Chicago","IL",60613,"Cook County, IL",false,false,false]
[null,20230426145405,{"$f":"ROW()","v":2543},"William K Wood",null,null,"Lead",null,null,null,null,null,null,null,null,null,null,null,"Baldwin County, AL",true,true,true]
[null,20230426145406,{"$f":"ROW()","v":2544},"William L White ",null,null,"Lead",null,"wwhite1944@gmail.com","wwhi326575@address.com","wwhite1944@gmail.com","(502) 649-1944","(502) 722-5596","(502) 554-7822","6406 Harrogate Rd","Louisville","KY",40229,"Jefferson County, KY",false,false,false]
[null,20230426145407,{"$f":"ROW()","v":2545},"William R Delay ",null,null,"Lead",null,null,null,null,null,null,null,null,null,null,null,"Cobb County, GA",true,true,true]
[null,20230426145408,{"$f":"ROW()","v":2546},"William T Noonan ",null,null,"Lead",null,"willytapba@outlook.com","williamnoonan1954@gmail.com",null,"(502) 216-5753","(502) 396-3120","(502) 962-8787","5009 E Manslick Rd","Louisville","KY",40219,null,false,false,false]
[null,20230426145409,{"$f":"ROW()","v":2547},"William V Sylvester ",null,null,"Lead",null,null,null,null,null,null,null,null,null,null,null,"Sussex County, NJ",true,true,true]
[null,20230426145410,{"$f":"ROW()","v":2548},"William W Alcorn ",null,null,"Lead",null,"aalcorn@msn.com","wrightalcorn@mindspring.com",null,"(864) 944-1313","(404) 303-7521","(770) 303-7521","188 W Randolph St #4101","Chicago","IL",60601,"Cook County, IL",false,false,false]
[null,20230426145411,{"$f":"ROW()","v":2549},"WILLIAMS CHRISTEN",null,null,"Lead",null,null,null,null,null,null,null,null,null,null,null,"Jefferson County, AL",true,true,true]
[null,20230426145412,{"$f":"ROW()","v":2550},"WILLIAMS CORTICIA S",null,null,"Lead",null,null,null,null,null,null,null,null,null,null,null,"Jefferson County, AL",true,true,true]
[null,20230426145413,{"$f":"ROW()","v":2551},"WILLIAMS DELIVERY SERVICE INC",null,null,"Lead",null,null,null,null,null,null,null,null,null,null,null,"Madison County, MS",true,true,true]
[null,20230426145414,{"$f":"ROW()","v":2552},"WILLIAMS FREDERICK",null,null,"Lead",null,null,null,null,null,null,null,null,null,null,null,"Butler County, OH",true,true,true]
[null,20230426145415,{"$f":"ROW()","v":2553},"WILLIAMS GAYLE",null,null,"Lead",null,null,null,null,null,null,null,null,null,null,null,"Cuyahoga County, OH",true,true,true]
[null,20230426145416,{"$f":"ROW()","v":2554},"WILLIAMS NIKITA D",null,null,"Lead",null,null,null,null,null,null,null,null,null,null,null,"Jefferson County, AL",true,true,true]
[null,20230426145417,{"$f":"ROW()","v":2555},"WILLIAMS QUINCY T",null,null,"Lead",null,null,null,null,null,null,null,null,null,null,null,"Jefferson County, AL",true,true,true]
[null,20230426145418,{"$f":"ROW()","v":2556},"WILLIAMS RONALD JR",null,null,"Lead",null,null,null,null,null,null,null,null,null,null,null,"Jefferson County, AL",true,true,true]
[null,20230426145419,{"$f":"ROW()","v":2557},"Williamsburg Mailing Services, Inc","","6721 2018 & 01 201909, 202106 $63,735.40","Lead",null,null,null,null,"(865) 380-5402",null,null,"PO Box 6617","Maryville","TN",37802,null,true,false,false]
[null,20230426145420,{"$f":"ROW()","v":2558},"Willie C Riley ",null,null,"Lead",null,"wriley@safety-kleen.com","lovehappinessfestiveness@yahoo.com","macamacho@hotmail.com","(616) 862-5996","(231) 760-4024","(231) 788-0720","706 Purdue Rd","Corpus Christi","TX",78418,"Wayne County, MI",false,false,false]
[null,20230426145421,{"$f":"ROW()","v":2559},"Willie D Taylor ",null,null,"Lead",null,null,null,null,null,null,null,null,null,null,null,"Cobb County, GA",true,true,true]
[null,20230426145422,{"$f":"ROW()","v":2560},"Willie H Stringer ",null,null,"Lead",null,null,null,null,null,null,null,null,null,null,null,"Rockdale County, GA",true,true,true]
[null,20230426145423,{"$f":"ROW()","v":2561},"Willie L Parker","","","Lead",null,"bobby_parker58@yahoo.com","cootie2cutie@yahoo.com","williep866@gmail.com","(901) 481-7827","(708) 527-9659","(901) 321-5230","4071 Timberwood Dr","Memphis","TN","38128-3124",null,false,false,false]
[null,20230426145424,{"$f":"ROW()","v":2562},"WILLIE LIGHTON",null,null,"Lead",null,null,null,null,null,null,null,null,null,null,null,"Lucas County, OH",true,true,true]
[null,20230426145425,{"$f":"ROW()","v":2563},"WILSON DONITA R",null,null,"Lead",null,null,null,null,null,null,null,null,null,null,null,"Jefferson County, AL",true,true,true]
[null,20230426145426,{"$f":"ROW()","v":2564},"WILSON FEED MILL INC",null,null,"Lead",null,null,null,null,null,null,null,null,null,null,null,"Cuyahoga County, OH",true,true,true]
[null,20230426145427,{"$f":"ROW()","v":2565},"Winchester Construction Services Llc",null,null,"Lead",null,null,null,null,null,null,null,null,null,null,null,"Franklin County, OH",true,true,true]
[null,20230426145428,{"$f":"ROW()","v":2566},"WINES LLC",null,null,"Lead",null,null,null,null,null,null,null,null,null,null,null,"Cuyahoga County, OH",true,true,true]
[null,20230426145429,{"$f":"ROW()","v":2567},"WINNING TOM ",null,null,"Lead",null,null,null,null,null,null,null,null,null,null,null,"Montgomery County, OH",true,true,true]
[null,20230426145430,{"$f":"ROW()","v":2568},"Winston Automotive Parts and Supples Inc","",null,"Lead",null,null,null,null,"","","","Po Box 1208","Double Sprgs","AL","35553-1208",null,true,true,false]
[null,20230426145431,{"$f":"ROW()","v":2569},"Wireless Solutions Able ",null,null,"Lead",null,null,null,null,null,null,null,null,null,null,null,"Cullman County, AL",true,true,true]
[null,20230426145432,{"$f":"ROW()","v":2570},"WITHERSPOON CAMERON J",null,null,"Lead",null,null,null,null,null,null,null,null,null,null,null,"Jefferson County, AL",true,true,true]
[null,20230426145433,{"$f":"ROW()","v":2571},"Wolverine Sports And Conservation Club",null,null,"Lead",null,null,null,null,"(248) 478-2464",null,null,"27531 Grand River Ave","Livonia","MI",48152,"Wayne County, MI",true,false,false]
[null,20230426145434,{"$f":"ROW()","v":2572},"Wood Anita J",null,null,"Lead",null,null,null,null,null,null,null,null,null,null,null,"Franklin County, OH",true,true,true]
[null,20230426145435,{"$f":"ROW()","v":2573},"Wood-Chuck Workshop Inc",null,null,"Lead",null,null,null,null,null,null,null,null,null,null,null,"Broward County, FL",true,true,true]
[null,20230426145436,{"$f":"ROW()","v":2574},"WOODS PAUL D",null,null,"Lead",null,null,null,null,null,null,null,null,null,null,null,"Jefferson County, AL",true,true,true]
[null,20230426145437,{"$f":"ROW()","v":2575},"WORLDPAY ECOMMERCE LLC",null,null,"Lead",null,null,null,null,null,null,null,null,null,null,null,"Hamilton County, OH",true,true,true]
[null,20230426145438,{"$f":"ROW()","v":2576},"Wrest 45 Fl Broward Blvd LLC",null,null,"Lead",null,null,null,null,null,null,null,null,null,null,null,"Broward County, FL",true,true,true]
[null,20230426145439,{"$f":"ROW()","v":2577},"WRIGHT BRADLEY",null,null,"Lead",null,null,null,null,null,null,null,null,null,null,null,"Cuyahoga County, OH",true,true,true]
[null,20230426145440,{"$f":"ROW()","v":2578},"WRIGHT DEBRA L ",null,null,"Lead",null,null,null,null,null,null,null,null,null,null,null,"Montgomery County, OH",true,true,true]
[null,20230426145441,{"$f":"ROW()","v":2579},"Wright Management Of Horry County Inc",null,null,"Lead",null,null,null,null,null,null,null,null,null,null,null,"Horry County, SC",true,true,true]
[null,20230426145442,{"$f":"ROW()","v":2580},"WRIGHT MARCIA R",null,null,"Lead",null,null,null,null,null,null,null,null,null,null,null,"Jefferson County, AL",true,true,true]
[null,20230426145443,{"$f":"ROW()","v":2581},"WRING, MARVELL M",null,null,"Lead",null,null,null,null,null,null,null,null,null,null,null,"Summit County, OH",true,true,true]
[null,20230426145444,{"$f":"ROW()","v":2582},"WVNH EMP LLC",null,null,"Lead",null,null,null,null,null,null,null,null,null,null,null,"Hamilton County, OH",true,true,true]
[null,20230426145445,{"$f":"ROW()","v":2583},"YARBOUGH ROBERT III",null,null,"Lead",null,null,null,null,null,null,null,null,null,null,null,"Cuyahoga County, OH",true,true,true]
[null,20230426145446,{"$f":"ROW()","v":2584},"Yarbrough AFCI, Inc","Virgil Yarbrough",null,"Lead",null,"vyarbrough123@yahoo.com","virgilyarbrough123@gmail.com",null,"(313) 246-9164","(313) 898-0388",null,"5557 Allendale","Detroit","MI",48204,"Wayne County, MI",false,false,false]
[null,20230426145447,{"$f":"ROW()","v":2585},"Yarbrough Better Living Center Inc","Virgil Yarbrough",null,"Lead",null,"vyarbrough123@yahoo.com","virgilyarbrough123@gmail.com",null,"(313) 383-6385","(313) 610-6578","(313) 533-4250","3766 14th Street","Ecorse","MI",48229,"Wayne County, MI",false,false,false]
[null,20230426145448,{"$f":"ROW()","v":2586},"Yishmael Y El ",null,null,"Lead",null,null,null,null,null,null,null,null,null,null,null,"Cobb County, GA",true,true,true]
[null,20230426145449,{"$f":"ROW()","v":2587},"Yoshi Matthews","","Deceased","Lead",null,"ymatthews2@ix.netcom.com",null,null,"(303) 412-7732",null,null,"111 S Highland St","Memphis","TN",38111,null,false,false,false]
[null,20230426145450,{"$f":"ROW()","v":2588},"Youlonda Hunter ",null,null,"Lead",null,"youlondagreen@yahoo.com",null,null,"(803) 463-5235","(803) 929-1421","(803) 542-7077","208 Oakturn Ln","Gaston","SC",29053,"Lexington County, SC",false,false,false]
[null,20230426145451,{"$f":"ROW()","v":2589},"YOUNCE HERLEAN C  ",null,null,"Lead",null,null,null,null,null,null,null,null,null,null,null,"Butler County, OH",true,true,true]
[null,20230426145452,{"$f":"ROW()","v":2590},"Yusuf Hassan",null,null,"Lead",null,null,null,null,null,null,null,null,null,null,null,"Franklin County, OH",true,true,true]
[null,20230426145453,{"$f":"ROW()","v":2591},"Yusuf Sr Wilkins ",null,null,"Lead",null,null,null,null,null,null,null,null,null,null,null,"Charleston County, SC",true,true,true]
[null,20230426145454,{"$f":"ROW()","v":2592},"Yvonne J Fiedor ",null,null,"Lead",null,null,null,null,null,null,null,null,null,null,null,"Cook County, IL",true,true,true]
[null,20230426145455,{"$f":"ROW()","v":2593},"Zachery Hall","",null,"Lead",null,"zjhall92@gmail.com","","","(662) 489-5006","(662) 489-1995","(662) 378-3292","1859 Horseshoe Bnd","Pontotoc","MS","38863","Lee County, MS",false,false,false]
[null,20230426145456,{"$f":"ROW()","v":2594},"Zamor Jenny",null,null,"Lead",null,null,null,null,null,null,null,null,null,null,null,"Franklin County, OH",true,true,true]
[null,20230426145457,{"$f":"ROW()","v":2595},"ZAREMBA DAVID",null,null,"Lead",null,null,null,null,null,null,null,null,null,null,null,"Cuyahoga County, OH",true,true,true]
[null,20230426145458,{"$f":"ROW()","v":2596},"ZGA Aircraft Parts Inc",null,null,"Lead",null,null,null,null,null,null,null,null,null,null,null,"Miami-Dade County, FL",true,true,true]
[null,20230426145459,{"$f":"ROW()","v":2597},"Zia Marias Inc",null,null,"Lead",null,null,null,null,null,null,null,null,null,null,null,"Horry County, SC",true,true,true]
[null,20230426145460,{"$f":"ROW()","v":2598},"Zoladz Martin",null,null,"Lead",null,null,null,null,null,null,null,null,null,null,null,"Cook County, IL",true,true,true]
[null,20230426145461,{"$f":"ROW()","v":2599},"Zorba Georgia",null,null,"Lead",null,null,null,null,null,null,null,null,null,null,null,"Cook County, IL",true,true,true]
[null,20230426145462,{"$f":"ROW()","v":2600},"Zuniga Walter",null,null,"Lead",null,null,null,null,null,null,null,null,null,null,null,"Cook County, IL",true,true,true]
[null,20230509154031,{"$f":"ROW()","v":2601},"Brian Vance","Tina A Vance",null,null,null,null,null,null,null,null,null,"5525 Old Dayton Pike","Chattanooga","TN",37415,"Hamilton County, TN"]
[null,20230427142148,{"$f":"ROW()","v":2602},"Kenneth G Goodhue","Marjorie N Goodhue",null,"Lead","Called","ken@kbtech.com","","","(423) 488-5193","(423) 886-1045","(423) 266-6969","1112 Constitution Dr","Chattanooga","TN","37405","",false,null,false]
[null,20230427145046,{"$f":"ROW()","v":2603},"Brigitta C Parker","",null,"Lead",null,"jauteri@aol.com","","","(707) 481-2911","(707) 823-6214","(707) 792-2876","6148 Blue Ash Dr","Ooltewah","TN",37363,"Hamilton County, TN",false,false,false]
[null,20230427143753,{"$f":"ROW()","v":2604},"Brown Truck and Equipment Sales LLC","Charles V Brown",null,"Lead",null,"carolweir12@gmail.com","","","(866) 724-2965","(423) 305-1261","(423) 654-3446","2075 Turnberry Cir","Hixson","TN",37343,"Hamilton County, TN",false,false,false]
[null,20230427145820,{"$f":"ROW()","v":2605},"Bryan A Vance","Tina A Vance",null,"Lead",null,"bvdisc@gmail.com","tina-vance@hotmail.com","","(423) 645-9104","(423) 315-3483","(423) 756-8283","5525 Old Dayton Pike","Chattanooga","TN",37415,"Hamilton County, TN",false,false,false]
[null,20230427145339,{"$f":"ROW()","v":2606},"Charles W Willoughby","Jennifer R Willoughby",null,"Lead",null,"willoughby_charles@yahoo.com","jrwcww17@aol.com","","(423) 619-3156","(423) 961-2620",null,"12136 Dolly Pond Rd","Birchwood","TN",37308,"Hamilton County, TN",false,false,false]
[null,20230427144225,{"$f":"ROW()","v":2607},"Chattanooga Hardwood Center","Amy Adams",null,"Lead","Called","amy@chattanoogahardwood.com","","","(423) 624-0000",null,null,"2420 E Main St","Chattanooga","TN",37404,"Hamilton County, TN",false,false,false]
[null,20230427142019,{"$f":"ROW()","v":2608},"Christy Jones","",null,"Lead","Called","meber2000@aol.com","","","(423) 580-9474","(423) 580-6377","(423) 870-8243","PO Box 21205","Chattanooga","TN","37424","Hamilton County, TN",false,null,false]
[null,20230427143011,{"$f":"ROW()","v":2609},"Corey A Spearman","",null,"Lead","Called","","","","(312) 709-4588","(423) 475-1613","(423) 693-6313","870 Vine St Apt 64","Chattanooga","TN",37403,"Hamilton County, TN",true,false,false]
[null,20230427144557,{"$f":"ROW()","v":2610},"Curt G Zacharias","Mary E Zacharias",null,"Lead",null,"annuitydoctor@aol.com","zach6725@aol.com","zach6725@adelphia.com","(520) 990-0009","(520) 296-2057","(423) 305-1997","1601 Vance Ave","Chattanooga","TN",37404,"Hamilton County, TN",false,false,false]
[null,20230427144830,{"$f":"ROW()","v":2611},"David Fontenot","Laura Milliken",null,"Lead",null,"david_j_fontenot@yahoo.com","davidafontenot@gmail.com","rrdavenport2004@yahoo.com","(423) 227-3088","(706) 861-3874","(865) 584-6772","1492 Sinclair Ave","Chattanooga","TN",37408,"Hamilton County, TN",false,false,false]
[null,20230427145049,{"$f":"ROW()","v":2612},"David T Brockman","Virginia F Brockman",null,"Lead",null,"dave@dvstn.com","dns-admin@dvstn.com","dvssolutions@mindspring.com","(423) 899-2680","(770) 271-4930","(423) 296-1019","2024 Avalon Ave","Chattanooga","TN",37415,"Hamilton County, TN",false,false,false]
[null,20230427150232,{"$f":"ROW()","v":2613},"Edgar L Cagle","",null,"Lead",null,"edgar.cagle@email.com","nancyelaine01@aol.com","","(423) 499-5051","(423) 894-0313","(423) 488-1020","6317 Hamilton Island Rd","Harrison","TN",37341,"Hamilton County, TN",false,false,false]
[null,20230427150445,{"$f":"ROW()","v":2614},"Edward E West","","Left message","Lead",null,"","","","(423) 320-7139","(423) 847-9008","(423) 843-1258","8801 Sage Grass Ln","Soddy Daisy","TN",37379,"Hamilton County, TN",true,false,false]
[null,20230427150350,{"$f":"ROW()","v":2615},"Elenora Woods","",null,"Lead",null,"","","",null,null,null,"4929 Hampshire PL","Hixson","TN","37343","Hamilton County, TN",true,null,false]
[null,20230427143240,{"$f":"ROW()","v":2616},"Geoff Ramsey","",null,"Lead",null,"geofframsey@comcast.net","gloriazimmerman@gmail.com","","(423) 227-5564","(405) 844-0540","(423) 892-7048","9621 Pexan Springs Cir","Chattanooga","TN",37421,"Hamilton County, TN",false,false,false]
[null,20230509145625,{"$f":"ROW()","v":2617},"Hamilton County Register of Deeds",null,null,"Vendor",null,null,null,null,"(423) 209-6560",null,null,"625 Georgia Avenue","Chattanooga","TN",37402,"Hamilton County, TN"]
[null,20230427144728,{"$f":"ROW()","v":2618},"Jackiya D Ford","Nubian Newz",null,"Lead",null,"jackiya4justice@gmail.com","mcjala@yahoo.com","zvjackiyaford@yahoo.com","(310) 674-5475","(310) 263-1781","(773) 952-2294","2288 Gunbarrel Road 154 146","Chattanooga","TN",37421,"Hamilton County, TN",false,false,false]
[null,20230427143919,{"$f":"ROW()","v":2619},"Jerry Wilkerson","",null,"Lead",null,"wwilkerson1414@gmail.com","wwilkerson14@comcast.net","","(423) 314-5702","(423) 596-1342","(423) 842-3186","8970 Sandusky Ave S","Jacksonville","FL",32216,"Hamilton County, TN",false,false,false]
[null,20230427144455,{"$f":"ROW()","v":2620},"Kimberly Donah","",null,"Lead",null,"","","","(423) 667-6794","(423) 877-3943","(423) 510-9628","4312 Lakeshore Ln Unit 302","Chattanooga","TN",37415,"Hamilton County, TN",true,false,false]
[null,20230427145450,{"$f":"ROW()","v":2621},"Mark R Dwyer","Walden Plumbing Company",null,"Lead",null,"meghandwyer3@gmail.com","alizeyoung15@gmail.com","sixinabarn@aol.com","(423) 255-0044","(423) 886-2973","(901) 864-1430","4712 Wilson Ave","Signal Mountain","TN",37377,"Hamilton County, TN",false,false,false]
[null,20230509153907,{"$f":"ROW()","v":2622},"Maurice N Saliba",null,null,null,null,null,null,null,null,null,null,"6401 Brookmead Cir","Hixson","TN",37343,"Hamilton County, TN"]
[null,20230427143351,{"$f":"ROW()","v":2623},"Melvin R Standefer","Kimberly D Standefer",null,"Lead",null,"kimstandefer@yahoo.com","robbystandefer@yahoo.com","rstandefer55@gmail.com","(423) 240-7229","(423) 702-5541","(423) 802-5143","5714 James Cir","Hixson","TN",37343,"Hamilton County, TN",false,false,false]
[null,20230427145725,{"$f":"ROW()","v":2624},"Motion View Software LLC","Dan Knoch",null,"Lead",null,"cbdan1964@gmail.com","dansmith7771@yahoo.com","dan@inn-soft.com","(423) 400-0500","(423) 847-1795","(423) 847-3735","5393 Wilbanks Dr","Hixson","TN",37343,"Hamilton County, TN",false,false,false]
[null,20230427143126,{"$f":"ROW()","v":2625},"Nichole E Boaz DDS PC","",null,"Lead",null,"","","",null,null,null,"5805 Lee Hwy","Chattanooga","TN",37421,"Hamilton County, TN",true,true,false]
[null,20230427150558,{"$f":"ROW()","v":2626},"Robert L Pragnell","","Attempted, no good phones","Lead",null,"robert.pragnell@lpl.com","yukonrp@aol.com","roberts.ataliyah@gmail.com","(423) 875-4964","(423) 874-0885","(423) 475-6137","507 Heartheron Ln","Hixson","TN",37343,"Hamilton County, TN",false,false,false]
[null,20230427142619,{"$f":"ROW()","v":2627},"Rush E Simonson","",null,"Lead","Called","ihozzy.diorush@gmail.com","rush.darthmaul@gmail.com","rush@rushsimonson.com","(561) 818-0193","(813) 973-8753","(561) 744-0482","1629 Rustic Homes Ln","Signal Mountain","TN",37377,"Hamilton County, TN",false,false,false]
[null,20230427150747,{"$f":"ROW()","v":2628},"Shirley Diane Moore","","Already has representation","Lead",null,"shirley.moore@crye-leike.com","fitnalive@blackplanet.com","","(423) 838-9900","(423) 894-9908","(706) 375-6377","608 Calloway Ct","Chattanooga","TN",37421,"Hamilton County, TN",false,false,false]
[null,20230427143559,{"$f":"ROW()","v":2629},"Specialized Oxygen Services, LLC","Kim Standefer",null,"Lead",null,"kimstandefer@yahoo.com","","","(423) 847-0031",null,null,"1008 Executive Dr Ste 102","Hixzon","TN",37343,"Hamilton County, TN",false,false,false]
[null,20230427142341,{"$f":"ROW()","v":2630},"Sweet Melissas Billiards LLC","Melissa Smith, Douglas Smith",null,"Lead","Called","","","","(423) 803-6748",null,null,"1966 Northpoint Blvd Ste 126","Hixson","TN","37343","Hamilton County, TN",true,null,false]
[null,20230427150148,{"$f":"ROW()","v":2631},"Timothy J Crawford","",null,"Lead",null,"tjamescrawford@yahoo.com","timothy.crawford@gmail.com","","(423) 855-5400","(502) 618-0463","(423) 266-8788","4433 Webb Rd","Chattanooga","TN",37416,"Hamilton County, TN",false,false,false]
[null,261,{"$f":"ROW()","v":2632},"Adrienne Aust","Titan File",null,"Vendor",null,"aaust@titanfile.com",null,null,null,null,null,null,null,null,null,null,null,null,null,"Individual","Active","","D:\\Clients\\Adrienne Aust\\"]
[null,424,{"$f":"ROW()","v":2633},"Advanced Collision (Reddick)","Brent Morris",null,"Business",null,null,null,null,"(423) 499-1985","(423) 499-1997",null,null,null,null,null,null,null,null,null,"Business","Inactive","","D:\\Clients\\Advanced Collision (Reddick)\\"]
[null,425,{"$f":"ROW()","v":2634},"AFS Foundation & Waterproofing","David Majetich",null,"Business",null,"david.majetich@afsrepair.com",null,null,"(423) 599-6376",null,null,null,null,null,null,null,null,null,null,"Business","Inactive","","D:\\Clients\\AFS Foundation & Waterproofing\\"]
[null,262,{"$f":"ROW()","v":2635},"Alex Hulgan",null,null,"Personal",null,null,null,null,"(423) 827-2128",null,null,null,null,null,null,null,null,null,null,"Individual","Active","","D:\\Clients\\Alex Hulgan\\"]
[null,263,{"$f":"ROW()","v":2636},"Alex Richter","Marbella Construction",null,"Business",null,"a_e_richter@yahoo.com",null,null,4233309896,null,"(423) 490-0737","P.O. Box 318","Ooltewah","TN",37363,null,null,null,null,"Individual","Inactive","","D:\\Clients\\Alex Richter\\"]
[null,264,{"$f":"ROW()","v":2637},"Alexandra Krouse",null,null,"Personal",null,null,null,null,null,null,null,null,null,null,null,null,null,null,null,"Individual","Active","","D:\\Clients\\Alexandra Krouse\\"]
[null,265,{"$f":"ROW()","v":2638},"Alicia Brown","Internal Revenue Service",null,"IRS",null,null,null,null,null,null,null,null,null,null,null,null,null,null,null,"Individual","Inactive","","D:\\Clients\\Alicia Brown\\"]
[null,266,{"$f":"ROW()","v":2639},"Allen Sherwood",null,null,"Medical",null,null,null,null,"(423) 495-5951",null,null,"6401 Mountain View Dr","Ooltewah","TN",37363,null,null,null,null,"Individual","Active","","D:\\Clients\\Allen Sherwood\\"]
[null,427,{"$f":"ROW()","v":2640},"Allstate","Dorothy Grisham",null,"Business",null,"dleegrisham@allstate.com",null,null,"(423) 899-6161","(423) 855-0441",null,null,null,null,null,null,null,null,null,"Business","Active","","D:\\Clients\\Allstate\\"]
[null,267,{"$f":"ROW()","v":2641},"Alonzo Brown",null,null,"IRS",null,"alonzo.brown@irs.gov",null,null,"(615) 530-2512",null,null,null,null,null,null,null,null,null,null,"Individual","Active","","D:\\Clients\\Alonzo Brown\\"]
[null,268,{"$f":"ROW()","v":2642},"Amanda Wilder",null,null,"Personal",null,"a.nwilder@yahoo.com",null,null,"(256) 604-6506",null,null,null,null,null,null,null,null,null,null,"Individual","Active","","D:\\Clients\\Amanda Wilder\\"]
[null,269,{"$f":"ROW()","v":2643},"Andrew Kohls",null,null,"Personal",null,"andrewkohls@gmail.com",null,null,"(423) 653-5944",null,null,null,null,null,null,null,null,null,null,"Individual","Active","","D:\\Clients\\Andrew Kohls\\"]
[null,273,{"$f":"ROW()","v":2644},"Angela Lambert","Lambert's Southern Pies",null,"Client",null,null,null,null,8659819700,null,null,"PO Box 6775","Maryville","TN",37802,null,null,null,null,"Individual","Active","","D:\\Clients\\Angela Lambert\\"]
[null,275,{"$f":"ROW()","v":2645},"Ariadna Riba","Force Manager",null,"Vendor",null,"ariadna.riba@forcemanager.net",null,null,null,null,null,null,null,null,null,null,null,null,null,"Individual","Inactive","","D:\\Clients\\Ariadna Riba\\"]
[null,422,{"$f":"ROW()","v":2646},"Autumn Campbell","AllState",null,"Business",null,"acampbell10@allstate.com",null,null,null,null,null,null,null,null,null,null,null,null,null,"Individual","Inactive","","D:\\Clients\\Autumn Campbell\\"]
[null,277,{"$f":"ROW()","v":2647},"Barbara Humphries","Internal Revenue Service",null,"Government",null,"barbara.humphries@irs.gov",null,null,"(865) 243-0598","(865) 806-0662",null,null,null,null,null,null,null,null,null,"Individual","Active","","D:\\Clients\\Barbara Humphries\\"]
[null,429,{"$f":"ROW()","v":2648},"BCBS",null,null,"Medical",null,null,null,null,"(423) 463-7141","(423) 535-5707",null,null,null,null,null,null,null,null,null,"Business","Active","","D:\\Clients\\BCBS\\"]
[null,278,{"$f":"ROW()","v":2649},"Beatriz Jaramillo","Internal Revenue Service",null,"Government",null,"beatriz.e.jaramillo@irs.gov",null,null,"(423) 305-2280","(423) 421-5618",null,null,null,null,null,null,null,null,null,"Individual","Active","","D:\\Clients\\Beatriz Jaramillo\\"]
[null,280,{"$f":"ROW()","v":2650},"Beverly Calbert","Internal Revenue Service",null,"Government",null,null,null,null,null,null,null,null,null,null,null,null,null,null,null,"Individual","Inactive","","D:\\Clients\\Beverly Calbert\\"]
[null,449,{"$f":"ROW()","v":2651},"Bob Frost",null,null,"Business",null,"bfrost@frostcompany.net",null,null,"(423) 855-1438",null,null,null,null,null,null,null,null,null,null,"Business","Inactive","","D:\\Clients\\Bob Frost\\"]
[null,282,{"$f":"ROW()","v":2652},"Brad Steigerwalt",null,null,"Personal",null,null,null,null,null,null,null,null,null,null,null,null,null,null,null,"Individual","Inactive","","D:\\Clients\\Brad Steigerwalt\\"]
[null,430,{"$f":"ROW()","v":2653},"Brandon Rodriguez Heating & Air","Brandon Rodriguez",null,"Business",null,"brandon_rod86@yahoo.com",null,null,"(423) 596-5884",null,null,null,null,null,null,null,null,null,null,"Business","Inactive","","D:\\Clients\\Brandon Rodriguez Heating & Air\\"]
[null,285,{"$f":"ROW()","v":2654},"Brian Fain",null,null,"Business",null,null,null,null,null,"(423) 650-1245",null,null,null,null,null,null,null,null,null,"Individual","Active","","D:\\Clients\\Brian Fain\\"]
[null,286,{"$f":"ROW()","v":2655},"Brittney Holt",null,null,"Personal",null,"bleigh2520@yahoo.com",null,null,"(256) 714-0918",null,null,null,null,null,null,null,null,null,null,"Individual","Active","","D:\\Clients\\Brittney Holt\\"]
[null,431,{"$f":"ROW()","v":2656},"Brogan Heating & Air",null,null,"Business",null,null,null,null,"(423) 693-8873",null,null,null,null,null,null,null,null,null,null,"Business","Active","","D:\\Clients\\Brogan Heating & Air\\"]
[null,432,{"$f":"ROW()","v":2657},"Case Auto Repair",null,null,"Business",null,null,null,null,"(423) 559-7995",null,null,null,null,null,null,null,null,null,null,"Business","Active","","D:\\Clients\\Case Auto Repair\\"]
[null,288,{"$f":"ROW()","v":2658},"Catherine Martinez","CHI Memorial Lung Care Associates",null,"Medical",null,null,null,null,null,null,null,null,"Chattanooga","TN",37343,null,null,null,null,"Individual","Inactive","","D:\\Clients\\Catherine Martinez\\"]
[null,289,{"$f":"ROW()","v":2659},"Cathy & Ken Yeager",null,null,"Personal",null,"catyak@comcast.net",null,null,null,null,null,null,null,null,null,null,null,null,null,"Individual","Inactive","","D:\\Clients\\Cathy & Ken Yeager\\"]
[null,291,{"$f":"ROW()","v":2660},"Charlie Lambert","Lambert's Flooring, Inc.",null,"Client",null,"charlietlambert@icloud.com",null,null,"(865) 454-9025",null,null,"PO Box 6775","Maryville","TN",37802,null,null,null,null,"Individual","Active","","D:\\Clients\\Charlie Lambert\\"]
[null,433,{"$f":"ROW()","v":2661},"Chattanooga Heart Institute",null,null,"Medical",null,null,null,null,"(423) 697-2000",null,null,"2501 Citico Ave","Chattanooga","TN",37404,null,null,null,null,"Business","Active","","D:\\Clients\\Chattanooga Heart Institute\\"]
[null,434,{"$f":"ROW()","v":2662},"Chattanooga Property Management",null,null,"Business",null,null,null,null,"(706) 639-5808",null,null,null,null,null,null,null,null,null,null,"Business","Inactive","","D:\\Clients\\Chattanooga Property Management\\"]
[null,435,{"$f":"ROW()","v":2663},"Chattanooga Skin & Cancer Clinic",null,null,"Medical",null,null,null,null,"(423) 899-2700",null,null,null,null,null,null,null,null,null,null,"Business","Active","","D:\\Clients\\Chattanooga Skin & Cancer Clinic\\"]
[null,436,{"$f":"ROW()","v":2664},"CHI Memorial",null,null,"Medical",null,null,null,null,"(423) 899-2904",null,null,"Ste. 170 1238 Taft Hwy","Signal Mountain","TN",37377,null,null,null,null,"Business","Active","","D:\\Clients\\CHI Memorial\\"]
[null,437,{"$f":"ROW()","v":2665},"CHI Memorial Family Practice Associates",null,null,"Medical",null,null,null,null,"(423) 495-5951",null,null,"6401 Mountain View Dr","Ooltewah","TN",37363,null,null,null,null,"Business","Active","","D:\\Clients\\CHI Memorial Family Practice Associates\\"]
[null,438,{"$f":"ROW()","v":2666},"CHI Memorial Lung Care Associates",null,null,"Medical",null,null,null,null,"(423) 495-2635",null,null,"Ste 205 2051 Hamill Rd","Chattanooga","TN",37343,null,null,null,null,"Business","Active","","D:\\Clients\\CHI Memorial Lung Care Associates\\"]
[null,293,{"$f":"ROW()","v":2667},"Chris Collins",null,null,"Personal",null,"washiburr@gmail.com",null,null,"(423) 713-8380",null,null,"1420 Saint Michaels Way","Newport News","VA","23606-1994",null,null,null,null,"Individual","Active","","D:\\Clients\\Chris Collins\\"]
[null,295,{"$f":"ROW()","v":2668},"Clark Stelling",null,null,"Personal",null,"clarkstelling@comast.net",null,null,null,null,null,null,null,null,null,null,null,null,null,"Individual","Inactive","","D:\\Clients\\Clark Stelling\\"]
[null,296,{"$f":"ROW()","v":2669},"Claudia Kaminski",null,null,"Personal",null,null,null,null,null,null,null,null,null,null,null,null,null,null,null,"Individual","Active","","D:\\Clients\\Claudia Kaminski\\"]
[null,635,{"$f":"ROW()","v":2670},"College Hunks","Brett Collins",null,null,null,"brett.collins@chhj.com",null,null,"(888) 888-8888",null,"(770) 377-8510",null,null,null,null,null,null,null,null,null,"Active","","D:\\Clients\\College Hunks\\"]
[null,439,{"$f":"ROW()","v":2671},"Consultants in Pain Management",null,null,"Medical",null,"info@cpainman.org",null,null,"(423) 648-8480",null,null,null,null,null,null,null,null,null,null,"Business","Active","","D:\\Clients\\Consultants in Pain Management\\"]
[null,440,{"$f":"ROW()","v":2672},"Cooks Pest Control",null,null,"Business",null,null,null,null,null,null,null,null,null,null,null,null,null,null,null,"Business","Inactive","","D:\\Clients\\Cooks Pest Control\\"]
[null,441,{"$f":"ROW()","v":2673},"Cox Wealth Management LLC","Richard Cox",null,"Business",null,"info@coxwealth.com",null,null,"(423) 894-3882",null,null,null,null,null,null,null,null,null,null,"Business","Inactive","","D:\\Clients\\Cox Wealth Management LLC\\"]
[null,299,{"$f":"ROW()","v":2674},"Daniel & Thea Rogers",null,null,"Personal",null,"dtdd@bellsouth.net",null,null,"(404) 713-8344","(770) 653-3600",null,null,null,null,null,null,null,null,null,"Individual","Active","","D:\\Clients\\Daniel & Thea Rogers\\"]
[null,300,{"$f":"ROW()","v":2675},"Daniel Kueter","Chattanooga Heart Institute",null,"Medical",null,null,null,null,"(423) 265-2233",null,null,null,null,null,null,null,null,null,null,"Individual","Active","","D:\\Clients\\Daniel Kueter\\"]
[null,301,{"$f":"ROW()","v":2676},"Darryl Mayes",null,null,"Personal",null,null,null,null,"(423) 463-8459",null,null,null,null,null,null,null,null,null,null,"Individual","Active","","D:\\Clients\\Darryl Mayes\\"]
[null,302,{"$f":"ROW()","v":2677},"Davey Daniels","Tennessee Oncology",null,"Medical",null,null,null,null,null,null,null,"605 Glenwood Drive Ste 200","Chattanooga","Tn",37402,null,null,null,null,"Individual","Active","","D:\\Clients\\Davey Daniels\\"]
[null,305,{"$f":"ROW()","v":2678},"David Winters","CHI Memorial Family Practice Associates",null,"Medical",null,null,null,null,"(423) 495-5951",null,null,"6401 Mountain View Dr","Ooltewah",null,37363,null,null,null,null,"Individual","Inactive","","D:\\Clients\\David Winters\\"]
[null,442,{"$f":"ROW()","v":2679},"David's Bridal",null,null,"Business",null,null,null,null,"(423) 855-5300",null,null,null,null,null,null,null,null,null,null,"Business","Inactive","","D:\\Clients\\David's Bridal\\"]
[null,482,{"$f":"ROW()","v":2680},"dc Tax, LLC",null,null,null,null,"info@dctax.us",null,null,"(423)482-9737",null,null,"9301 Ocoee St #64","Chattanooga","TN",37363,null,null,null,null,null,"Active","","D:\\Clients\\dc Tax, LLC\\"]
[null,307,{"$f":"ROW()","v":2681},"Debra Montgomery",null,null,"Personal",null,"deb.montgomery@yahoo.com",null,null,"(813) 405-5783",null,null,"#609 11575 Memorial Parkway SW","Huntsville","AL",35803,null,null,null,null,"Individual","Active","","D:\\Clients\\Debra Montgomery\\"]
[null,309,{"$f":"ROW()","v":2682},"Dilcia Nunez",null,null,"Personal",null,null,null,null,"(423) 284-3503",null,null,null,null,null,null,null,null,null,null,"Individual","Active","","D:\\Clients\\Dilcia Nunez\\"]
[null,311,{"$f":"ROW()","v":2683},"Don Lemons","Internal Revenue Service",null,"Government",null,"donald.lemons@irs.gov",null,null,"(423) 505-9145",null,null,null,null,null,null,null,null,null,null,"Individual","Active","","D:\\Clients\\Don Lemons\\"]
[null,310,{"$f":"ROW()","v":2684},"Don Provonsha","BCBS",null,"Medical",null,null,null,null,null,"(423) 463-7141",null,null,null,null,null,null,null,null,null,"Individual","Active","","D:\\Clients\\Don Provonsha\\"]
[null,314,{"$f":"ROW()","v":2685},"Doug Bullington",null,null,"Personal",null,"briteblinds@bellsouth.net",null,null,null,null,null,null,null,null,null,null,null,null,null,"Individual","Active","","D:\\Clients\\Doug Bullington\\"]
[null,444,{"$f":"ROW()","v":2686},"Dream Coat Painting Company","J. Luke Smith",null,"Business",null,"dreamcoatpaintingcompany@gmail.com",null,null,4239946680,null,null,null,null,null,null,null,null,null,null,"Business","Inactive","","D:\\Clients\\Dream Coat Painting Company\\"]
[null,445,{"$f":"ROW()","v":2687},"Edward Jones",null,null,"Business",null,null,null,null,"(423) 244-8000",null,null,null,null,null,null,null,null,null,null,"Business","Inactive","","D:\\Clients\\Edward Jones\\"]
[null,446,{"$f":"ROW()","v":2688},"Enterprise Rent A Car",null,null,"Business",null,null,null,null,"(423) 899-2633",null,null,null,null,null,null,null,null,null,null,"Business","Active","","D:\\Clients\\Enterprise Rent A Car\\"]
[null,447,{"$f":"ROW()","v":2689},"EPB",null,null,"Business",null,null,null,null,"(423) 648-1372",null,null,null,null,null,null,null,null,null,null,"Business","Active","","D:\\Clients\\EPB\\"]
[null,318,{"$f":"ROW()","v":2690},"Erin Chung",null,null,"Personal",null,"ismellgood3@gmail.com",null,null,"(423) 443-2880","(423) 443-2880",null,"205 Margarita Dr","Killeen","Tx",76542,null,null,null,null,"Individual","Active","","D:\\Clients\\Erin Chung\\"]
[null,448,{"$f":"ROW()","v":2691},"ForceManager",null,null,"Vendor",null,"support@forcemanager.net",null,null,null,null,null,null,null,null,null,null,null,null,null,"Business","Inactive","","D:\\Clients\\ForceManager\\"]
[null,450,{"$f":"ROW()","v":2692},"Galen Medical",null,null,"Medical",null,null,null,null,"(423) 899-2904",null,null,"Ste. 170 1238 Taft Hwy","Signal Mountain","TN",37377,null,null,null,null,"Business","Active","","D:\\Clients\\Galen Medical\\"]
[null,451,{"$f":"ROW()","v":2693},"Galen Mountain View Medicine",null,null,"Medical",null,null,null,null,"(423) 551-3562",null,null,"9309 Alison Pike","Ooltewah","TN",37363,null,null,null,null,"Business","Active","","D:\\Clients\\Galen Mountain View Medicine\\"]
[null,452,{"$f":"ROW()","v":2694},"Gary Hyde, CPA",null,null,"Peer",null,null,null,null,4237156462,null,null,"415 S White St","Athens","TN",37371,null,null,null,null,"Business","Inactive","","D:\\Clients\\Gary Hyde, CPA\\"]
[null,321,{"$f":"ROW()","v":2695},"Gary Simon",null,null,"Personal",null,null,null,null,null,null,null,null,null,null,null,null,null,null,null,"Individual","Active","","D:\\Clients\\Gary Simon\\"]
[null,322,{"$f":"ROW()","v":2696},"George Cupp",null,null,"Personal",null,"george_cupp@comcast.net",null,null,"(423) 894-0202","(423) 432-8296",null,null,null,null,null,null,null,null,null,"Individual","Active","","D:\\Clients\\George Cupp\\"]
[null,323,{"$f":"ROW()","v":2697},"George Levy",null,null,"Personal",null,"george@georgeplease.com",null,null,null,"(248) 895-1704",null,null,null,null,null,null,null,null,null,"Individual","Active","","D:\\Clients\\George Levy\\"]
[null,324,{"$f":"ROW()","v":2698},"Ginger Stelling",null,null,"Personal",null,"gingerstelling@comcast.net",null,null,"(404) 376-5314",null,null,null,null,null,null,null,null,null,null,"Individual","Inactive","","D:\\Clients\\Ginger Stelling\\"]
[null,326,{"$f":"ROW()","v":2699},"Grandma ",null,null,"Personal",null,"grandma@shrydvd.com",null,null,"(423) 290-2811",null,null,null,null,null,null,null,null,null,null,"Individual","Inactive","","D:\\Clients\\Grandma \\"]
[null,327,{"$f":"ROW()","v":2700},"Greg Gates",null,null,"Personal",null,"gmgates64@canoemail.com",null,null,"(305) 563-0610",null,null,null,null,null,null,null,null,null,null,"Individual","Active","","D:\\Clients\\Greg Gates\\"]
[null,328,{"$f":"ROW()","v":2701},"Gregory Murray",null,null,"Personal",null,"gregmurr1@yahoo.com",null,null,"(423) 595-1970",null,null,"6026 Morning Glory Dr","Harrison","TN",37341,null,null,null,null,"Individual","Active","","D:\\Clients\\Gregory Murray\\"]
[null,453,{"$f":"ROW()","v":2702},"Harrison Family Dentistry",null,null,"Medical",null,"info@harrisonfamilydentistry.com",null,null,"(423) 388-3562","(423) 344-3884",null,"5707 Hwy 58","Harrison","TN",37341,null,null,null,null,"Business","Active","","D:\\Clients\\Harrison Family Dentistry\\"]
[null,330,{"$f":"ROW()","v":2703},"Henry Chung",null,null,"Personal",null,null,null,null,null,"(931) 401-2311",null,null,null,null,null,null,null,null,null,"Individual","Active","","D:\\Clients\\Henry Chung\\"]
[null,454,{"$f":"ROW()","v":2704},"InfoFlo Solutions","Shai Berliner",null,"Vendor",null,"shai@infoflosolutions.com",null,null,"(646) 465-7676",null,null,"148 Sheppard Avenue West","Toronto","Ontario","M2N 1M8",null,null,null,null,"Business","Inactive","","D:\\Clients\\InfoFlo Solutions\\"]
[null,455,{"$f":"ROW()","v":2705},"Internal Revenue Service",null,null,"Government",null,null,null,null,null,null,null,null,null,null,null,null,null,null,null,"Business","Active","","D:\\Clients\\Internal Revenue Service\\"]
[null,456,{"$f":"ROW()","v":2706},"Invitae (Erlanger East Genetics)",null,null,"Medical",null,null,null,null,"(423) 267-0466",null,null,null,null,null,null,null,null,null,null,"Business","Active","","D:\\Clients\\Invitae (Erlanger East Genetics)\\"]
[null,331,{"$f":"ROW()","v":2707},"Ismail Farayare",null,null,"Government",null,null,null,null,null,null,null,null,null,null,null,null,null,null,null,"Individual","Active","","D:\\Clients\\Ismail Farayare\\"]
[null,332,{"$f":"ROW()","v":2708},"J. Benton",null,null,"Personal",null,"bigjohnb2002@yahoo.com",null,null,null,null,null,null,null,null,null,null,null,null,null,"Individual","Inactive","","D:\\Clients\\J. Benton\\"]
[null,335,{"$f":"ROW()","v":2709},"James Butts",null,null,"Personal",null,"lb2204@alltel.net",null,null,null,null,null,null,null,null,null,null,null,null,null,"Individual","Inactive","","D:\\Clients\\James Butts\\"]
[null,336,{"$f":"ROW()","v":2710},"James Clements",null,null,"Personal",null,"clements2397@gmail.com",null,null,"(256) 337-0441",null,null,null,null,null,null,null,null,null,null,"Individual","Active","","D:\\Clients\\James Clements\\"]
[null,337,{"$f":"ROW()","v":2711},"James Killian",null,null,"Business",null,null,null,null,"(423) 504-4325","(423) 504-4325",null,null,null,null,null,null,null,null,null,"Individual","Inactive","","D:\\Clients\\James Killian\\"]
[null,338,{"$f":"ROW()","v":2712},"Jamie Boyer",null,null,"Personal",null,"mytruck18rlimg@icloud.com",null,null,"(706) 781-6164","(706) 994-0613",null,null,null,null,null,null,null,null,null,"Individual","Inactive","","D:\\Clients\\Jamie Boyer\\"]
[null,339,{"$f":"ROW()","v":2713},"Jane Harvey",null,null,"Personal",null,"eharvey9547@epbfi.com",null,null,"(423) 903-2633","(423) 910-0072",null,null,null,null,null,null,null,null,null,"Individual","Active","","D:\\Clients\\Jane Harvey\\"]
[null,340,{"$f":"ROW()","v":2714},"Jason Taylor",null,null,"Personal",null,null,null,null,"(423) 774-3161",null,null,null,null,null,null,null,null,null,null,"Individual","Inactive","","D:\\Clients\\Jason Taylor\\"]
[null,342,{"$f":"ROW()","v":2715},"Jennie Mahaffey",null,null,"Medical",null,null,null,null,null,null,null,null,null,null,null,null,null,null,null,"Individual","Inactive","","D:\\Clients\\Jennie Mahaffey\\"]
[null,343,{"$f":"ROW()","v":2716},"Jennifer Baggett",null,null,"Personal",null,"killerbarbie0985@gmail.com",null,null,"(423) 599-6562",null,null,null,null,null,null,null,null,null,null,"Individual","Active","","D:\\Clients\\Jennifer Baggett\\"]
[null,344,{"$f":"ROW()","v":2717},"Jennifer Dotson","Internal Revenue Service",null,"Government",null,null,null,null,null,null,null,null,null,null,null,null,null,null,null,"Individual","Inactive","","D:\\Clients\\Jennifer Dotson\\"]
[null,345,{"$f":"ROW()","v":2718},"Jennifer McDonald","Internal Revenue Service",null,"Personal",null,"jennifer.j.macdonald@irs.gov",null,null,null,"(304) 616-2414",null,null,null,null,null,null,null,null,null,"Individual","Inactive","","D:\\Clients\\Jennifer McDonald\\"]
[null,347,{"$f":"ROW()","v":2719},"Jerry Holmes",null,null,"Personal",null,null,null,null,"(423) 821-8708",null,null,null,null,null,null,null,null,null,null,"Individual","Inactive","","D:\\Clients\\Jerry Holmes\\"]
[null,348,{"$f":"ROW()","v":2720},"Jerry Martin",null,null,"Personal",null,"jeremartin@windstream.net",null,null,"(706) 745-6972","(706) 897-7352",null,null,null,null,null,null,null,null,null,"Individual","Inactive","","D:\\Clients\\Jerry Martin\\"]
[null,349,{"$f":"ROW()","v":2721},"Jimmy Stephens",null,null,"Client",null,null,null,null,null,"(757) 274-5135",null,"6830 Benwood Dr","Ooltewah","TN",37363,null,null,null,null,"Individual","Active","","D:\\Clients\\Jimmy Stephens\\"]
[null,352,{"$f":"ROW()","v":2722},"Joseph Hulgan",null,null,"Personal",null,"jhulgan1117@gmail.com",null,null,"(423) 260-3606",null,null,null,null,null,null,null,null,null,null,"Individual","Active","","D:\\Clients\\Joseph Hulgan\\"]
[null,353,{"$f":"ROW()","v":2723},"Joyce Rogers",null,null,"Personal",null,"rogersx@alltel.net",null,null,"(706) 897-2768",null,null,null,null,null,null,null,null,null,null,"Individual","Inactive","","D:\\Clients\\Joyce Rogers\\"]
[null,354,{"$f":"ROW()","v":2724},"Kamryn Kessel",null,null,"Personal",null,"kamrynkessel@gmail.com",null,null,"(850) 530-9079",null,null,null,null,null,null,null,null,null,null,"Individual","Active","","D:\\Clients\\Kamryn Kessel\\"]
[null,356,{"$f":"ROW()","v":2725},"Kathy Thacker","Internal Revenue Service",null,"Government",null,"kathleen.m.thacker@irs.gov",null,null,"(321) 356-9082",null,null,null,null,null,null,null,null,null,null,"Individual","Inactive","","D:\\Clients\\Kathy Thacker\\"]
[null,457,{"$f":"ROW()","v":2726},"Keith Hodge Plumbing",null,null,"Business",null,null,null,null,"(423) 401-6791",null,null,null,null,null,null,null,null,null,null,"Business","Inactive","","D:\\Clients\\Keith Hodge Plumbing\\"]
[null,357,{"$f":"ROW()","v":2727},"Kenneth and Yvonne Mee",null,null,"Personal",null,null,null,null,null,"(423) 304-5618",null,null,null,null,null,null,null,null,null,"Individual","Active","","D:\\Clients\\Kenneth and Yvonne Mee\\"]
[null,358,{"$f":"ROW()","v":2728},"Kenny Livingston",null,null,"Personal",null,null,null,null,"(423) 314-1827",null,null,null,null,null,null,null,null,null,null,"Individual","Active","","D:\\Clients\\Kenny Livingston\\"]
[null,359,{"$f":"ROW()","v":2729},"Kevin Smith","Internal Revenue Service",null,"Government",null,null,null,null,null,null,null,null,null,null,null,null,null,null,null,"Individual","Inactive","","D:\\Clients\\Kevin Smith\\"]
[null,458,{"$f":"ROW()","v":2730},"Kree Investments, LLC",null,null,"Business",null,null,null,null,null,null,null,"3676 Moccassin CV","Memphis","TN",38109,null,null,null,null,"Business","Inactive","","D:\\Clients\\Kree Investments, LLC\\"]
[null,360,{"$f":"ROW()","v":2731},"Kristina Stephens",null,null,"Client",null,null,null,null,"(757) 477-3206",null,null,"6830 Benwood Dr","Ooltewah","TN",37363,null,null,null,null,"Individual","Active","","D:\\Clients\\Kristina Stephens\\"]
[null,459,{"$f":"ROW()","v":2732},"Lambert's Flooring, Inc","Charlie Lambert",null,"Client",null,"charlietlambert@icloud.com",null,null,"(865) 984-0604",null,"(865) 454-9025","PO Box 6725","Maryville","TN",37825,null,null,null,null,"Business","Active","","D:\\Clients\\Lambert's Flooring, Inc\\"]
[null,460,{"$f":"ROW()","v":2733},"Lambert's Southern Pies, Inc","Charlie T Lambert",null,"Client",null,null,null,null,"(865) 981-9700",null,null,"PO Box 6725","Maryville","TN",37825,null,null,null,null,"Business","Active","","D:\\Clients\\Lambert's Southern Pies, Inc\\"]
[null,461,{"$f":"ROW()","v":2734},"Larson Consulting",null,null,"Peer",null,null,null,null,null,null,null,null,"Knoxville","TN",null,null,null,null,null,"Business","Active","","D:\\Clients\\Larson Consulting\\"]
[null,361,{"$f":"ROW()","v":2735},"Lee Turner",null,null,"Personal",null,"turner.lmt4@gmail.com",null,null,"(678) 458-1063",null,null,null,null,null,null,null,null,null,null,"Individual","Active","","D:\\Clients\\Lee Turner\\"]
[null,362,{"$f":"ROW()","v":2736},"Linda ",null,null,"Client",null,null,null,null,null,"(540) 460-4522",null,null,null,null,null,null,null,null,null,"Individual","Active","","D:\\Clients\\Linda \\"]
[null,363,{"$f":"ROW()","v":2737},"Lisa Bonham",null,null,"Medical",null,"lisabonahm@uniongeneral.org",null,null,null,null,null,null,null,null,null,null,null,null,null,"Individual","Inactive","","D:\\Clients\\Lisa Bonham\\"]
[null,365,{"$f":"ROW()","v":2738},"Lysandra Spate",null,null,"Medical",null,"lysandra_spates@memorial.org",null,null,null,null,null,"6401 Mountain View Dr","Ooltewah",null,37363,null,null,null,null,"Individual","Inactive","","D:\\Clients\\Lysandra Spate\\"]
[null,366,{"$f":"ROW()","v":2739},"Mama ",null,null,"Personal",null,"jerlyn1@windstream.net",null,null,"(706) 745-6972","(706) 400-2070",null,null,null,null,null,null,null,null,null,"Individual","Inactive","","D:\\Clients\\Mama \\"]
[null,462,{"$f":"ROW()","v":2740},"Marbella Construction","Alex Richter",null,"Business",null,"info@marbellaconstruction.us",null,null,"(423) 595-2547",null,null,"9317 Fuller Rd","Chattanooga","TN",37421,null,null,null,null,"Business","Inactive","http://marbellaconstruction.us","D:\\Clients\\Marbella Construction\\"]
[null,367,{"$f":"ROW()","v":2741},"Marian Kessel",null,null,"Personal",null,"marian28@cox.net",null,null,null,"(706) 897-9611",null,null,null,null,null,null,null,null,null,"Individual","Active","","D:\\Clients\\Marian Kessel\\"]
[null,368,{"$f":"ROW()","v":2742},"Mark Schilling","Internal Revenue Service",null,"Government",null,null,null,null,"(865) 591-7500",null,null,null,null,null,null,null,null,null,null,"Individual","Inactive","","D:\\Clients\\Mark Schilling\\"]
[null,371,{"$f":"ROW()","v":2743},"Matthew Martin",null,null,"Vendor",null,"matthewmartin@onpay.com",null,null,null,null,null,null,null,null,null,null,null,null,null,"Individual","Inactive","","D:\\Clients\\Matthew Martin\\"]
[null,372,{"$f":"ROW()","v":2744},"Matthew Turner",null,null,"Personal",null,"turner.matt@mail.com",null,null,"(678) 849-5337",null,null,null,null,null,null,null,null,null,null,"Individual","Active","","D:\\Clients\\Matthew Turner\\"]
[null,373,{"$f":"ROW()","v":2745},"Meagan Turner",null,null,"Personal",null,"meaganturner16@gmail.com",null,null,null,null,null,null,null,null,null,null,null,null,null,"Individual","Active","","D:\\Clients\\Meagan Turner\\"]
[null,374,{"$f":"ROW()","v":2746},"Melanie Butler",null,null,"Business",null,"melanie@chattanoogapm.com",null,null,"(706) 639-5808",null,null,null,null,null,null,null,null,null,null,"Individual","Inactive","","D:\\Clients\\Melanie Butler\\"]
[null,375,{"$f":"ROW()","v":2747},"Melissa Dunn","Larson Consulting",null,"Peer",null,"melissa@larsonknoxville.com",null,null,"(865) 766-4720",null,null,"9724 Kingston Pike","Knoxville","TN",37922,null,null,null,null,"Individual","Active","","D:\\Clients\\Melissa Dunn\\"]
[null,376,{"$f":"ROW()","v":2748},"Melody Ives",null,null,"Personal",null,null,null,null,null,"(772) 214-6598",null,null,null,null,null,null,null,null,null,"Individual","Active","","D:\\Clients\\Melody Ives\\"]
[null,377,{"$f":"ROW()","v":2749},"Miguel Paris",null,null,"Personal",null,null,null,null,"(423) 394-7939",null,null,null,null,null,null,null,null,null,null,"Individual","Inactive","","D:\\Clients\\Miguel Paris\\"]
[null,378,{"$f":"ROW()","v":2750},"Mike Kessel",null,null,"Personal",null,null,null,null,"(850) 375-0221",null,null,null,null,null,null,null,null,null,null,"Individual","Active","","D:\\Clients\\Mike Kessel\\"]
[null,379,{"$f":"ROW()","v":2751},"Mitch Hackney",null,null,"Business",null,null,null,null,"(423) 593-5440",null,null,null,null,null,null,null,null,null,null,"Individual","Inactive","","D:\\Clients\\Mitch Hackney\\"]
[null,380,{"$f":"ROW()","v":2752},"Nancy Crowder",null,null,"Personal",null,null,null,null,"(423) 580-9499",null,null,null,null,null,null,null,null,null,null,"Individual","Inactive","","D:\\Clients\\Nancy Crowder\\"]
[null,463,{"$f":"ROW()","v":2753},"Ntown Motorworx","Sean Turner",null,"Business",null,"sean@ntownmotorworx.com",null,null,"(423) 541-3800",null,null,"10607 Lee Hwy","McDonald","TN",37353,null,null,null,null,"Individual","Inactive","","D:\\Clients\\Ntown Motorworx\\"]
[null,383,{"$f":"ROW()","v":2754},"Omar Nunez",null,null,"Personal",null,null,null,null,"(423) 243-8068",null,null,null,null,null,null,null,null,null,null,"Individual","Inactive","","D:\\Clients\\Omar Nunez\\"]
[null,464,{"$f":"ROW()","v":2755},"On-Pay",null,null,"Vendor",null,null,null,null,null,null,null,null,null,null,null,null,null,null,null,"Business","Inactive","","D:\\Clients\\On-Pay\\"]
[null,465,{"$f":"ROW()","v":2756},"Ooltewah Vision LLC.","John Mullins",null,"Business",null,null,null,null,"(423) 910-0412",null,null,"5598 Snow Hill Rd","Ooltewah","TN",37363,null,null,null,null,"Business","Active","","D:\\Clients\\Ooltewah Vision LLC.\\"]
[null,386,{"$f":"ROW()","v":2757},"Patty Ives",null,null,"Personal",null,null,null,null,"(954) 415-9055","(772) 341-0885",null,null,null,null,null,null,null,null,null,"Individual","Active","","D:\\Clients\\Patty Ives\\"]
[null,387,{"$f":"ROW()","v":2758},"Paula Haub","Internal Revenue Service",null,"Government",null,null,null,null,null,null,null,null,null,null,null,null,null,null,null,"Individual","Inactive","","D:\\Clients\\Paula Haub\\"]
[null,388,{"$f":"ROW()","v":2759},"Paula Jeffery","Internal Revenue Service",null,"Government",null,null,null,null,"(757) 218-3556",null,null,null,null,null,null,null,null,null,null,"Individual","Active","","D:\\Clients\\Paula Jeffery\\"]
[null,389,{"$f":"ROW()","v":2760},"Pearl Murray",null,null,"Personal",null,null,null,null,"(423) 595-6563",null,null,null,null,null,null,null,null,null,null,"Individual","Active","","D:\\Clients\\Pearl Murray\\"]
[null,391,{"$f":"ROW()","v":2761},"Rachel May","Internal Revenue Service",null,"Government",null,"rachel.s.may@irs.gov",null,null,null,null,null,null,null,null,null,null,null,null,null,"Individual","Active","","D:\\Clients\\Rachel May\\"]
[null,392,{"$f":"ROW()","v":2762},"Randall Gregory",null,null,"Business",null,"randallg@rocky-tops.com",null,null,null,null,null,null,null,null,null,null,null,null,null,"Individual","Inactive","","D:\\Clients\\Randall Gregory\\"]
[null,466,{"$f":"ROW()","v":2763},"RecruitPros",null,null,"Business",null,"debra@recruitpros.com",null,null,"(813) 405-5783",null,null,"#609 11575 Memorial Parkway SW","Huntsville","AL",35803,null,null,null,null,"Business","Inactive","","D:\\Clients\\RecruitPros\\"]
[null,423,{"$f":"ROW()","v":2764},"Remell Jackson","Internal Revenue Service",null,"Government",null,"susie.r.jackson@irs.gov",null,null,"(877) 623-1120",null,null,null,null,null,null,null,null,null,null,null,"Inactive","","D:\\Clients\\Remell Jackson\\"]
[null,397,{"$f":"ROW()","v":2765},"Richard Hubbard",null,null,"Personal",null,"richardhubbard@charter.net",null,null,null,null,null,null,null,null,null,null,null,null,null,"Individual","Inactive","","D:\\Clients\\Richard Hubbard\\"]
[null,467,{"$f":"ROW()","v":2766},"River City Pharmacy","Jimmy Goss",null,"Medical",null,null,null,null,"(423) 521-7279",null,null,"5564 Little Debbie Pkwy Unit 102","Ooltewah","TN",37363,null,null,null,null,"Business","Active","","D:\\Clients\\River City Pharmacy\\"]
[null,468,{"$f":"ROW()","v":2767},"River Valley Dentistry",null,null,"Medical",null,null,null,null,"(423) 875-0600",null,null,"125 Cherokee Blvd Ste 119","Chattanooga","TN",37405,null,null,null,null,"Business","Inactive","","D:\\Clients\\River Valley Dentistry\\"]
[null,469,{"$f":"ROW()","v":2768},"Rocky Tops",null,null,"Business",null,null,null,null,null,null,null,null,null,null,null,null,null,null,null,"Business","Inactive","","D:\\Clients\\Rocky Tops\\"]
[null,399,{"$f":"ROW()","v":2769},"Ronald Bullington",null,null,"Personal",null,"ron.bullington@yahoo.com",null,null,null,null,null,null,null,null,null,null,null,null,null,"Individual","Active","","D:\\Clients\\Ronald Bullington\\"]
[null,470,{"$f":"ROW()","v":2770},"Sanders Irrigation (Rainbird)",null,null,"Business",null,null,null,null,"(423) 892-8322",null,null,"3401 Jenkins Rd","Chattanooga","TN",37421,null,null,null,null,"Business","Inactive","","D:\\Clients\\Sanders Irrigation (Rainbird)\\"]
[null,400,{"$f":"ROW()","v":2771},"Sandra Branden",null,null,"Personal",null,null,null,null,null,"(423) 779-7942",null,null,null,null,null,null,null,null,null,"Individual","Inactive","","D:\\Clients\\Sandra Branden\\"]
[null,471,{"$f":"ROW()","v":2772},"Santa Barbara TPG",null,null,"Vendor",null,null,null,null,null,null,null,"PO Box 508","West Chester","OH",45071,null,null,null,null,"Business","Active","https://pro.sbtpg.com/login","D:\\Clients\\Santa Barbara TPG\\"]
[null,404,{"$f":"ROW()","v":2773},"Sherry Collins",null,null,"Personal",null,"Sherry@shrydvd.com",null,null,null,"(423) 443-2317",null,null,null,null,null,null,null,null,null,"Individual","Active","","D:\\Clients\\Sherry Collins\\"]
[null,405,{"$f":"ROW()","v":2774},"Sheryl Bullington",null,null,"Personal",null,"sherylhall@comcast.net",null,null,null,null,null,null,null,null,null,null,null,null,null,"Individual","Active","","D:\\Clients\\Sheryl Bullington\\"]
[null,472,{"$f":"ROW()","v":2775},"Social Security Administration",null,null,"Government",null,null,null,null,null,null,null,"Direct Operations Center","Wilkes-Barre","PA","18769-0001",null,null,null,null,"Business","Active","","D:\\Clients\\Social Security Administration\\"]
[null,406,{"$f":"ROW()","v":2776},"Stacy Turner",null,null,"Personal",null,"stacy.belflower@gmail.com",null,null,"(478) 952-3375",null,null,null,null,null,null,null,null,null,null,"Individual","Active","","D:\\Clients\\Stacy Turner\\"]
[null,407,{"$f":"ROW()","v":2777},"Steve & Rora Hicks",null,null,"Personal",null,null,null,null,null,"(423) 432-7565",null,null,null,null,null,null,null,null,null,"Individual","Inactive","","D:\\Clients\\Steve & Rora Hicks\\"]
[null,408,{"$f":"ROW()","v":2778},"Steve Lori",null,null,"Personal",null,null,null,null,"(423) 624-9442",null,null,null,null,null,null,null,null,null,null,"Individual","Inactive","","D:\\Clients\\Steve Lori\\"]
[null,409,{"$f":"ROW()","v":2779},"Steve Sherman",null,null,"Personal",null,null,null,null,"(423) 432-6501",null,null,null,null,null,null,null,null,null,null,"Individual","Inactive","","D:\\Clients\\Steve Sherman\\"]
[null,473,{"$f":"ROW()","v":2780},"Stoney's Appliance",null,null,"Business",null,null,null,null,null,null,null,null,null,null,null,null,null,null,null,"Business","Inactive","","D:\\Clients\\Stoney's Appliance\\"]
[null,474,{"$f":"ROW()","v":2781},"TaxAct Professional",null,null,"Vendor",null,null,null,null,"(319) 409-9695",null,null,null,null,null,null,null,null,null,null,"Business","Active","taxact.com","D:\\Clients\\TaxAct Professional\\"]
[null,475,{"$f":"ROW()","v":2782},"Tennessee Dept. of Labor & Workforce Develop.",null,null,"Government",null,null,null,null,"(865) 594-6380","(865) 594-6357",null,"2700 Middlebrook Pk","Knoxville","TN",37921,null,null,null,null,"Business","Active","tn.gov/workforce","D:\\Clients\\Tennessee Dept. of Labor & Workforce Develop.\\"]
[null,476,{"$f":"ROW()","v":2783},"Tennessee Oncology",null,null,"Medical",null,null,null,null,"(423) 698-1844",null,null,"605 Glenwood Drive Ste 200","Chattanooga","Tn",37402,null,null,null,null,"Business","Active","","D:\\Clients\\Tennessee Oncology\\"]
[null,477,{"$f":"ROW()","v":2784},"Titan File","Adrienne Aust",null,"Vendor",null,null,null,null,null,null,null,null,null,null,null,null,null,null,null,"Business","Inactive","","D:\\Clients\\Titan File\\"]
[null,416,{"$f":"ROW()","v":2785},"Tracy Turner",null,null,"Personal",null,"blessings7618@bellsouth.net",null,null,"(678) 316-4633",null,null,null,null,null,null,null,null,null,null,"Individual","Active","","D:\\Clients\\Tracy Turner\\"]
[null,478,{"$f":"ROW()","v":2786},"Truist Bank","Nita Gole",null,"Business",null,null,null,null,"(423) 238-6116",null,null,null,null,null,null,null,null,null,null,"Business","Active","","D:\\Clients\\Truist Bank\\"]
[null,479,{"$f":"ROW()","v":2787},"Union County Nursing Home",null,null,"Medical",null,null,null,null,"(706) 835-3692","(706) 835-3620",null,"164 Nursing Home Circle","Blairsville","GA",30512,null,null,null,null,"Business","Inactive","","D:\\Clients\\Union County Nursing Home\\"]
[null,480,{"$f":"ROW()","v":2788},"Vcita","Oz Kalimi",null,"Vendor",null,"oz.kalimi@vcita.com",null,null,null,null,null,null,null,null,null,null,null,null,null,"Business","Inactive","","D:\\Clients\\Vcita\\"]
[null,417,{"$f":"ROW()","v":2789},"Vic Baggett",null,null,"Personal",null,"vickius@hotmail.com",null,null,"(423) 331-6428",null,null,null,null,null,null,null,null,null,null,"Individual","Active","","D:\\Clients\\Vic Baggett\\"]
[null,481,{"$f":"ROW()","v":2790},"Whitener Landscaping",null,null,"Business",null,null,null,null,"(423) 238-9625",null,null,null,null,null,null,null,null,null,null,"Business","Inactive","","D:\\Clients\\Whitener Landscaping\\"]
[null,20230427142729,{"$f":"ROW()","v":2791},"Walter Lindsey","","Resolved Case","Lead","Called","chattman1169@gmail.com","the_porj@yahoo.com","wlindsey11@yahoo.com","(423) 400-9609","(423) 892-7984","(423) 622-0328","4806 Fairwood Ln","Chattanooga","TN",37416,"Hamilton County, TN",false,false,false]
[null,20230427144358,{"$f":"ROW()","v":2792},"Wilkerson Tile Company LLC","Richard Wilkerson",null,"Lead","Called","imv.newdomains@bellsouth.com","iypnotifications@att.com","brittanychristian@hotmail.com","(423) 356-8647","(423) 842-7476","(423) 842-6464","6432 Hixson Pike","Hixson","TN",37343,"Hamilton County, TN",false,false,false]
[null,20230427144942,{"$f":"ROW()","v":2793},"Winfred C Manda","",null,"Lead",null,"w-manda@usa.net","chishamanda@gmail.com","tschishamanda57@yahoo.com","(423) 653-9707","(423) 894-6965","(402) 397-2750","720 Sunset Mountain Dr","Chattanooga","TN",37421,"Hamilton County, TN",false,false,false]
[null,20230509154209,{"$f":"ROW()","v":2794},"Stephen Goldstein (Dec'd)",null,null,null,null,null,null,null,null,null,null,"701 Market St Ste 1217","Chattanooga","TN",37402,"Hamilton County, TN"]
[null,20230509154559,{"$f":"ROW()","v":2795},"Teddi J Kelly","Goron Kelly (Dec'd)",null,null,null,null,null,null,null,null,null,"831 Hendon Rd","Soddy Daisy","TN",37379,"Hamilton County, TN"]
[null,20230509154727,{"$f":"ROW()","v":2796},"Blake Cordell","Kristen Cordell",null,null,null,null,null,null,null,null,null,"306 Progress Dr","Signal Mountain","TN",37377,"Hamilton County, TN"]
[null,20230509154811,{"$f":"ROW()","v":2797},"Richard A Simpson","Tammye C Simpson",null,null,null,null,null,null,null,null,null,"949 Lula Lake Rd","Lookout Mountain","TN",37350,"Hamilton County, TN"]

{"sheet":"MailLists","index":1,"n_rows":112,"n_cols":31,"rows_kept":112,"cut":false,"hidden":false,"merged":[[1,5,1,6],[1,3,1,4],[1,1,1,2],[1,9,1,10],[1,7,1,8],[1,27,1,28],[1,29,1,30],[1,25,1,26],[1,23,1,24],[1,11,1,12],[1,21,1,22],[1,19,1,20],[1,17,1,18],[1,15,1,16],[1,13,1,14]]}
[null,null,null,null,null,null,null,null,null,"Sent on 05/08/2023",null,"Sent on 04/26/2023",null,"Sent on 04/26/2023",null,"Sent on 04/25/2023",null,"Sent on 04/24/2023",null,"Sent on 04/24/2023",null,"Sent on 04/19/2023",null,"Sent on 04/17/2023",null,"Sent on 04/14/2023",null,"Sent 04/13/2023",null,"Sent 04/12/2023"]
[null,"MailList15",null,"MailList14",null,"MailList13",null,"MailList12",null,"MailList11",null,"MailList10",null,"MailList9",null,"MailList8",null,"MailList7",null,"MailList6",null,"MailList5",null,"MailList4",null,"MailList3",null,"MailList2",null,"MailList1"]
[null,"FullName","Email","FullName","Email","FullName","Email","FullName","Email","FullName","Email","FullName","Email","FullName","Email","FullName","Email","FullName","Email","FullName","Email","FullName","Email","FullName","Email","FullName","Email","FullName","Email","FullName","Email"]
[null,"Guriqbal Nandra ","gnandraau52@rediffmail.com","Bradford Animal Care Etc","ferrarella28@yahoo.com","Acme Fire Protection","jcjvet@yahoo.com","Nicholas Gerard","pgerard1279@gmail.com","Lass N Laddies Inc Old Shillelagh","info@oldshillelagh.com","I & S Medical Llc","sstallings@insightbb.com","Cleveland Anderson ","blutifuldove12@yahoo.com","Agnes Hall","agnesgodwinhall@gmail.com","Melissa J France","melissa.france@gmail.com","Adebola T Olowe Sr","olowea@email.uc.edu","1st Avenue Package Store","pdangvu@att.net ","Daniel Madera ","carmendeliamadera@gmail.com","Carl W Johnson ","antkblonde@msn.com","Anthony  Christina M Cole ","mpchristina.gutierrez39@juno.com","100 Placement Llc","Info@100placement.com"]
[null,"GWENDELYN D BRAXTON ","gwendk@yahoo.com","Brenda D Mccall","bmccall612@gmail.com","Angel L Delgado ","lalodelgado7@gmail.com","Nicole G Dooley ","miquemc05@yahoo.com","Latoya Collier ","collierlatoyalisa@gmail.com","Ibrahim V Morris ","valdes38cuba@hotmail.com","David L Anderson","mmanderson1365k51@netscape.net","Air Now Heating And Cooling Inc.","huntermerritt@hotmail.com","Otis Lee Stevens","speedymaintenance@swohio.twcbc.com","Agnes G Hall","agnesgodwinhall@gmail.com","9 Mile Rent All Inc","ninemilerentall@yahoo.com","Daniel Madera ","spic0mac@hotmail.com","Carl W Johnson ","bijohnson@trane.com","Anthony  Christina M Cole ","h0christina.gutierrez@juno.com","8 Vikings Trucking Inc","signes9@yahoo.com"]
[null,"Henley Dolmon","ourtaxemail@yahoo.com","Brenda S Cooks","womanofpower1@comcast.net","Ascex LLC","kevin.laster@ascexco.com","Orlando W Adams Sr","orladams@yahoo.com","Laura J Selph","ljselph@gmail.com","Isaac J Johnson","ijohnson@rocketmail.com","Virginia K Anderson","wvrealtor1@yahoo.com","Airdusco Inc.","airalanc1@msn.com","Patricia Stevenson","mz.stevenson68@gmail.com","Alexander J Hawke","ahawke@projetech.com","9 Mile Rent All Inc","broof@asicentral.com","Daniel Mcduffie ","destinydecoratorsinc@yahoo.com","Carl W Johnson ","jodepisces@aol.com","Anthony  Christina M Cole ","christina.gutierrezu9@juno.com","8 Vikings Trucking Inc","devilishangel92804@yahoo.com"]
[null,"Hey Angela Inc","wisniewski.angela@gmail.com","BRENT L CRUMPTON PC","coxl@att.net","Askia Inc","fatouisgreat@gmail.com","Pamela L Dagenhart ","daybreakps@bellsouth.net","Lavon T Mayes ","peacee@gmail.com","J & G Pallets Inc","info@jgpalletsandtrucking.com","Andrew C Burrell PA","drewdrew101@gmail.com","AK FA MO Inc","joannerabah@yahoo.com","Paul McMillan","pmcmillen@angelfire.com","Amy Minor","amylee413@yahoo.com","9 Mile Rent All Inc","broof@ameritech.net","Daniel Mcduffie ","lashawn.mcduffie@gmail.com","Carla S Mackey ","cmcis100@yahoo.com","Anthony Byrd","abyrd52@yahoo.com","8 Vikings Trucking Inc","devilishangel92804@yahoo.com"]
[null,"JAMES P CAMPBELL","ashleymariecampbell@gmail.com","Brian Butcher ","brian.butcher@gmail.com","David Audino","t.audino@comcast.net","Patricia Calhoun ","robbinsrule@msn.com","Lechelle & Michael E Davenport","giosah@aol.com","J Aboud Llc","jimaboud@yahoo.com","Andrew M Brown Jr","mikebrown558@yahoo.com","Akosile Clement","clement42@sbcglobal.net","Sondra D Hertsenberg","nurse.herts@gmail.com","Beth M Adams","emt71@aol.com","A Frame Awards Inc","broof@aframeawards.com","Daniel P Kaepplinger ","dpkaepplinger@sbcglobal.net","Carla S Mackey ","v.j333@yahoo.com","Anthony Larrain ","larrainanthony@gmail.com","A Diaz Ramos ","fedaadela@yahoo.com"]
[null,"Jeffrey A Byer","jdbyers@comcast.net","Brian L Syas","brianlsyas@aol.com","Angel August","aaugusto1@netzero.net","Patricia Calhoun ","pcalhoun@ole.com","Leonard Ellison","18002071413@archwireless.net","Jaletha A Smith ","jasmith@carlson.com","Angel Accents Preschool & Daycare LLC","eksteigerk3@bellsouth.net","Akron Erectors","mhumphrey1111@yahoo.com","Stephanie Clay","stephaniealston10@gmail.com","Bryan D Bundy","seminoles1204@gmail.com","A Frame Awards Inc","sfatal@yahoo.com","Daniel P Kaepplinger ","jkpatton711@aol.com","Carla S Mackey ","carla.mackey@aol.com","Anthony Larrain ","tonylaads@gmail.com","A Diaz Ramos ","adela@feda.com"]
[null,"Jeffrey D Burns","jeffrey.burns@netzero.net","Brighton Christian Memorial LLC","frankbelk@att.net","Susan L Augustine","susan@schoolspiritproducts.com","Patrick D Ryan","pdrbaja@yahoo.com","Lisa M & Ryan Cox ","lisalis32@yahoo.com","James & Sandra Dunkin","jasiano@yahoo.com","Angel L Delgado ","lalodelgado7@gmail.com","Al Havner And Sons Hardwood Floors","al@alhavner.com","Steven C Stewart","stephenstewart@comcast.net","Caleb Seifu","blackangelfamilybookings@gmail.com","A Frame Awards Inc","debbiefatal@yahoo.com","Daniel P Kaepplinger ","dank4856@gmail.com","Carlos Granados ","granados@comcast.net","Anthony Larrain ","tpl60643@yahoo.com","A Diaz Ramos ","fedaadela@hotmail.com"]
[null,"John Bracy","john.bracey@juno.com","Brittany M Easton","britters2289@yahoo.com","Avanti Poured Walls Inc","mandlpolsinelli@comcast.net","Patrick M Goss ","anglerdude@hotmail.com","Lisa M Leporowski ","lisa0372@att.net","James & Susan M Edwards","acjames52@yahoo.com","Angus Electric LLC","tysonburt@hotmail.com","Alan Dale Collard ","collardla@aol.com","Steven E Ii Self","stealthself13@gmail.com","Carliss Payne","chefcarlisspayne@gmail.com","A&L Insurance & Income Tax Inc","sfatal@centurytel.net","Daniel Perkins ","danperkins831@yahoo.com","Carlos Granados ","cangranados@gmail.com","Anthony Pedicini ","tinapedicini13@twc.com","A G Dreco Inc.","chermaineoglesby@yahoo.com"]
[null,"Kellikidis Dino","jediyamato@aol.com","Brittany M Henry","bmichellecopeland@gmail.com","B and B Enterprises LLC","sculverhouse4@gmail.com","Perry W Freeman ","alis20@nyc.rr.com","Loricks Auto Repair Llc","kristin.lorick@gmail.com","James F Hemer ","khemmer@scboces.org","ANH Contracting Inc","anhcontractinginc@gmail.com","Alan J Washer ","alanwasher@hotmail.com","Steven Wilson Harris","sharris1966@hotmail.com","Charles E Green","bobthebobgreen@gmail.com","A&L Insurance & Income Tax Inc","pendergrass04@mail2world.com","Daniel Perkins ","petkins.dan72@gmail.com","Carlos Granados ","michael_granados90@yahoo.com","Anthony Pedicini ","colonialdesigns@bellsouth.net","A G Dreco Inc.","agdreco@aol.com"]
[null,"Luna-C Holdings ","dsr270@email.com","Brooks Services LLC","brooks8493@gmail.com","William D Bair","billandsheribair10@att.net","Philip Esformes ","philip.esformes@bellsouth.net","Louis Calderon","louis_cldrn@yahoo.com","James M Gavin ","jamesgavin@outlook.com","ANM Services LLC","ddmusic04@hotmail.com","Alassane Top","atop@yahoo.com","Stuart I Wilson","swimstu18@yahoo.com","Chico D Chappell","mrchico40@gmail.com","A&L Insurance & Income Tax Inc","azizabdul10@yahoo.com","Daniel Perkins ","perkins.dan72@gmail.com","Carol M Vibbert ","nathanvang105@gmail.com","Anthony Pedicini ","apedi14050@aol.com","A G Dreco Inc.","maine293.co@gmail.com"]
[null,"MICHAEL A CANTRELL","cantrellfarms@hotmail.com","Brown Electrical LLC","BrownElectricalLLC@yahoo.com","Mae Baker","maebaker1102@yahoo.com","Premier Staff Services","info@premierstaffservices.net","Louis S & Tonya S Smith","tonya.smith@ameritrade.com","James Marion Duncan ","md@signtechindustries.com","Anne F Bleecker","ableecker@bleeckerlawfirm.com","Albert C Bulls Construction Inc.","gbullssr@yahoo.com","Teare G Jackson","tearejackson@yahoo.com","Christopher Deveaux","perthib@lycos.com","Aaron J Pender","aziziabdul10@yahoo.com","Danielle Mcwhorter ","obocce611@aol.com","Carol M Vibbert ","carolvibbert@yahoo.com","Anthony Williams ","anthonysolomon@worldnet.att.net","Aaron Milstead ","aaron@milstead.com"]
[null,"Michael R Capuano","mike.capuano@tcountytitle.com","Brown Sales Associates Inc","a1candrsv@aol.com","James H Banks","burkey.jamessm@hotmail.com","Psych Inc","mrflipbrown@hotmail.com","Luis F Brathwaite ","positiveimagingtech@gmail.com","James W Thompson","jrt879@bigfoot.com","Anointed Helpers Home Care LLC","mserin84@gmail.com","Alberta Craig ","albertacraig94@gmail.com","Therese R Tobler","toblermd@aol.com","Chuck R Stidham","marys@bellsouth.net","Aaron J Pender","ahaaris@aol.com","Danielle Mcwhorter ","richardmcw@aol.com","Carol M Vibbert ","csmith01@bellarmine.edu","Anthony Williams ","mortgage_solomon@yahoo.com","Able Wireless Solutions, Inc.","rt7485@att.com"]
[null,"Omar Cardenas MD PA","omarcardenas@hotmail.com","Bruce E Bowers","brucebowers@rocketmail.com","Banner Broach And Machine LLC","pbrainard5@msn.com","Rafael Garcia","rg478n@yahoo.com","M & M Collision Inc ","cheryl.kondziolka@yahoo.com","Janet F Tyra ","goldiechristensen@netzero.net","Anointed Word Christian Ministries Inc","willfain@hotmail.com","Liborio Alcauter","nenems4life@hotmail.com","Timothy S Martin","repairmantim1542@gmail.com","Connie H Smith","caulil@hotmail.com","Aaron J Pender","gallardosystems@yahoo.com","Danna L Young ","mfe4@aol.com","Carolyn C Greene ","carolyn.greene@msn.com","Anthony Williams ","anthonysr2018@gmail.com","Able Wireless Solutions, Inc.","blue_blazin@att.net"]
[null,"Remeswar J Burgess","remeswar_burgess@yahoo.com","Bruna Marketing Group Inc","jeanbruna@gmail.com","Barbara Bouknight","bebouknight@yahoo.com","Rasheika Singleton ","teachforever1@yahoo.com","Ma Claudia Bennett","newsolutionspainting@gmail.com","Jasmin Dipa ","jdipa@msn.com","Anthony Denito","adenito@excite.com","Alex  Mera Harb ","harbalexa@gmail.com","William Tobler","toblermd@aol.com","Connie Smith","cj_smith205@yahoo.com","Abdul Aziz","robertlee.thompson@yahoo.com","Danna L Young ","uthorns76906@hotmail.com","Carolyn C Greene ","greenec@scdhhs.gov","Antiwuan Satterfield ","mrs.satty518@gmail.com","Abundant Community Recovery Services","darryl_dewberry@hotmail.com"]
[null,"Richard A Brown","rexbrown@gmail.com","Bryan Mills","kwaldenm@aol.com","Barbara S Woodall","gadwoodall@yahoo.com","Raymond Cobb","taykatken@yahoo.com","Maani Omar","halina1madej@yahoo.com","Jason Smothers ","smohigh247@gmail.com","Anthony Freeman","harveyfreeman@worldnet.att.net","Alexander David Jr","dishbobo@yahoo.com","100 Placement Llc","Info@100placement.com","Darin Hall","hunt_briana01@yahoo.com","Abdul Aziz","rob.lee1976@yahoo.com","Danny J Ross ","dannyross2345@yahoo.com","Carolyn C Greene ","smalltara@yahoo.com","Antoine D Davis ","a.davis31718@gmail.com","Abundant Community Recovery Services","abundantcommunityrecoveryserv@gmail.com"]
[null,"RONISHIA M BRADLEY","ronishiab@yahoo.com","BSH Accountants Inc","bonniebsh@bellsouth.net","CAREN BARNES","cmbarnes68@gmail.com","Rebekah Garcia ","bsp528@yahoo.com","Mack Tuggle & Sherila Jones -Tuggle","mack@jonesandtuggle.com","Jeanette L Blasius ","jblasius@communityalliancecu.org","Anthony Gucciardo","mildgucc@outlook.com","Kevin Alexandersen","kca@gsfn.com","1730 HAYDEN INC","mahershoman@hotmail.com","Deanna L Heflin Spells","deeanna6968@gmail.com","Abdul Aziz","thompson.rob@yahoo.com","Danny J Ross ","mscarmen2@hotmail.com","Cecil M Springer ","onestudioc@live.com","Antoine D Davis ","anthonydavis40@starspath.com","Adam S Parnell ","asparnell@gmail.com"]
[null,"Salam Zehra Slim ","sslieem21@frontiernet.net","Bugs Burger Bug Killers Inc","andy@bugsburger.com","Barriger Electric","wlsc6t@aol.com","Reizen Richard","richardr@gouldratner.com","Mamie S Beatty ","mamiebeatty@sbcglobal.net","Jee H Kim ","jkim17@adelphia.net","Cleveland Anderson ","clevelandanderson@cantonschools.net","Alexs Auto Care Inc","klh163@yahoo.com","1st Avenue Package Store","pdangvu@att.net ","Dennis A Denewitt","dennis.denewitt@worldnet.att.net","Absar Haaris","labrancifort@yahoo.com","Danny J Ross ","dross@wowway.com","Celeste Solomon ","solomon_celeste@yahoo.com","Antoine D Davis ","nthonydavis773@starspath.com","Adam S Parnell ","xyloboeman@hotmail.com"]
[null,"Sam G Caras","samcaras@caraslaw.com","Burris Drywall Inc","jerry.burris@yahoo.com","James M Barton","daniellbarton@gmail.com","Rene Rivas Cruz ","ldyambra2@yahoo.com","Mario D Parham Sr","mparham@windstream.net","Jenkins Construction Inc","domains@interventionmedia.com","David L Anderson","kcandspaz@comcast.net","Alfaro Miguel A","gen8992@roadrunner.com","8 Vikings Trucking Inc","signes9@yahoo.com","Derrick Kassem","dkassem@kassemrealestate.com","Absar Haaris","albranci@sbcglobal.net","Darius Hatchett ","hatchett@go.com","Celeste Solomon ","calvinsolomon88@gmail.com","Antonio L Johnson ","antsr180@gmail.com","Adeptcore Inc","alexzhr@yahoo.com"]
[null,"Sharon D Cannon","thickmadame26@gmail.com","C and J Lawn Experts Inc","boosha@cjlawnexperts.net","Basha Karim Shamsi","akagirlstuff@msn.com","Richard W Wilhelmsen ","rwilhelmsen1972@gmail.com","Mark  J Moss DPM PC ","mmoss1012@aol.com","Jerold Loftin","jhle40@aol.com","Virginia K Anderson","kathi.anderson@yahoo.com","Alfreda Polk ","josieisok@yahoo.com","818 LLC","erica8889@bellsouth.com","Diamond Brocks","diamond_brocks@yahoo.com","Absar Haaris","bmorebrett@gmail.com","Darius Hatchett ","dhatchett@go.com","Celeste Solomon ","calvin-james@blackplanet.com","Antonio L Johnson ","anthonyjohnson@rochester.rr.com","Adeptcore Inc","zhirovetshkiy@optonline.net"]
[null,"Side By Side Construction","drew-t@comcast.net","C and L DIESEL INC","mamadeb1953@aol.com","Mohammed Bassini","sarad5377@aol.com","Rickie W Jackson","rickwjackson865@gmail.com","Mark T & Misty J Weaver","bweaver1997@gmail.com","Jerome A James ","jajames1957@yahoo.com","Andrew M Brown Jr","jessica@dcontinuum.com","Ali Isaac","iali_06@yahoo.com","9 Mile Rent All Inc","ninemilerentall@yahoo.com","Dorian Lacourse","dlacourse3@gmail.com","Accurate Land Surveyors Inc","rcrobinson04@yahoo.com","David A Joe ","djoe@ebsworldwide.biz","Center For Prosthetics Inc","keith8824@aol.com","Antonio L Johnson ","anthony.johnsonn8@mchsi.com","Adeptcore Inc","alexanderz@gmail.com"]
[null,"Sidney N Jr Clouston ","cloustonenergy@aol.com","Calbert Design Group LLC","rebeccac1348@email.msn.com","Bay Cabinet Shop Inc","dindas01@hotmail.com","Ricky Stokes News, LLC","rstokes1450@gmail.com","Marshawn A Patterson","prettyboymap@dell.com","Jerron C Jones ","jerronjones@yahoo.com","Angel Accents Preschool & Daycare LLC","g5ksteiger@bellsouth.net","All American Concrete LLC","labrancifort@yahoo.com","A Diaz Ramos ","fedaadela@yahoo.com","Duane Grigsby","billygrigsby80@yahoo.com","Accurate Land Surveyors Inc","rrobinson@alln1security.com","David A Joe ","david@ebsworldwide.biz","Center For Prosthetics Inc","moneytrain1985@gmail.com","Argent Antiques, Llc","argentasilvercom@bellsouth.net","Admiration Inc","monicakmcbride@gmail.com"]
[null,"Sonja R Dowdy","sonja1dowdy@yahoo.com","Calvin Strong","strongbcalvin@yahoo.com","Gail L Bayer","gbayer@bayerproperties.com","Road 1 Inc","jewells1127@yahoo.com","Marvin J Bridget D Bowie ","bowieinc@sbcglobal.net","Jerry D Gardner ","marie122156@gmail.com","Angel L Delgado ","angeldorado@hotmail.com","All Custom Glass Inc","thruny@aol.com","A Frame Awards Inc","broof@asicentral.com","Eileen T Vester","eileen.vester@hotmail.com","Accurate Land Surveyors Inc","hoop@qcnet.net","David A Joe ","ebsworldwide@msn.com","Center For Prosthetics Inc","riley312@aol.com","Argent Antiques, Llc","drew@argentantiques.com","Air Now Heating And Cooling Inc.","huntermerritt@hotmail.com"]
[null,"St Matthew Christian Childcare Llc","st.matthewchristianchildcare@yahoo.com","Capital C Masonry Llc","chrisjayminor@gmail.com","Bear Creek Trucking Inc","adeason@ameritrade.com","Robert Bell","tongyabell@yahoo.com","Mary E Ryan ","mary48336@gmail.com","Joan C Huell ","stanhuell@gmail.com","Angus Electric LLC","melannburt@icloud.com","All N1 Security Services Inc","bmorebrett@gmail.com","A G Dreco Inc.","chermaineoglesby@yahoo.com","Elliot L Adams","elliott.adams@hotmail.com","All American Concrete LLC","adaughn@address.com","David Burns","dburns3353@aol.com","Cg Services Corporation","mrmagic101@comcast.net","Arthur G Hollis ","aghollis@capital22.com","Air Now Heating And Cooling Inc.","james@airnowhvac.com"]
[null,"Stanton M Mack ","stanmack@aol.com","Cardinal Land and Services LLC","ejm2011@gmail.com","Oliver H Beaven","mail@marigoldinfosys.com","Robert E Bradbury ","robertbradbury930@yahoo.com","Mary Kay Browne ","mare1256@yahoo.com","John W Reid ","mule73@hotmail.com","ANH Contracting Inc","greatwhitehvacr@yahoo.com","Allen C Fairley","jafairley@gmail.com","AKA Electric Inc","jbudk6@gmail.com","Ephriam Swafford","eswaffor@us.ibm.com","All American Concrete LLC","sdaughn@gmail.com","David Burns","davidgarcia801@sbcglobal.net","Cg Services Corporation","amjohnson865@gmail.com","Arthur G Hollis ","arthollis@yahoo.com","Air Now Heating And Cooling Inc.","merritt@airnowhvac.com"]
[null,"Steve and Diann Ailsworth","ailsworthd@yahoo.com","Cardr Inc","massey.jm@gmail.com","Todd R Becker","melissascala@gmail.com","Robert L Marchese ","islabob@aol.com","Mary Roberts ","steve.roberts@hotmail.com","Jordan W Rose","africanviolet12@yahoo.com","Anne F Bleecker","afbleecker@bleeckerlawfirm.com","Gloria L Allen","gtucker_04@yahoo.com","A&L Insurance & Income Tax Inc","sfatal@yahoo.com","Eric R Beach","niceman@thrunet.com","All American Concrete LLC","allison.daughn@baycare.org","David D  Garcia ","bsp528@yahoo.com","Cg Services Corporation","cindy_r_johnson@whirlpool.com","Arthur G Hollis ","nvm.art.hollis@hotmail.com","Airdusco Inc.","airalanc1@msn.com"]
[null,"Steven J Heather Rooker ","steve.rooker@energymat.us","Carey A Fowler","fowler@nixfowler.com","Barbara Beckley","bbeckley1967@yahoo.com","Robin M Myrick","robinmyrick@hotmail.com","Maury D Kommor","lorikommor@gmail.com","Jose Perez Alonso ","lauraesq@live.com","Anointed Word Christian Ministries Inc","kfain1@bellsouth.net","Allen Marketing & Associates Inc","patrick@allenmarketing.net","A-1 Exterminating Company Inc","vancap@aol.com","Ernest Fedeli","fedeli_ei@msn.com","All N1 Security Services Inc","nicolas@mdalt.com","David D  Garcia ","sdruihet@hotmail.com","Charles B & Mary E Nussbaum","acd3dad@yahoo.com","Arturo Jauregui P C","arjauregui@aol.com","Airdusco Inc.","dragonkatana@hotmail.com"]
[null,"Steven M Such","ssuch81@gmail.com","Cargo Express Intercontinental","grbenedict@worldnet.att.net","Becky M Gamble","amble@lfc.edu","Roc A Yauilla ","bugsytjl1@tivejo.com","Megan M & William H Mays III","megan.pease@gmail.com","Joshua J & Michelle L Harmon","joshua.harmon@nmfn.com","Anthony Freeman","harveyfreeman@att.net","Allen P Pitts","hoop@qcnet.net","Aaron J Pender","pendergrass04@mail2world.com","Garnisa M Winbush","garnisawinbush@yahoo.com","All N1 Security Services Inc","amays0907@gmail.com","David D  Garcia ","mssldavid@yahoo.com","Charles B & Mary E Nussbaum","charlesnussbu@live.com","Ashley Demetra","oashley96@gmail.com","Airdusco Inc.","stephen.lancaster@worldnet.att.net"]
[null,"Sue Cabadas Dds Llc ","cabadassue@hushmail.com","Carin Johnson","lamcla@aol.com","BEDI RAVINDER","rkbedi567@gmail.com","Rodger L Harding ","rodgerharding@msn.com","Melanie L & Acer V Nesbitt","melanielerese@hotmail.com","Joshua Salonich ","jsalonich@gmail.com","Anthony Gucciardo","janeleeb28@gmail.com","Alliance Industrial Solutions LLC","shandra28@hotmail.com","Aaron Milstead ","aaron@milstead.com","Hemptations","niceman@thrunet.com","All N1 Security Services Inc","amsmusicsouth@gmail.com","David Gayden","supportm@bellsouth.net","Charles E Hammond","chammond@gmail.com","Ashley Demetra ","crysashley@comcast.net","Al Havner And Sons Hardwood Floors","al@alhavner.com"]
[null,"Sunday Nwankpa ","icocoltd@ymail.com","Christine Brown","mustangbrown081@gmail.com","Daniel J Beers II","djbeers3@gmail.com","Rodney G Patterson ","rodney9663@aol.com","Melvin L Phillips ","melvinlphillips@outlook.com","Julie Albano ","julzboop23@yahoo.com","David L Anderson","qmanderson1365j83@netscape.net","Allison S Daughn","adaughn@address.com","AB Diamond Corp LLC","hostmaster@imaginenet.net","Jeffrey String","billiek777@gmail.com","Allen P Pitts","thinkbusiness101@gmail.com","David Gayden","david.malay@att.net","Charles E Hammond","jirish7@msn.com","Ashley Demetra ","dashley61@att.net","Alan Dale Collard ","collardla@aol.com"]
[null,"Suzan K Brown ","suzbro248@aol.com","DANIEL  CAMPBELL","dec.campbell@gmail.com","RONALD S BEERS","rsbsouth@netzero.net","Rodney Tatum ","pamt328@aol.com","Metal Tech Products Inc","drumboogie1@gmail.com","Junior A Merino","heidiumerino@yahoo.com","Angel Accents Preschool & Daycare LLC","j_steiger@sbcglobal.net","Allostatix LLC","krothe@cinci.rr.com","Abdul Aziz","azizabdul10@yahoo.com","Judy M Green","judimgreen@bigfoot.com","Allen P Pitts","dj@amimobility.com","David S Malay ","1david.malay@att.net","Charles E Hammond","hammondtransportation@yahoo.com","Ashley Demetra ","oashley96@gmail.com","Alan Dale Collard ","acollard158@gmail.com"]
[null,"Tammie L Rodriguez ","tpfaffbrown@worldnet.att.net","Don Lilly","don_lilly@att.net","BEH Properties Inc","gameover.jo@gmail.com","Rodrigo Mendoza Hernandez","moralesrigo69@yahoo.com","Metro Detroit Barber College","metrodetbarber@yahoo.com","Kabob Garden 2 Inc","kabobgarden124@gmail.com","Angel L Delgado ","angeldorado76@yahoo.com","Alpha Associates Inc","fkmmd@aol.com","Able Wireless Solutions, Inc.","rt7485@att.com","Keisha Scott","keishabg4@yahoo.com","Allen P Pitts","jm@amimobility.com","David S Malay ","dwcastle@msn.com","Charles Holley ","howardknn@hotmail.com","Aurora Apacible ","aapacible@localnet.com","Alan J Washer ","alanwasher@hotmail.com"]
[null,"Tanya L Bennett ","tanyabennett1971@yahoo.com","Edgar Espada ","edgarespada526@gmail.com","Douglas D Behrens","gndouglas.behrens35@aol.com","Roger A & Jennifer M Jarrell II","jarrelln@cfw.com","Michael & Maryl Golden","mworks@gmail.com","Karen L Storey","karen.byrd@attb1.com","Anointed Word Christian Ministries Inc","tlamar2@comcast.net","Als Wings & Things Inc.","joihibbler05@gmail.com","Absar Haaris","ahaaris@aol.com","Kendell Hafford","kenlhafford@gmail.com","Allison S Daughn","rj@amimobility.com","David Wayne Castle","uparker@ddfcorporation.com","Charles Holley ","char510hwd@gmail.com","Aurora Apacible ","auring1935@yahoo.com","Alan J Washer ","pmalan@prodigy.net"]
[null,"Thelma J Ware ","bsp528@yahoo.com","ELI BRAXTON ","gwendk@yahoo.com","Bento Davie LLC","jimmycat89@aol.com","Ronald & Carnon Travis","rcranesr@go.com","Michael D Guthrie","mguthrie@mac.com","Karen Sanders ","kchristen@erols.com","Anthony Freeman","anthonyfreeman2239@yahoo.com","Alston Patricia A","freshmikey2254@gmail.com","Abundant Community Recovery Services","darryl_dewberry@hotmail.com","Kenneth Chenevert","kenchenii2000@gmail.com","Allison S Daughn","hottgurl4440@adelphia.net","David Wayne Castle","russellnehemiah@yahoo.com","Charles P Nutley ","charlesnutley@yahoo.com","Aurora Apacible ","niceguy_kev@hotmail.com","Alan J Washer ","alexthefallenangel665@gmail.com"]
[null,"Thomas A Hoyt ","thomashoyt@live.com","Fabelo Angel","afpapitofabelo@gmail.com","Todd Berrien ","harry.mccune@juno.com","Ruby Lewis ","rubyann1215@gmail.com","Michael Harding","feezellfs2013@att.net","Keith & Dana L Mcdaniel","blackwell0425@msn.com","Anthony Sarradet","asarradet@worldnet.att.net","Alt Medical Device Inc","nicolas@mdalt.com","Abundant Works Enrichment Services LLC","reeseburton7@yahoo.com","Kenneth Hawkins","kdh78r@yahoo.com","Allison S Daughn","adurbin85@yahoo.com","DDF Corp","homeofdunn11@gmail.com","Charles P Nutley ","shadyshade@adelphia.com","Austins Womack Exterminators Inc","tonyaustin@webtv.net","Albert C Bulls Construction Inc.","gbullssr@yahoo.com"]
[null,"Thomas Pearson ","magicwan33@sbcglobal.net","Fabricated Technologies Inc.","brandycasey@hotmail.com","Bhavana Anand","bhavana.anand@yahoo.com","Salam Slim ","sslieem21@frontiernet.net","Michael J Tracy ","michael.tracy@worldnet.att.net","Kellikidis Dino","jediyamato@aol.com","Antonio Johnson","antonio.johnson@msn.com","Alvin D Mays","amays0907@gmail.com","Academy Answering Service Inc","daniel.j.day@worldnet.att.net","Kenneth L David","kennethdavis18@yahoo.com","Alt Medical Device Inc","hottgurl4440@aol.com","DDF Corp","homeofdunn@tampabay.rr.com","Charles R Porter ","brian.kucha1@ccity.com","Austins Womack Exterminators Inc","info@nobuggs.com","Albert C Bulls Construction Inc.","george4@ou.edu"]
[null,"Timothy R Kuban ","harley6298@comcast.net","Foy Properties Inc","rebfoy@hotmail.com","Big Dog Demolition SE LLC","renisha_small@yahoo.com","Salam Zehra Slim ","sslieem21@frontiernet.net","Michael R Harris ","arselyochoa1@msn.com","Kelvin Brown ","leftyclutz04@yahoo.com","Aquadry Waterproofing LLC","cmaxson121@yahoo.com","Alvin F Lin ","aflin101@gmail.com","Accurate Exams Inc","scott@accurateexams.com","Kenneth Robinson","krobinson937@yahoo.com","Alt Medical Device Inc","melindaofften@gmail.com","Debra Dunn","kodab93@yahoo.com","Charles R Porter ","karen.porter@gmail.com","Ava M Teverbaugh ","avateverbaugh@yahoo.com","Alberta Craig ","albertacraig94@gmail.com"]
[null,"Timothy Wiley","r-martinez34@hotmail.com","Frankie Edmiston","jedmistonwj20@earthlink.net","Big Greeks Gyro LLC","msarris@angelfire.com","Samuel T Johnson","medical.johnson@gmail.com","Michael S Robbins ","dawn_m_wilson@hotmail.com","Kenneth Horvath ","staceyken@att.net","Arch City Hauling LLC","myhead2thesky@aol.com","Amanda Medical Inc","dj@amimobility.com","Accurate Land Surveyors Inc","robertlee.thompson@yahoo.com","Kenneth W Kunkel","hkkunkelo79@bellsouth.net","Alt Medical Device Inc","lewisbabygirl@aol.com","Debra Dunn","debbie.davis@gmail.com","Charolette Morrison","unamujer519@aol.com","Ava M Teverbaugh ","avateverbaugh@hotmail.com","Alex  Mera Harb ","harbalexa@gmail.com"]
[null,"Todd E Brown","chucknkim1973@juno.com","Frc Construction Llc","rebeccascodycat@aol.com","John S Billhimer","interproohio@yahoo.com","Sarah E Parsons ","sarahparsons@live.com","Michelle Reason ","michelle.eason@uspto.gov","Kenneth J Baker ","kenny2416@gateway.com","Armando Guevara","m1234lorente@gmail.com","Amber L Wilson","hottgurl4440@adelphia.net","Michael Ackerman","zajazpatricia@yahoo.com","Keyonte Bronson","kbronson1112@gmail.com","Alvin D Mays","lewpisbabygirl@aol.com","Debra L Davis ","eydebbie.davis80@gmail.com","Charolette Morrison","cherryalwaysbless@gmail.com","Ava M Teverbaugh ","avateverbaugh@gmail.com","Alexs Auto Care Inc","klh163@yahoo.com"]
[null,"Toni Stewart","tonistewart311@gmail.com","Fuad Masri ","cdorsey47@msn.com","Birmingham Dance Theatre Inc","inoj@bellsouth.net","Sarah E Welscher ","keithwelscher@yahoo.com","Michigan Temperature Services Llc","natannk@aol.com","Kevin Brian Cox","kevbcox1@yahoo.com","Arnisca D Gibbons Wilson","deseanwilson87@gmail.com","American Patrol Investigation","edwardjohnstonpi@yahoo.com","Adam S Parnell ","asparnell@gmail.com","Kimberly D Coleman","kimberlykaminsky@gmail.com","Alvin D Mays","adboxdirect@yahoo.com","Debra L Davis ","lisaeyster4@gmail.com","Cherry F Dudley ","cheryl@estilo.net","Backyard Pros, Llc","jonathan@backyardpros.net","Alexs Auto Care Inc","michael.hider@gmail.com"]
[null,"Tremaine R R Fowler ","gegefow@gmail.com","Gary L Hamilton","garywhamilton@yahoo.com","Black Crystal Consulting LLC","davedbm@gmail.com","Scott M Wayne ","w.scott@greatlips.net","Minerva Moya ","minerva.moya@hotmail.com","Kevin C Johnson Sr","kevin.johnson@adelphia.net","Amy Arnot","amylburleson@hotmail.com","Amos M Lewis","melindaofften@gmail.com","ADAMS SHENNA","ms.gonnamakeit@yahoo.com","Latrisha I Payne","inez_mitchell@msn.com","Alvin D Mays","lireyes50@hotmail.com","Debra L Davis ","dsproffitt@comcast.net","Cheryl Estilo ","jonathan.levy@earthlink.net","Backyard Pros, Llc","backyardpros@yahoo.com","Alexs Auto Care Inc","alaahider@gmail.com"]
[null,"TRI-EISC LLC","mattf@mac.com","Gary L Starks ","gesparks@yahoo.com","Edward Black ","hedwar55d.black@att.net","Shameca Whitfield ","christina.whitfield34@gmail.com","Misty Washington ","mistywright@dell.com","Kevin F. Walker","ctuusa@hotmail.com","Arocha & Jaquez DMD","marochadmd@gmail.com","Amp Energy","kevin@ampenergyllc.com","ADAMS TRIM DESIGNS INC","t.adams@ingaonline.com","Leslie Aretz","lesliearetz@gmail.com","Amanda Medical Inc","mreyes1523@yahoo.com","Decatur Country Club Inc.","deneka.allen@ameritrade.com","Christine A Duffy ","chris@stonecutterrecords.com","Bailey Telecommunications L L C","john_bailey@hotmail.com","Alfaro Miguel A","gen8992@roadrunner.com"]
[null,"Troy Rachel","rachall.trey91@gmail.com","Gary Machnik ","garymachnik@yahoo.com","Blue Sky Enterprises Inc","nursesparks@aol.com","Shandel Currie ","srcurrie251a@yahoo.com","Motumation Llc","mdahl1@gmail.com","Kevin W Stich ","memphisreservation@hotmail.com","Richard J Arrigo ","rarrigo@insight.rr.com","Simon Ampadu ","sampadu@gmail.com","Adeptcore Inc","alexzhr@yahoo.com","Marcus L Cobb","healthypursuitmedical@gmail.com","Amanda Medical Inc","andron@yahoo.com","Demetri Proffitt","bvdeneka.allen26@ameritrade.com","Christopher B Steinmetz ","ccardasis@twmi.rr.com","Bailey Telecommunications L L C","johnbailey@comcast.net","Alfreda Polk ","josieisok@yahoo.com"]
[null,"Vabview Llc","troyatgsmith@yahoo.com","Geller Robert H","rgeller@paulgordon.org","Michael Boczek ","mboczek@gmail.com","Shannon D Schofield ","sschofield@gmail.com","Muin Shreim ","shreimm@aol.com","Khamprasert Chamleunsouk ","chamleunsouk@comcast.net","Arthur Holmes","arthurholmes@tds.net","Eugene Amponsah","eugea2006@haoo.com","Joshua Adkins","jadkins72@yahoo.com","Melinda M Stewart","genesisdesign@cincic.com","Amanda Medical Inc","drewdrew8411@gmail.com","Deneka Stone ","gstone5595@gmail.com","Christopher Cardasis ","csdlcv@hotmail.com","Bailey Telecommunications L L C","cjacsyt@prodigy.net","Alfreda Polk ","x0apierce@bellsouth.net"]
[null,"Vajava L Burch","javablue60@gmail.com","Genero M Cofield ","jacqueline.cofield@yahoo.com","Bolin Reeves Florist Inc","jamie.bolinreeves@bellsouth.net","Shatereka N Thomas","tori26.tt@gmail.com","Neil Wright","jdnwright_mortgagebanker@hotmail.com","Kristina Gail Williams ","pganderson@lexhealth.org","Artistic Renovations of Ohio LLC","ken@artisticreno.com","Amy Mcmillan","amysue041081@yahoo.com","Admiration Inc","monicakmcbride@gmail.com","Adebola T Olowe Sr","jeaunita@gmail.com","Amber L Wilson","adaguilar20@gmail.com","Deneka Stone ","beammeup40@aol.com","Christopher D Crabtree ","mommy_102605@yahoo.com","Baking By Beth Ltd","beth.welch@yahoo.com","Ali Isaac","iali_06@yahoo.com"]
[null,"Vendetta Tiara Thomas Sr","v3ndtthomas@gmail.com","Genise Dash ","genise.dash@gmail.com","Mark Bolton ","federalhcs@gmail.com","Sheila Moore ","gamechick31@compuserve.com","Nerissa Goodman-session ","nerissasession@gmail.com","Kyle M Abrams ","abrams_kyle@yahoo.com","Ashley E Golden","misssuccess20@yahoo.com","Air Now Heating And Cooling Inc.","james@airnowhvac.com","Melissa J France","melissa.france@hotmail.com","Alexander J Hawke","hawkeaj@mail.uc.edu","Amber L Wilson","xaviersupergx@adelphia.net","Deneka Stone ","rebeccasinly@outlook.com","Christopher Garner ","teejay2442@yahoo.com","Baking By Beth Ltd","kjbeth.welch86@yahoo.com ","Ali Isaac","zekedis@hotmail.com"]
[null,"Veterans Construction Services Inc","nealjr@ksai.us","Gil S Cagbabanua","gcagbabanua@webtv.net","Bolts and Quarters Quilt Shop","theredneckquilter@yahoo.com","Shellia Jackson","lovelylovelysexy@yahoo.com","New Bangkok Cuisine Inc","miahah@hotmail.com","Ladell D Bonds ","ldell_33@yahoo.com","Ashley N Wiggs","awiggs8@gmail.com","Airdusco Inc.","dragonkatana@hotmail.com","Otis Lee Stevens","cerinstevens@yahoo.com","Amy Minor","amyjolee@comcast.net","Amber L Wilson","www.andreaab@umich.edu","Denise Nobles ","mwesnzkf@onsitecomputersinc.com","Christopher Garner ","dna92966@gmail.com","Baking By Beth Ltd","kjbeth.welch86@yahoo.com","All Custom Glass Inc","thruny@aol.com"]
[null,"Vivian Lawrence ","vivianlawrence2014@gmail.com","Gl Healthcare Inc","madel74@juno.com","Pete Bonner ","pecospete@attb1.com","Nicholas Gerard","plazear@blackplanet.com","Laura J Selph","laura.selph@ole.com","Lakisha  Knight","knightlakisha9@gmail.com","Ashlon Smith","charleswaters423@gmail.com","AK FA MO Inc","mrabah092@yahoo.com","Patricia Stevenson","keeley.patrick187@gmail.com","Beth M Adams","emt@gci.net","Amos M Lewis","andreaabrown@gmail.com","Denise Nobles ","killaklaw92@yahoo.com","Christopher Garner ","christopherking@netscape.net","Barbara Cannady ","bcannady@sbcglobal.net","All Custom Glass Inc","allcustomglass@aol.com"]
[null,"Wanda Cushinberry","wfarmer@adasmckinley.org","Glenesha Webster ","gwebster@yahoo.com","Suzanne O Boozer","sbrowning@redfieldgroup.com","Orlando W Adams Sr","orlandocadams@gmail.com","Lavon T Mayes ","peace197@lycos.com","Lane Trucking","jnjnn@address.com","Brian G. Storey","briangstorey@juno.com","Akosile Clement","tiwakosh@yahoo.com","Paul McMillan","dmcmillen2@woh.rr.com","Bryan D Bundy","bbundy2223@sbcglobal.net","Amos M Lewis","andreaab@umich.edu","Derrick L Miller ","dsaulsberry12@yahoo.com","Christopher H King ","seak@iquest.net","Barbara Cannady ","robx2mar@yahoo.com","All Custom Glass Inc","scottthrun@aol.com"]
[null,"Guriqbal Nandra ","tgnandraf29@rediffmail.com","Bradford Animal Care Etc","bonnieh@bellsouth.net","Trent R Boozer","angelrn22@aol.com","Pamela L Dagenhart ","volunteer59@bellsouth.net","Lechelle & Michael E Davenport","mrlawnmower@gmail.com","Ibrahim V Morris ","gia18cuba@gmail.com","Brooks Electrical Installation Inc.","jehxsickxuhx@comcast.net","Akron Erectors","tacticaladvisors@neo.rr.com","Stephanie Clay","supplymomma@hotmail.com","Caleb Seifu","c.seifu@yahoo.com","Amos M Lewis","strouse.james@yahoo.com","Derrick L Miller ","jdevine@devinesfa.com","Christopher H King ","flechlerchris@gmail.com","Barbara Cannady ","ibarbara.cannady25@worldnet.att.net","Als Wings & Things Inc.","joihibbler05@gmail.com"]
[null,"GWENDELYN D BRAXTON ","elibrax@yahoo.com","Brenda D Mccall","bmccall-ross@tivo.com","Christi Bourne ","crystalbenge@netzero.net","Patricia Calhoun ","blackroses91473@att.net","Leonard Ellison","franell@comcast.net","Isaac J Johnson","matownsel@yahoo.com","Anthony Sarradet","frankendad@bellsouth.net","Alan Dale Collard ","acollard158@gmail.com","Steven C Stewart","stephen.stewart3@worldnet.att.net","Carliss Payne","car-liss@hotmail.com","Ana Reyes","andrew.strouse@yahoo.com","Derrick Saulsberry","devonted92@gmail.com","Christopher J Flechler ","cjef2349@gmail.com","Battens Paint & Body Inc.","brookmock@icloud.com","Als Wings & Things Inc.","maragall@aol.com"]
[null,"Henley Dolmon","henleydolmon@gmail.com","Brenda S Cooks","bobbycooks@gmail.com","Jonathan R Bowers ","sjonathan.bowersk50@aol.com","Patricia Calhoun ","calhounp50@yahoo.com","Lisa M Leporowski ","lisaoneil0327@yahoo.com","J Aboud Llc","ehroy@msn.com","Antonio Johnson","tonyjohnson381975@gmail.com","Alan J Washer ","pmalan@prodigy.net","Steven E Ii Self","deadliestdiver@yahoo.com","Charles E Green","charlesg3967@gmail.com","Ana Reyes","pianowomn@hotmail.com","Derrick Saulsberry","jediyamato@aol.com","Christopher J Flechler ","cjef2349@gmail.com","Bennie D Harris ","bigronlee43@gmail.com","Als Wings & Things Inc.","jhibbler@worldnet.att.net"]
[null,"JAMES P CAMPBELL","jcampb6718@aol.com","Brian Butcher ","butcherbj@aol.com","Murtle Boykin Lighton","mwlighton@yahoo.com","Philip Esformes ","sherribesformes@aol.com","Loricks Auto Repair Llc","loricksauto@gmail.com","Jaletha A Smith ","micahmekhi@yahoo.com","Aquadry Waterproofing LLC","larrymaxson@worldnet.att.net","Albert C Bulls Construction Inc.","george4@ou.edu","Steven Wilson Harris","steve.harris@uswest.net","Chico D Chappell","cchappell002@cinci.rr.com","Ana Reyes","raymond_reid@hotmail.com","Devine Flooring & Design Inc.","m.kellikidis@yahoo.com","Christopher J Flechler ","cosleylaw@msn.com","Bennie D Harris ","bensworld@carolina.rr.com","Alvin F Lin ","aflin101@gmail.com"]
[null,"Jeffrey A Byer","jdbyers@southernco.com","Brian L Syas","dxbrianlsyas19@aol.com","Angel L Delgado ","angeldorado@hotmail.com","Psych Inc","brandtcarter@hotmail.com","Luis F Brathwaite ","lbrathw@juno.com","James & Sandra Dunkin","lasiano@aol.com","Armando Guevara","rosa_lorente@yahoo.com","Liborio Alcauter","estrada_0828@yahoo.com","Stuart I Wilson","destinyaquin@yahoo.com","Christopher Deveaux","cdeveaux@adelphia.net","Andran B Amey","xalexis7654@hotmail.com","Devonte Dixon ","mehanstad@gmail.com","Christopher M Cosley ","motoboy543@yahoo.com","Bennie D Harris ","bensworld9@ec.rr.com","Alvin F Lin ","blin696@gmail.com"]
[null,"John Bracy","tentwofifty.cb@gmail.com","Brittany M Henry","prettygirlglam@gmail.com","Angel August","taaugustg48@netzero.net","Rafael Garcia","rafaelgarcia50@gmail.com","Mack Tuggle & Sherila Jones -Tuggle","jmtuggle@aol.com","James & Susan M Edwards","act@earthlink.net","Arnisca D Gibbons Wilson","mswil2k@msn.com","Alexander David Jr","swcamie.alexander91@aol.com","Therese R Tobler","trtobler@aol.com","Chuck R Stidham","charlie.stidham@gmail.com","Andran B Amey","lalodelgado7@gmail.com","Dino Kellikidis ","don_lilly@att.net","Christopher S Datri ","wdn6woog46@aol.com","Billy Boyd. Jr","george.boyd@webtv.net","Alvin F Lin ","swimfreak8813@aol.com"]
[null,"Kellikidis Dino","m.kellikidis@yahoo.com","Brooks Services LLC","angelabrooks54@gmail.com","Susan L Augustine","susan@wearecreative.com","Rasheika Singleton ","sugarandspices@msn.com","Mamie S Beatty ","mamiebeatty@comcast.net","James M Gavin ","jimgym61@aol.com","Arocha & Jaquez DMD","kymiguelina.arocha46@verizon.net","Kevin Alexandersen","carmenmuslim@aol.com","Timothy S Martin","rikkim@iwarp.net","Connie H Smith","giorgio@enet.it","Andran B Amey","angeldorado@hotmail.com","Dino Kellikidis ","bokamash91@gmail.com","Christopher Woods","dn6woo@aol.com","Billy Boyd. Jr","ranbyd@bellsouth.net","Amp Energy","kevin@ampenergyllc.com"]
[null,"Luna-C Holdings ","dandbfire@hotmail.com","Brown Sales Associates Inc","arleyou@att.net","Avanti Poured Walls Inc","zagafil@hotmail.com","Raymond Cobb","cprather83@yahoo.com","Mark T & Misty J Weaver","mwaw100@hotmail.com","James W Thompson","marriel_thompson@yahoo.com","Artistic Renovations of Ohio LLC","tonygriffie@hotmail.com","Alexs Auto Care Inc","michael.hider@gmail.com","William Tobler","toblermd@compuserve.com","Connie Smith","connells@comcast.net","Andrea Daguilar","angeldorado76@yahoo.com","Diomo Llc","dcoleman@globalhue.com","Christopher Woods","cswoods73@yahoo.com","Bme Trucking Inc","brianenell@yahoo.com","Anderson Kamal Llc","hamptonmarshall@hamptonmarshall.com"]
[null,"Michael R Capuano","mcapuano@columbus.rr.com","Bruna Marketing Group Inc","brunaalexis@ymail.com","B and B Enterprises LLC","aculverhouse4@yahoo.com","Rebekah Garcia ","sdruihet@hotmail.com","Marshawn A Patterson","prettyboymap@yahoo.com","Janet F Tyra ","jtyra@bellsouth.net","Brian G. Storey","ems6415@gmail.com","Alfreda Polk ","x0apierce@bellsouth.net","8 Vikings Trucking Inc","devilishangel92804@yahoo.com","Darin Hall","vhunt31@yahoo.com","Andrea Daguilar","angi7070@yahoo.com","Don Lilly","drjohnson58@gmail.com","Christopher Woods","cierrapetties@yahoo.com","Bme Trucking Inc","brianenell@windstream.net","Anderson Kamal Llc","s.allen@hamptonmarshall.com"]
[null,"Omar Cardenas MD PA","ocardenasmd91@gmail.com","Bryan Mills","dalorean_mills@yahoo.com","William D Bair","ryannrio298@aol.com","Reizen Richard","rreizen@gouldratner.com","Marvin J Bridget D Bowie ","mbowie11@comcast.net","Jee H Kim ","jkim@charter.net","Brooks Electrical Installation Inc.","jeff@brookselectricalinc.net","Ali Isaac","zekedis@hotmail.com","818 LLC","ebanks89@yahoo.com","Deanna L Heflin Spells","deeannajewell@gmail.com","Andrea Daguilar","sissarickabaugh@gmail.com","Don Lilly","djjohnson58@comcast.net","Cierra Petties ","don_lilly@att.net","Bme Trucking Inc","victoriaenell@yahoo.com","Anderson Kamal Llc","sharadanielle@gmail.com"]
[null,"Richard A Brown","brynabrown@yahoo.com","Calbert Design Group LLC","rkcalbert@comcast.net","James H Banks","banksjs@netscape.com","Rickie W Jackson","tvlakes87@worldnet.att.net","Mary E Ryan ","mary48336@att.net","Jenkins Construction Inc","interventionmedia@yahoo.com","Antonio Johnson","a.t.johnson1975@gmail.com","All American Concrete LLC","albranci@sbcglobal.net","A Diaz Ramos ","adela@feda.com","Dennis A Denewitt","zots4zots@gmail.com","Andrew Brown","don_lilly@att.net","Donald A Coleman","khyrhonnjohnson@gmail.com","Citi Property Management Firm\r\n","bokamash91@gmail.com","Borden Family Electrical Inc.","jodynsusan@netscape.com","Andre Walton","andredreday30@gmail.com"]
[null,"Salam Zehra Slim ","zslim@comcast.net","Cardinal Land and Services LLC","jasonmccall@gmail.com","Banner Broach And Machine LLC","pbrainard5@aol.com","Robert Bell","bro_bell32@yahoo.com","Maury D Kommor","lamkommor@aol.com","Jerold Loftin","thiagovaladao@zipmail.com.br","Artistic Renovations of Ohio LLC","sue@artisticreno.com","All Custom Glass Inc","allcustomglass@aol.com","A Frame Awards Inc","broof@ameritech.net","Derrick Kassem","derrick.k@equityteam.com","Andrew Brown","bokamash91@gmail.com","Donald A Coleman","ms_behave75@yahoo.com","Citi Property Management Firm\r\n","xocthomas@aol.com","Borden Family Electrical Inc.","susbord@gmail.com","Andre Walton","grantmo@bc.edu"]
[null,"Sam G Caras","sam_caras@day-intl.com","Cardr Inc","irjmassey40@beginat.com","CAREN BARNES","cbarnes@unmc.edu","Robert E Bradbury ","rsturcke@centurytel.net","Megan M & William H Mays III","meganmp78@yahoo.com","Jerome A James ","jeromejames@address.com","Brian G. Storey","genestorey01@yahoo.com","All N1 Security Services Inc","rcrobinson04@yahoo.com","A G Dreco Inc.","agdreco@aol.com","Dorian Lacourse","silvershadow32@yahoo.com","Andrew Brown","edgarespada526@gmail.com","Donald J Johnson ","melinda.anderson@cs.com","Clarence L Thomas ","daltonc@alltell.net","Boris O Roman ","resengan1970@outlook.com","Andre Walton","andre_jeremiah08@yahoo.com"]
[null,"Sharon D Cannon","77chriscannon@gmail.com","Carey A Fowler","lorifowler15@gmail.com","James M Barton","xqjames.barton@earthlink.net","Robert L Marchese ","rmarchese@lycos.com","Melanie L & Acer V Nesbitt","melanie.shaw@flash.net","Jerron C Jones ","jcortezjones@hotmail.com","Brooks Electrical Installation Inc.","16190570@dummy.com","Gloria L Allen","gloria-tucker@att.net","AKA Electric Inc","jason.krish@aol.com","Duane Grigsby","kennethc19@aol.com","Andrew M Strouse","eveespada32@earthlink.net","Donald J Johnson ","misbehave@hotmail.com","Clay H Dalton","claydalton01@comcast.net","Boris O Roman ","broman1970@hotmail.com","Andrea M Bacon ","ocean1034@aol.com"]
[null,"Sidney N Jr Clouston ","oclouston@yahoo.com","Cargo Express Intercontinental","gialtuve@cs.com","Basha Karim Shamsi","karimshamsibasha@aol.com","Robin M Myrick","robin.myrick@yahoo.com","Melvin L Phillips ","melvinphillips@netzero.net","Joan C Huell ","jchuell@gmail.com","Don Lilly","don_lilly@att.net","Alliance Industrial Solutions LLC","wonder.bean@yahoo.com","A&L Insurance & Income Tax Inc","debbiefatal@yahoo.com","Eileen T Vester","fireleen@yahoo.com","Andrew M Strouse","reespadai95@earthlink.net","Donald J Johnson ","donny.greenfield@gmail.com","Clay H Dalton","clydschap@aol.com","Boris O Roman ","josemshuman@hotmail.com","Andrea M Bacon ","andrea.kirkland@blackplanet.com"]
[null,"Stanton M Mack ","stanmack@gmail.com","Carin Johnson","carina.robinson@erols.com","Bear Creek Trucking Inc","adeason1@ameritrade.com","Rodger L Harding ","rodgwgerharding74@msn.com","Michael & Maryl Golden","wntrberry@geocities.com","John W Reid ","reid.sem@gmail.com","Edgar Espada ","edgarespada526@gmail.com","Allison S Daughn","sdaughn@gmail.com","AB Diamond Corp LLC","randall@nursefinders.com","Elliot L Adams","xelliott.sadams54@hotmail.com","Andrew M Strouse","erasmo.hernandez@att.net","Donald J Melinda ","thp01@charter.net","Clyde Schap ","Completecomfortllc@gmail.com","Brantley Development Llc","brantley_development@yahoo.com","Andrea M Bacon ","andrea.kirkland@blackplanet.co"]
[null,"Steven M Such","ssuch716@gmail.com","Christine Brown","christiford2018@gmail.com","Oliver H Beaven","ohioaviator64@gmail.com","Rodney G Patterson ","esenshel@gmail.com","Michael D Guthrie","mikeomatic@aol.com","Jose Perez Alonso ","cctr4@aol.com","Eugene Storey","ems6415@gmail.com","Alpha Associates Inc","fkmmd@comcast.com","Abdul Aziz","aziziabdul10@yahoo.com","Eric R Beach","morehemp@hotmail.com","An Angel For You, dba Visiting Angels Of Sussex County","erasmo.guzman@gmail.com","Donald J Melinda ","meghan.peters@comcast.net","Complete Comfort Llc","kevinbishop@gmail.com","Brian F Benn \n Maren A","bbenn45@gmail.com","Andrew Anderson ","andersonandrew@comic.com"]
[null,"Sue Cabadas Dds Llc ","mariseline7068@gmail.com","DANIEL  CAMPBELL","dec.campbell@yahoo.com","Daniel J Beers II","djbeers@costsharingsolutions.com","Rodrigo Mendoza Hernandez","trodrigo.moralesj74@netzero.net","Michael Harding","elbarco@bellsouth.net","Joshua Salonich ","yasuhiro95lierman.xe95@outlook.com","Fabelo Angel","afpapitofabelo@gmail.com","Als Wings & Things Inc.","maragall@aol.com","Able Wireless Solutions, Inc.","blue_blazin@att.net","Hemptations","morehemp@hotmail.com","An Angel For You, dba Visiting Angels Of Sussex County","vervasmo.hernandez@att.net","Donald J Melinda ","dmprice2300@address.com","Comprehensive Industrial Services, Inc.","james@scaffe.com","Brian F Benn \n Maren A","brian@bergconstruction.com","Andrew Anderson ","xandyan@juno.com"]
[null,"Sunday Nwankpa ","ceyx33@gmail.com","Don Lilly","bokamash91@gmail.com","BEH Properties Inc","brentharmon@bellsouth.net","Roger A & Jennifer M Jarrell II","vmirog@gmail.com","Michael J Tracy ","mtracy84@comcast.net","Julie Albano ","jpaolillo@gmail.com","Fabricated Technologies Inc.","brandycasey@hotmail.com","Alston Patricia A","palston@sbcglobal.net","Absar Haaris","gallardosystems@yahoo.com","Judy M Green","judig2819@juno.com","An Angel For You, dba Visiting Angels Of Sussex County","mcbaymon@yahoo.com","Dontae J Greenfield ","magdanieves0125@hotmail.com","Compustation","r.scaffe@gmail.com","Brian F Benn \n Maren A","mbenn@live.com","Andrew Anderson ","andya@mckinstry.com"]
[null,"Suzan K Brown ","piassapassa2008@gmail.com","Edgar Espada ","eveespada32@earthlink.net","Todd Berrien ","kmccune@columbus.rr.com","Ronald & Carnon Travis","rb137@webtv.net","Michael R Harris ","michae.harris5@netzero.net","Junior A Merino","mutbvn@gmail.com","Foy Properties Inc","rebfoy@hotmail.com","Alvin D Mays","amsmusicsouth@gmail.com","Abundant Community Recovery Services","abundantcommunityrecoveryserv@gmail.com","Kendell Hafford","zone_15@blackplanet.com","Angel L Delgado ","baymoneric@gmail.com","Driver Logistics Llc","magrath@tiki.net","Compustation","clmallett@dmc.org","Brian P Anzel ","emilia_a_bg@yahoo.com","Andrew Anderson ","aanderson@gmail.com"]
[null,"Tammie L Rodriguez ","tamara.rodriguez@att.net","ELI BRAXTON ","elibrax@yahoo.com","Bhavana Anand","p8bhavana.anand@epix.net","Ruby Lewis ","blakevictoria@sbc.net","Michael S Robbins ","msrobbins2000@yahoo.com","Karen Sanders ","1kchristen@erols.com","Frankie Edmiston","jedmistonwj20@earthlink.net","Alvin F Lin ","blin696@gmail.com","Abundant Works Enrichment Services LLC","theresa.battles@yahoo.com","Kenneth Chenevert","kenchenii2000@yahoo.com","Angel L Delgado ","erich1126@yahoo.com","E & M Services, Llc","taras_box2@yahoo.com","Conrad L Mallett Jr","c.mallett@dmc.org","Brittany M Jordan ","braxtonsmommy0914@yahoo.com","Andrew Anderson ","johnnydangerous@yahoo.com"]
[null,"Tanya L Bennett ","tanya.bennett97@yahoo.com","Fabelo Angel","angelfabelo@ymail.com","Big Greeks Gyro LLC","mmsarrisf37@angelfire.com","Salam Slim ","zslim@comcast.net","Michelle Reason ","effie.eason@bea.gov","Keith & Dana L Mcdaniel","pecotrain222@gmail.com","Frc Construction Llc","rebeccascodycat@aol.com","Amanda Medical Inc","jm@amimobility.com","Academy Answering Service Inc","kathy.day1@cox.net","Kenneth Hawkins","hawk@techie.com","Angel L Delgado ","kerik.salguerox56@hotmail.com","E & M Services, Llc","edgarespada526@gmail.com","Conrad L Mallett Jr","antposso@gmail.com","Brock Kowske ","brockek@hotmail.com","Andrew G Meyer ","andrew.myer@gmail.com"]
[null,"Thelma J Ware ","sdruihet@hotmail.com","Fabricated Technologies Inc.","lpbrandyapid72@aol.com","John S Billhimer","idletime@bellsouth.net","Salam Zehra Slim ","zslim@comcast.net","Minerva Moya ","mmr-23@hotmail.com","Kellikidis Dino","m.kellikidis@yahoo.com","Fuad Masri ","cdorsey47@msn.com","Amber L Wilson","adurbin85@yahoo.com","Accurate Exams Inc","stischler@accurateexams.com","Kenneth L David","kennybutt43@gmail.com","Angela D Jansen","erik.salguero@yahoo.com","E Reynga Gonzalez ","eveespada32@earthlink.net","Consuelo I Posso ","possoconnie@yahoo.com","Brook Street Enterprises Llc","hughes.richard@gmail.com","Andrew G Meyer ","blink0298@aol.com"]
[null,"Timothy R Kuban ","nugentnut@cox-internet.com","Foy Properties Inc","rebeccajordan@address.com","Birmingham Dance Theatre Inc","inoj@comcast.net","Sarah E Parsons ","dr.sarahparsons@gmail.com","Misty Washington ","mwright0728@comcast.net","Kelvin Brown ","zachary.yap@gmail.com","Gary L Hamilton","garywhamilton@yahoo.com","American Patrol Investigation","ejohnston@apisecurity.us","Accurate Land Surveyors Inc","rob.lee1976@yahoo.com","Kenneth Robinson","krobinson937@gmail.com","Angela D Jansen","zerik.salguerok91@hotmail.com","E Reynga Gonzalez ","reespadai95@earthlink.net","Consuelo I Posso ","cposso@horwitzlaw.com","Brook Street Enterprises Llc","rickehughes@gmail.com","Andrew G Meyer ","meyerseven@aol.com"]
[null,"Todd E Brown","kbrown53@aol.com","Frankie Edmiston","fran3231@gmail.com","Black Crystal Consulting LLC","drivercub1@yahoo.com","Scott M Wayne ","scottw3958@aol.com","Motumation Llc","michaeldahl@netzero.net","Kenneth Horvath ","kenhorvath@ymail.com","Gary L Starks ","gesparks@yahoo.com","Amos M Lewis","lewisbabygirl@aol.com","Adam S Parnell ","xyloboeman@hotmail.com","Kenneth W Kunkel","hkkunkel0@bellsouth.net","Angela D Jansen","larst@aol.com","Eazy Mobile Inc","edgarespada526@gmail.com","Consuelo I Posso ","cciguchi5@cs.com","Bryan Craig ","bcraig@burlingbuilders.com","Andrew H Katherine L Leutheuser ","andyleutheuser2@gmail.com"]
[null,"Tremaine R R Fowler ","liv4money@yahoo.com","Fuad Masri ","fuadmasri4791@gmail.com","Edward Black ","kedkward.black@att.net","Shameca Whitfield ","shamecaso_sexy21@yahoo.com","Neil Wright","neilw3434@gmail.com","Kevin Brian Cox","kcox4058@hotmail.com","Gary Machnik ","garymachnik@yahoo.com","Eugene Amponsah","eugenea021@gmail.com","ADAMS SHENNA","ssheffield@ameritrade.com","Kimberly D Coleman","hornemarlon@gmail.com","Don Lilly","ibrkthngs@aol.com","Edgar Espada","eveespada32@earthlink.net","Core It Solutions Grp Inc","ciguchiw5@cs.com","Bujar Inc","shpresam@yahoo.com","Andrew H Katherine L Leutheuser ","andyleutheuser7@gmail.com"]
[null,"Vabview Llc","dulcineab4@aol.com","Gary L Hamilton","pattyhamilton1979@gmail.com","Michael Boczek ","bozer22@aol.com","Shandel Currie ","scurrie@emich.edu","Nerissa Goodman-session ","bachlor22@blackplanet.com","Kevin C Johnson Sr","digitalbykj@hotmail.com","Geller Robert H","rgeller@paulgordon.org","Amy Mcmillan","amymcmillen@gmail.com","ADAMS TRIM DESIGNS INC","cesar49n@yahoo.com","Latrisha I Payne","latrisha.payne@gmail.com","Don Lilly","ibrkthngs@netscape.com","Edgar Espada","reespadai95@earthlink.net","Core It Solutions Grp Inc","ouciguchi61@cs.com","Bukola M Bello ","almondjoy16@hotmail.com","Andrew Ramsey","efd583@msn.com"]
[null,"Vajava L Burch","jjavaburchs66@yahoo.com","Gary L Starks ","gesparks119@yahoo.com","Bolin Reeves Florist Inc","jamie.bolinreeves@gmail.com","Shannon D Schofield ","william.schofield4@comcast.net","New Bangkok Cuisine Inc","abdul.bronze@yahoo.com","Kevin W Stich ","kevinstich@gmail.com","Genero M Cofield ","jacqueline.cofield@yahoo.com","Air Now Heating And Cooling Inc.","merritt@airnowhvac.com","Adeptcore Inc","zhirovetshkiy@optonline.net","Leslie Aretz","lesliearetz@aol.com","Edgar Espada ","dethel.hallb78@bright.net","Edgar Espada","eguajardo9@yahoo.com","Core It Solutions Grp Inc","cocoaloungeboy@yahoo.com","Bukola M Bello ","almondjoy16@sbcglobal.net","Andrew Ramsey","overcomersholdings@gmail.com"]
[null,"Vendetta Tiara Thomas Sr","vendtthomas@gmail.com","Genero M Cofield ","jacquelinecofield@bigfoot.com","Mark Bolton ","markboltonmd@hotmail.com","Shatereka N Thomas","ctarver819@att.net","Lavon T Mayes ","peace6408@gmail.com","Khamprasert Chamleunsouk ","chio@blackplanet.com","Genise Dash ","genise.dash@gmail.com","Airdusco Inc.","stephen.lancaster@worldnet.att.net","Joshua Adkins","jason.r.goldberg@gmail.com","Marcus L Cobb","integrativemlcmd@gmail.com","Edgar Espada ","ethelhall@comcast.net","Edgar Espada ","pstrkj5848@aol.com","Craig Jon Nalls","cnalls01@gmail.com","Burns Ross","dumb-ed@stupid.com","Andrew Ramsey","nbbc2004@gmail.com"]
[null,"Veterans Construction Services Inc","nealkrantz@earthlink.net","Genise Dash ","dashdenise@yahoo.com","Suzanne O Boozer","sweetapplefarm1@att.net","Sheila Moore ","renaepayton@hotmail.com","Lechelle & Michael E Davenport","mrlawnmower50@gmail.com","Kristina Gail Williams ","pganderson@gmail.com","Gil S Cagbabanua","gcagbabanua@webtv.net","AK FA MO Inc","joannerabah@hotmail.com","Melissa J France","melissa.france@webtv.net","Melinda M Stewart","theo134@hotmail.com","Edgar Espada ","afpapitofabelo@gmail.com","Edgar Espada ","epeecher@concentric.net","Craig Jon Nalls","nallsc01@yahoo.com","Burns Ross","pentiumone133@gmail.com","Andrew Salerno ","abmks123@yahoo.com"]
[null,"Vivian Lawrence ","vivianlawrence2010@yahoo.com","Gil S Cagbabanua","gd110700@yahoo.com","Christi Bourne ","crysbenge77@gmail.com","Shellia Jackson","brights@lebonheur.org","Lisa M Leporowski ","lisaleporowski@yahoo.com","Ladell D Bonds ","lbonds33@gmail.com","Gl Healthcare Inc","madel74@juno.com","Akosile Clement","cakosile@ameritrade.com","Patricia Stevenson","patricia.malone@ameritrade.com","Adebola T Olowe Sr","adebola@ureach.com","Erasmo Jr Hernandez ","angelfabelo@ymail.com","Edgar Espada ","edpeecher@gmail.com","Craig Jon Nalls","info@creativespiritsonline.com","Burns Ross","wross36@hotmail.com","Andrew Salerno ","msalerno914@yahoo.com"]
[null,"Wanda Cushinberry","iwfarmern40@adasmckinley.org","Gl Healthcare Inc","vtmcydelmallari2@hotmail.com","Jonathan R Bowers ","jonathan.bowersoy20@aol.com","Orlando W Adams Sr","hurrcne1@netzero.com","Luis F Brathwaite ","lbrathw1@juno.com","Lakisha  Knight","knightlakisha150@yahoo.com","Glenesha Webster ","gwebster@yahoo.com","Alan J Washer ","alexthefallenangel665@gmail.com","Paul McMillan","nurseangel03@gmail.com","Beth M Adams","emt71@webtv.com","Erasmo Jr Hernandez ","caren_zbot2@yahoo.com","Edilberto Guajardo ","wilbe1@usachoice.com","Creative Spirits Networks Inc","ccruce1@sbcglobal.net","Calvita J Frederick ","csowell@redflex.com","Angel Fabelo ","afpapitofabelo@gmail.com"]
[null,"Henley Dolmon","simplesolutiontaxes@gmail.com","Glenesha Webster ","xnesha.webstert69@yahoo.com","Murtle Boykin Lighton","myrtle@mailcity.com","Patricia Calhoun ","robbinsrule@compuserve.com","Mack Tuggle & Sherila Jones -Tuggle","macktuggle@yahoo.com","Lane Trucking","hiltbar@aol.com","Guriqbal Nandra ","gnandraau52@rediffmail.com","Alexander David Jr","davidalexander1880@yahoo.com","Steven C Stewart","k.1965@hotmail.com","Caleb Seifu","avenuecincy33@gmail.com","Erasmo Jr Hernandez ","jammi_fk@yahoo.com","Edward Peecher ","\nemartin-drake@verizon.net","Crystal D Cruce ","jscully@vanstar.com","Cara E Dunning ","caradunning1@gmail.com","Angel Fabelo ","angelfabelo@ymail.com"]
[null,"JAMES P CAMPBELL","ether322@sbcglobal.net","Bradford Animal Care Etc","sbabylonix@comcast.net","Angel L Delgado ","angeldorado76@yahoo.com","Patricia Calhoun ","calhoun_patricia@att.net","Mamie S Beatty ","mamie.beatty@sbcglobal.net","Ibrahim V Morris ","ibrahim.valdes@yahoo.com","Henley Dolmon","ourtaxemail@yahoo.com","Kevin Alexandersen","kalexandersen@gsfn.com","Steven Wilson Harris","steve.harris@address.com","Charles E Green","runningfox75@gmail.com","Eric Baymon ","tecaren_zbot217@yahoo.com","Edward Peecher ","\nedrake421@gmail.com","Crystal D Cruce ","crystal.cruce@sbcglobal.net","Cara E Dunning ","cdunning@hotmail.com","Angel L Delgado","lalodelgado7@gmail.com"]
[null,"John Bracy","john.bracey@gmail.com","Brenda D Mccall","bmccallross@tivo.com","Susan L Augustine","susan.augustine@gmail.com","Psych Inc","apprec980acw@yahoo.com","Mark T & Misty J Weaver","a4arrows@hotmail.com","J Aboud Llc","james.aboudln51@yahoo.com","Hey Angela Inc","wisniewski.angela@gmail.com","Alexs Auto Care Inc","alaahider@gmail.com","Stuart I Wilson","stuart_willison@yahoo.com","Chico D Chappell","ms.takia@yahoo.com","Eric Baymon ","mfaysal1@yahoo.com","Edward Peecher ","veban@aol.com","Crystal D Cruce ","johnsonman37@yahoo.com","Cara E Dunning ","carad@go.com","Angel L Delgado","angeldorado@hotmail.com"]
[null,"Omar Cardenas MD PA","ocardenas@bigfoot.com","Brian Butcher ","pdbrian.butcher91@gmail.com","Avanti Poured Walls Inc","dvpolsinelli@sbcglobal.net","Rafael Garcia","rafael.colon@hotmail.com","Marshawn A Patterson","prettyboymap@compuserve.com","James & Susan M Edwards","acjames@needspeed.com","Don Lilly","bokamash91@gmail.com","All Custom Glass Inc","scottthrun@aol.com","Timothy S Martin","timtherepairman@att.net","Christopher Deveaux","thejehn@gmail.com","Eric L Harper ","luv@gci.net","Edwin Wilbert Jr","banks.vera@gmail.com","Curtis A Johnson","johnson_renay@yahoo.com","Carey M Dowdle ","cdowdle@ameritrade.com","Angel L Delgado","angeldorado76@yahoo.com"]
[null,"Salam Zehra Slim ","sami2076@hotmail.com","Brittany M Henry","copela48@msu.edu","James H Banks","burkey.jssm@hotmail.com","Rasheika Singleton ","ed@edgallimore.com","Mary E Ryan ","merzie@email.com","Janet F Tyra ","drtcleaning@aol.com","Edgar Espada ","eveespada32@earthlink.net","All N1 Security Services Inc","rrobinson@alln1security.com","William Tobler","toblermd@hotmail.com","Chuck R Stidham","cstidham@comcast.net",null,null,"Elaine M Drake","veban777@ssbcglobal.net","Curtis A Johnson","jjwydick@gmail.com","Carey M Dowdle ","carey@dowdle.net","Angel L Delgado ","lalodelgado7@gmail.com"]
[null,"Sidney N Jr Clouston ","oclouston@live.com","Bruna Marketing Group Inc","jbruna1@gmail.com","Basha Karim Shamsi","karimshamsibasha@gmail.com","Raymond Cobb","ricobbray40@bellsouth.net","Maury D Kommor","kommor@kommorlaw.com","Jee H Kim ","jkim17@roadrunner.com","Eugene Storey","genestorey01@yahoo.com","Gloria L Allen","gtucke0414@yahoo.com","8 Vikings Trucking Inc","devilishangel92804@yahoo.com","Connie H Smith","adeae341@aol.com",null,null,"Elaine M Drake","brunsvol@chapman.com","Curtis A Johnson","dpmcfall@yahoo.com","Carl E Volz ","montecarl@hotmail.com","Angel L Delgado ","angeldorado@hotmail.com"]
[null,"Stanton M Mack ","lisamarielmm@aol.com","Calbert Design Group LLC","zachary.calbert@gmail.com","Daniel J Beers II","dbeers20@gmail.com","Rebekah Garcia ","beckypennethy@tivejo.com","Megan M & William H Mays III","tigergrd78@aol.com","Jenkins Construction Inc","jim.jenkins@jenkinsconstruction.com","Fabelo Angel","angelfabelo@ymail.com","Allison S Daughn","allison.daughn@baycare.org","A Diaz Ramos ","fedaadela@hotmail.com","Connie Smith","ruconnells50@comcast.net",null,null,"Elijah R Banks ","elizabeth.brunsvold@netscape.net","Dan McFall ","bubba71574@comcast.com","Carl E Volz ","montecarl@comcast.net","Angel L Delgado ","angeldorado76@yahoo.com"]
[null,"Tammie L Rodriguez ","tamlbrown@yahoo.com","Cargo Express Intercontinental","imeldaven@hotmail.com","Todd Berrien ","kmccune@msn.com","Rickie W Jackson","aimee422@earthlink.com","Melvin L Phillips ","melvin.phillips@cancer.org","Jerold Loftin","jagcheezy@yahoo.com","Fabricated Technologies Inc.","lpbrandyapid72@aol.com","Als Wings & Things Inc.","jhibbler@worldnet.att.net","A Frame Awards Inc","broof@aframeawards.com","Darin Hall","darinhunt46@gmail.com",null,null,"Elijah R Banks ","\nelizabeth@iiaweb.com","Dan McFall ","grshermom@aol.com","Carl E Volz ","lindseyvolz123@gmail.com","Angela J Lewis","alewis2@msn.com"]
[null,"Thelma J Ware ","beckypennethy@tivejo.com","Carin Johnson","robinsoncarina@yahoo.com","Bhavana Anand","wwbhavana.anand27@aol.com","Robert Bell","rwaldo@capecod.net","Michael & Maryl Golden","michael@dulcimerguy.com","Jerome A James ","qjerome.jamesv69@eudoramail.com","Foy Properties Inc","rebeccajordan@address.com","Alston Patricia A","edpat123@gmail.com","A G Dreco Inc.","maine293.co@gmail.com","Deanna L Heflin Spells","deeanna6969@gmail.com",null,null,"Elijah R Banks ","\neliz_kendall@yahoo.com","Daniel D Sherman ","grshermom@blackplanet.com","Carl Harris ","suzannearmin@gmail.com","Angela J Lewis","chisyittle@yahoo.com"]
[null,"Timothy R Kuban ","harley66298@yahoo.com","Christine Brown","christiford2015@gmail.com","Big Greeks Gyro LLC","msarrislp98@angelfire.com","Rodger L Harding ","rodgerharding41@msn.com","Michael D Guthrie","thememphoman@gmail.com","John W Reid ","johnlreid@worldnet.att.net","Frankie Edmiston","fran3231@gmail.com","Alvin D Mays","thinkbusiness101@gmail.com","AKA Electric Inc","angelaaliz2001@gmail.com","Eileen T Vester","eileenffg@gmail.com",null,null,"Elizabeth C Brunsvold","elmachatman@yahoo.com","Daniel D Sherman ","dmerrion@gmail.com","Carl Harris ","carlaha@attb1.com","Angela J Lewis","sassybutterfly@yahoo.com"]
[null,"Vabview Llc","familycourtheroes@hotmail.com","DANIEL  CAMPBELL","camzthe1@earthlink.net","Birmingham Dance Theatre Inc","joniscofield@gmail.com","Rodney G Patterson ","gerrittnyc@aol.com","Michael Harding","mpswharding@bellsouth.net","Jose Perez Alonso ","llaura.esquivelw98@aol.com","Fringe, Inc.","fran3231@gmail.com","Alvin F Lin ","swimfreak8813@aol.com","A&L Insurance & Income Tax Inc","sfatal@centurytel.net","Hemptations","hemptations@yahoo.com",null,null,"Elizabeth C Brunsvold","loechatman17@themanors.net","Daniel J Merrion ","rdmerrioni53@verizon.net","Carl Harris ","carla.m.harris123@gmail.com","Angela L Walker ","adam23@ameritrade.com"]
[null,"Vendetta Tiara Thomas Sr","vendettathomas89@gmail.com","Edgar Espada ","reespadai95@earthlink.net","Black Crystal Consulting LLC","ange2838@comcast.com","Ronald & Carnon Travis","ronald.crane@cs.com","Michael J Tracy ","jftracyslp@tivejo.com","Junior A Merino","jrbeveragemanager@yahoo.com.mx","Fuad Masri ","fuadmasri4791@gmail.com","Amanda Medical Inc","rj@amimobility.com","AB Diamond Corp LLC","cfis4me@aol.com","Kendell Hafford","ken@one.net",null,null,"Elizabeth Kendall","elsa.torreon@gmail.com","Daniel J Merrion ","dmerrion@hotmail.com",null,null,"Angela L Walker ","awalker49047@gmail.com"]
[null,"Veterans Construction Services Inc","nealkrantzjr@gmail.com","ELI BRAXTON ","elibraxton@hotmail.com","Edward Black ","edward.blackl4@att.net","Salam Slim ","sami2076@hotmail.com","Michael R Harris ","michael.harris@ge.com","Karen Sanders ","karen@astro-physics.com","Gary L Hamilton","pattyhamilton1979@gmail.com","Amber L Wilson","hottgurl4440@aol.com","Abundant Works Enrichment Services LLC","battle@uakron.edu","Kenneth Chenevert","kenchenii2000@msn.com",null,null,null,null,null,null,null,null,"Angela L Walker ","tanrw@msn.com"]
[null,"Vivian Lawrence ","whiteboyeddie@gmail.com","Fabricated Technologies Inc.","ylbrandyapid@aol.com","Michael Boczek ","bozer@webtv.net","Salam Zehra Slim ","sami2076@hotmail.com","Minerva Moya ","mmoya@amfam.com","Kelvin Brown ","kevinbrown1985@gmail.com","Gary L Starks ","gesparks119@yahoo.com","Amos M Lewis","lewpisbabygirl@aol.com","Academy Answering Service Inc","kathy.day42@cox.net","Kenneth Hawkins","ken@boredonearth.com",null,null,null,null,null,null,null,null,"Anne Lowry ","ojl100@yahoo.com"]
[null,"Wanda Cushinberry","lowfarmer66@adasmckinley.org","Genise Dash ","babyg2001@blackplanet.com","Mark Bolton ","sboltonrn@hotmail.com","Shameca Whitfield ","whitfieldchristina27@gmail.com","Misty Washington ","sangria_wright@yahoo.com","Kenneth Horvath ","damdylmatt@yahoo.com","Genero M Cofield ","jacquelinecofield@bigfoot.com","Eugene Amponsah","eugea2006@haoc.com","Accurate Exams Inc","accurateexams@cox.net","Kenneth L David","lazyman1992@hotmail.com"]
[null,"Gil S Cagbabanua","lig0914@yahoo.com","Gil S Cagbabanua","lig0914@yahoo.com","Christi Bourne ","benge_crystal77@hotmail.com","Shandel Currie ","strac5@hotmail.com","Neil Wright","allurevision@gmail.com","Kevin W Stich ","stevenconley@gmail.com","Genise Dash ","dashdenise@yahoo.com",null,null,"Accurate Land Surveyors Inc","thompson.rob@yahoo.com","Kenneth Robinson","pkrobinson937w55@hotmail.com"]
[null,"Gl Healthcare Inc","mmallari@gmail.com","Gl Healthcare Inc","mmallari@gmail.com","Murtle Boykin Lighton","boykinl575@aol.com","Sheila Moore ","renaepayton@yahoo.com","Nerissa Goodman-session ","nwarne1@verizon.net",null,null,"Gil S Cagbabanua","gd110700@yahoo.com",null,null,"Shenna Adams","agraham27@gmail.com","Kenneth W Kunkel","kkunkels1@bellsouth.net"]
[null,"Glenesha Webster ","boston49963@gmail.com","Glenesha Webster ","boston49963@gmail.com",null,null,"Shellia Jackson","sheila.bright@adelphia.net","New Bangkok Cuisine Inc","bengalithuglife@hotmail.com",null,null,"Gl Healthcare Inc","vtmcydelmallari2@hotmail.com",null,null,"Adeptcore Inc","alexanderz@gmail.com","Leslie Aretz","lesliearetz@tivejo.com"]
[null,null,null,null,null,null,null,null,null,null,null,null,null,"Glenesha Webster ","xnesha.webstert69@yahoo.com",null,null,"Joshua Adkins","kpjoshua.adkins84@netscape.net"]
[null,null,null,null,null,null,null,null,null,null,null,null,null,"Guriqbal Nandra ","tgnandraf29@rediffmail.com"]
[null,null,null,null,null,null,null,null,null,null,null,null,null,"Henley Dolmon","henleydolmon@gmail.com"]
[null,null,null,null,null,null,null,null,null,null,null,null,null,"Edgar Espada ","reespadai95@earthlink.net"]
[null,null,null,null,null,null,null,null,null,null,null,null,null,"Eugene Storey","genestorey01@gmail.com"]
[null,null,null,null,null,null,null,null,null,null,null,null,null,"Fabricated Technologies Inc.","ylbrandyapid@aol.com"]
[null,null,null,null,null,null,null,null,null,null,null,null,null,"Genise Dash ","babyg2001@blackplanet.com"]
[null,null,null,null,null,null,null,null,null,null,null,null,null,"Gil S Cagbabanua","lig0914@yahoo.com"]
[null,null,null,null,null,null,null,null,null,null,null,null,null,"Gl Healthcare Inc","mmallari@gmail.com",null,null,null,null,null,null,null,null,null,null,{"$f":"_xlfn.XMATCH(AA95,_xlfn.TOCOL(LeadTable[[E-mail1]:[E-mail3]],1,),0)","v":1232}]
[null,null,null,null,null,null,null,null,null,null,null,null,null,"Glenesha Webster ","boston49963@gmail.com"]
[null,null,null,null,null,null,null,null,null,null,null,null,null,"Henley Dolmon","simplesolutiontaxes@gmail.com"]

{"sheet":"BadList","index":2,"n_rows":279,"n_cols":10,"rows_kept":279,"cut":false,"hidden":false,"merged":[[1,1,18,1],[1,2,18,2],[1,5,10,5],[11,5,22,5]]}
["Do Not Send Address",null,null,"Email List from MailMerge","New",null,null,null,"Total bad","New Bad"]
["fedaadela@yahoo.com","<<<  \nList of our email addresses (from \"Leads\") that are either not valid and/or have requested to unsubscribe\n<<<",">>>\nUnsubscribe or bad addresses from MailMerge or other lists\n>>>","1david.malay@att.net",{"$f":"IF(ISBLANK($D2),\"\",IF(ISNA(MATCH($D2,TRIM(DoNotSendList[Do Not Send Address]),0)<>0),D2,\"\"))","v":"1david.malay@att.net"},"<<<\nLists comparison showing addresses that are not on our list\n<<<",null,null,{"$f":"COUNTA(DoNotSendList[Do Not Send Address])","v":193},{"$f":"COUNTA(Table3[New])-COUNTIF(Table3[New],\"\")","v":91}]
["adela@feda.com",null,null,"1kchristen@erols.com",{"$f":"IF(ISBLANK($D3),\"\",IF(ISNA(MATCH($D3,TRIM(DoNotSendList[Do Not Send Address]),0)<>0),D3,\"\"))","v":""}]
["fedaadela@hotmail.com",null,null,"aapacible@localnet.com",{"$f":"IF(ISBLANK($D4),\"\",IF(ISNA(MATCH($D4,TRIM(DoNotSendList[Do Not Send Address]),0)<>0),D4,\"\"))","v":""}]
["agdreco@aol.com",null,null,"aaron@milstead.com",{"$f":"IF(ISBLANK($D5),\"\",IF(ISNA(MATCH($D5,TRIM(DoNotSendList[Do Not Send Address]),0)<>0),D5,\"\"))","v":""},null,{"$f":"_xlfn.UNIQUE(Table3[New])","v":"1david.malay@att.net"}]
["aaron@milstead.com",null,null,"accurateexams@cox.net",{"$f":"IF(ISBLANK($D6),\"\",IF(ISNA(MATCH($D6,TRIM(DoNotSendList[Do Not Send Address]),0)<>0),D6,\"\"))","v":""},null,""]
["darryl_dewberry@hotmail.com",null,null,"acjames@needspeed.com",{"$f":"IF(ISBLANK($D7),\"\",IF(ISNA(MATCH($D7,TRIM(DoNotSendList[Do Not Send Address]),0)<>0),D7,\"\"))","v":"acjames@needspeed.com"},null,"acjames@needspeed.com"]
["xyloboeman@hotmail.com",null,null,"acjames52@yahoo.com",{"$f":"IF(ISBLANK($D8),\"\",IF(ISNA(MATCH($D8,TRIM(DoNotSendList[Do Not Send Address]),0)<>0),D8,\"\"))","v":""},null,"adaughn@address.com"]
["zhirovetshkiy@optonline.net",null,null,"adam23@ameritrade.com",{"$f":"IF(ISBLANK($D9),\"\",IF(ISNA(MATCH($D9,TRIM(DoNotSendList[Do Not Send Address]),0)<>0),D9,\"\"))","v":""},null,"adeae341@aol.com"]
["merritt@airnowhvac.com",null,null,"adaughn@address.com",{"$f":"IF(ISBLANK($D10),\"\",IF(ISNA(MATCH($D10,TRIM(DoNotSendList[Do Not Send Address]),0)<>0),D10,\"\"))","v":"adaughn@address.com"},null,"adenito@excite.com"]
["airalanc1@msn.com",null,null,"adboxdirect@yahoo.com",{"$f":"IF(ISBLANK($D11),\"\",IF(ISNA(MATCH($D11,TRIM(DoNotSendList[Do Not Send Address]),0)<>0),D11,\"\"))","v":""},null,"ahawke@projetech.com"]
["stephen.lancaster@worldnet.att.net",null,null,"adeae341@aol.com",{"$f":"IF(ISBLANK($D12),\"\",IF(ISNA(MATCH($D12,TRIM(DoNotSendList[Do Not Send Address]),0)<>0),D12,\"\"))","v":"adeae341@aol.com"},">>>\nList of addresses to add to our list.  Click the \"Process DNS\" to add & format them.\n>>>","andreaab@umich.edu"]
["alanwasher@hotmail.com",null,null,"adebola@ureach.com",{"$f":"IF(ISBLANK($D13),\"\",IF(ISNA(MATCH($D13,TRIM(DoNotSendList[Do Not Send Address]),0)<>0),D13,\"\"))","v":""},null,"anthonyfreeman2239@yahoo.com"]
["pmalan@prodigy.net",null,null,"adela@feda.com",{"$f":"IF(ISBLANK($D14),\"\",IF(ISNA(MATCH($D14,TRIM(DoNotSendList[Do Not Send Address]),0)<>0),D14,\"\"))","v":""},null,"arthurholmes@tds.net"]
["george4@ou.edu",null,null,"adenito@excite.com",{"$f":"IF(ISBLANK($D15),\"\",IF(ISNA(MATCH($D15,TRIM(DoNotSendList[Do Not Send Address]),0)<>0),D15,\"\"))","v":"adenito@excite.com"},null,"atop@yahoo.com"]
["x0apierce@bellsouth.net",null,null,"agdreco@aol.com",{"$f":"IF(ISBLANK($D16),\"\",IF(ISNA(MATCH($D16,TRIM(DoNotSendList[Do Not Send Address]),0)<>0),D16,\"\"))","v":""},null,"babyg2001@blackplanet.com"]
["thruny@aol.com",null,null,"aghollis@capital22.com",{"$f":"IF(ISBLANK($D17),\"\",IF(ISNA(MATCH($D17,TRIM(DoNotSendList[Do Not Send Address]),0)<>0),D17,\"\"))","v":""},null,"baymoneric@gmail.com"]
["swimfreak8813@aol.com",null,null,"ahaaris@aol.com",{"$f":"IF(ISBLANK($D18),\"\",IF(ISNA(MATCH($D18,TRIM(DoNotSendList[Do Not Send Address]),0)<>0),D18,\"\"))","v":""},null,"broof@ameritech.net"]
["hamptonmarshall@hamptonmarshall.com",null,null,"ahawke@projetech.com",{"$f":"IF(ISBLANK($D19),\"\",IF(ISNA(MATCH($D19,TRIM(DoNotSendList[Do Not Send Address]),0)<>0),D19,\"\"))","v":"ahawke@projetech.com"},null,"brunsvol@chapman.com"]
["s.allen@hamptonmarshall.com",null,null,"airalanc1@msn.com",{"$f":"IF(ISBLANK($D20),\"\",IF(ISNA(MATCH($D20,TRIM(DoNotSendList[Do Not Send Address]),0)<>0),D20,\"\"))","v":""},null,"c.seifu@yahoo.com"]
["andre_jeremiah08@yahoo.com",null,null,"alanwasher@hotmail.com",{"$f":"IF(ISBLANK($D21),\"\",IF(ISNA(MATCH($D21,TRIM(DoNotSendList[Do Not Send Address]),0)<>0),D21,\"\"))","v":""},null,"caren_zbot2@yahoo.com"]
["ocean1034@aol.com",null,null,"almondjoy16@sbcglobal.net",{"$f":"IF(ISBLANK($D22),\"\",IF(ISNA(MATCH($D22,TRIM(DoNotSendList[Do Not Send Address]),0)<>0),D22,\"\"))","v":""},null,"cdeveaux@adelphia.net"]
["andrea.kirkland@blackplanet.com",null,null,"andersonandrew@comic.com",{"$f":"IF(ISBLANK($D23),\"\",IF(ISNA(MATCH($D23,TRIM(DoNotSendList[Do Not Send Address]),0)<>0),D23,\"\"))","v":""},null,"chio@blackplanet.com"]
["andrea.kirkland@blackplanet.co",null,null,"andre_jeremiah08@yahoo.com",{"$f":"IF(ISBLANK($D24),\"\",IF(ISNA(MATCH($D24,TRIM(DoNotSendList[Do Not Send Address]),0)<>0),D24,\"\"))","v":""},null,"danperkins831@yahoo.com"]
["andersonandrew@comic.com",null,null,"andrea.kirkland@blackplanet.com",{"$f":"IF(ISBLANK($D25),\"\",IF(ISNA(MATCH($D25,TRIM(DoNotSendList[Do Not Send Address]),0)<>0),D25,\"\"))","v":""},null,"davidgarcia801@sbcglobal.net"]
["xandyan@juno.com",null,null,"andreaab@umich.edu",{"$f":"IF(ISBLANK($D26),\"\",IF(ISNA(MATCH($D26,TRIM(DoNotSendList[Do Not Send Address]),0)<>0),D26,\"\"))","v":"andreaab@umich.edu"},null,"deneka.allen@ameritrade.com"]
["johnnydangerous@yahoo.com",null,null,"andron@yahoo.com",{"$f":"IF(ISBLANK($D27),\"\",IF(ISNA(MATCH($D27,TRIM(DoNotSendList[Do Not Send Address]),0)<>0),D27,\"\"))","v":""},null,"dethel.hallb78@bright.net"]
["blink0298@aol.com",null,null,"andyleutheuser2@gmail.com",{"$f":"IF(ISBLANK($D28),\"\",IF(ISNA(MATCH($D28,TRIM(DoNotSendList[Do Not Send Address]),0)<>0),D28,\"\"))","v":""},null,"diamond_brocks@yahoo.com"]
["andyleutheuser7@gmail.com",null,null,"andyleutheuser7@gmail.com",{"$f":"IF(ISBLANK($D29),\"\",IF(ISNA(MATCH($D29,TRIM(DoNotSendList[Do Not Send Address]),0)<>0),D29,\"\"))","v":""},null,"dmprice2300@address.com"]
["adam23@ameritrade.com",null,null,"anthony.johnsonn8@mchsi.com",{"$f":"IF(ISBLANK($D30),\"\",IF(ISNA(MATCH($D30,TRIM(DoNotSendList[Do Not Send Address]),0)<>0),D30,\"\"))","v":""},null,"ehroy@msn.com"]
["mpchristina.gutierrez39@juno.com",null,null,"anthonydavis40@starspath.com",{"$f":"IF(ISBLANK($D31),\"\",IF(ISNA(MATCH($D31,TRIM(DoNotSendList[Do Not Send Address]),0)<>0),D31,\"\"))","v":""},null,"elizabeth.brunsvold@netscape.net"]
["h0christina.gutierrez@juno.com",null,null,"anthonyfreeman2239@yahoo.com",{"$f":"IF(ISBLANK($D32),\"\",IF(ISNA(MATCH($D32,TRIM(DoNotSendList[Do Not Send Address]),0)<>0),D32,\"\"))","v":"anthonyfreeman2239@yahoo.com"},null,"emt@gci.net"]
["christina.gutierrezu9@juno.com",null,null,"anthonyjohnson@rochester.rr.com",{"$f":"IF(ISBLANK($D33),\"\",IF(ISNA(MATCH($D33,TRIM(DoNotSendList[Do Not Send Address]),0)<>0),D33,\"\"))","v":""},null,"epeecher@concentric.net"]
["larrainanthony@gmail.com",null,null,"anthonysolomon@worldnet.att.net",{"$f":"IF(ISBLANK($D34),\"\",IF(ISNA(MATCH($D34,TRIM(DoNotSendList[Do Not Send Address]),0)<>0),D34,\"\"))","v":""},null,"eswaffor@us.ibm.com"]
["tinapedicini13@twc.com",null,null,"antkblonde@msn.com",{"$f":"IF(ISBLANK($D35),\"\",IF(ISNA(MATCH($D35,TRIM(DoNotSendList[Do Not Send Address]),0)<>0),D35,\"\"))","v":""},null,"eugea2006@haoo.com"]
["colonialdesigns@bellsouth.net",null,null,"antonio.johnson@msn.com",{"$f":"IF(ISBLANK($D36),\"\",IF(ISNA(MATCH($D36,TRIM(DoNotSendList[Do Not Send Address]),0)<>0),D36,\"\"))","v":""},null,"eydebbie.davis80@gmail.com"]
["apedi14050@aol.com",null,null,"apedi14050@aol.com",{"$f":"IF(ISBLANK($D37),\"\",IF(ISNA(MATCH($D37,TRIM(DoNotSendList[Do Not Send Address]),0)<>0),D37,\"\"))","v":""},null,"g5ksteiger@bellsouth.net"]
["anthonysolomon@worldnet.att.net",null,null,"arthurholmes@tds.net",{"$f":"IF(ISBLANK($D38),\"\",IF(ISNA(MATCH($D38,TRIM(DoNotSendList[Do Not Send Address]),0)<>0),D38,\"\"))","v":"arthurholmes@tds.net"},null,"gcagbabanua@webtv.net"]
["mortgage_solomon@yahoo.com",null,null,"asarradet@worldnet.att.net",{"$f":"IF(ISBLANK($D39),\"\",IF(ISNA(MATCH($D39,TRIM(DoNotSendList[Do Not Send Address]),0)<>0),D39,\"\"))","v":""},null,"genestorey01@yahoo.com"]
["anthonydavis40@starspath.com",null,null,"atop@yahoo.com",{"$f":"IF(ISBLANK($D40),\"\",IF(ISNA(MATCH($D40,TRIM(DoNotSendList[Do Not Send Address]),0)<>0),D40,\"\"))","v":"atop@yahoo.com"},null,"giorgio.missaglia@enet.it"]
["nthonydavis773@starspath.com",null,null,"avateverbaugh@gmail.com",{"$f":"IF(ISBLANK($D41),\"\",IF(ISNA(MATCH($D41,TRIM(DoNotSendList[Do Not Send Address]),0)<>0),D41,\"\"))","v":""},null,"goldiechristensen@netzero.net"]
["anthonyjohnson@rochester.rr.com",null,null,"azizabdul10@yahoo.com",{"$f":"IF(ISBLANK($D42),\"\",IF(ISNA(MATCH($D42,TRIM(DoNotSendList[Do Not Send Address]),0)<>0),D42,\"\"))","v":""},null,"gtucker_04@yahoo.com"]
["anthony.johnsonn8@mchsi.com",null,null,"babyg2001@blackplanet.com",{"$f":"IF(ISBLANK($D43),\"\",IF(ISNA(MATCH($D43,TRIM(DoNotSendList[Do Not Send Address]),0)<>0),D43,\"\"))","v":"babyg2001@blackplanet.com"},null,"hatchett@go.com"]
["aghollis@capital22.com",null,null,"backyardpros@yahoo.com",{"$f":"IF(ISBLANK($D44),\"\",IF(ISNA(MATCH($D44,TRIM(DoNotSendList[Do Not Send Address]),0)<>0),D44,\"\"))","v":""},null,"hkkunkel0@bellsouth.net"]
["aapacible@localnet.com",null,null,"battle@uakron.edu",{"$f":"IF(ISBLANK($D45),\"\",IF(ISNA(MATCH($D45,TRIM(DoNotSendList[Do Not Send Address]),0)<>0),D45,\"\"))","v":""},null,"homeofdunn@tampabay.rr.com"]
["tonyaustin@webtv.net",null,null,"baymoneric@gmail.com",{"$f":"IF(ISBLANK($D46),\"\",IF(ISNA(MATCH($D46,TRIM(DoNotSendList[Do Not Send Address]),0)<>0),D46,\"\"))","v":"baymoneric@gmail.com"},null,"hottgurl4440@adelphia.net"]
["avateverbaugh@gmail.com",null,null,"bcraig@burlingbuilders.com",{"$f":"IF(ISBLANK($D47),\"\",IF(ISNA(MATCH($D47,TRIM(DoNotSendList[Do Not Send Address]),0)<>0),D47,\"\"))","v":""},null,"ibrkthngs@netscape.com"]
["backyardpros@yahoo.com",null,null,"bensworld@carolina.rr.com",{"$f":"IF(ISBLANK($D48),\"\",IF(ISNA(MATCH($D48,TRIM(DoNotSendList[Do Not Send Address]),0)<>0),D48,\"\"))","v":""},null,"interventionmedia@yahoo.com"]
["johnbailey@comcast.net",null,null,"bensworld9@ec.rr.com",{"$f":"IF(ISBLANK($D49),\"\",IF(ISNA(MATCH($D49,TRIM(DoNotSendList[Do Not Send Address]),0)<>0),D49,\"\"))","v":""},null,"james.aboudln51@yahoo.com"]
["kjbeth.welch86@yahoo.com",null,null,"bijohnson@trane.com",{"$f":"IF(ISBLANK($D50),\"\",IF(ISNA(MATCH($D50,TRIM(DoNotSendList[Do Not Send Address]),0)<>0),D50,\"\"))","v":""},null,"jason.krish@aol.com"]
["bensworld@carolina.rr.com",null,null,"blink0298@aol.com",{"$f":"IF(ISBLANK($D51),\"\",IF(ISNA(MATCH($D51,TRIM(DoNotSendList[Do Not Send Address]),0)<>0),D51,\"\"))","v":""},null,"jcortezjones@hotmail.com"]
["george.boyd@webtv.net",null,null,"braxtonsmommy0914@yahoo.com",{"$f":"IF(ISBLANK($D52),\"\",IF(ISNA(MATCH($D52,TRIM(DoNotSendList[Do Not Send Address]),0)<>0),D52,\"\"))","v":""},null,"jediyamato@aol.com"]
["jodynsusan@netscape.com",null,null,"brian.kucha1@ccity.com",{"$f":"IF(ISBLANK($D53),\"\",IF(ISNA(MATCH($D53,TRIM(DoNotSendList[Do Not Send Address]),0)<>0),D53,\"\"))","v":""},null,"jessica@dcontinuum.com"]
["josemshuman@hotmail.com",null,null,"brian@bergconstruction.com",{"$f":"IF(ISBLANK($D54),\"\",IF(ISNA(MATCH($D54,TRIM(DoNotSendList[Do Not Send Address]),0)<>0),D54,\"\"))","v":""},null,"jkim17@adelphia.net"]
["emilia_a_bg@yahoo.com",null,null,"broof@ameritech.net",{"$f":"IF(ISBLANK($D55),\"\",IF(ISNA(MATCH($D55,TRIM(DoNotSendList[Do Not Send Address]),0)<>0),D55,\"\"))","v":"broof@ameritech.net"},null,"jkpatton711@aol.com"]
["bcraig@burlingbuilders.com",null,null,"broof@asicentral.com",{"$f":"IF(ISBLANK($D56),\"\",IF(ISNA(MATCH($D56,TRIM(DoNotSendList[Do Not Send Address]),0)<>0),D56,\"\"))","v":""},null,"joshua.harmon@nmfn.com"]
["almondjoy16@sbcglobal.net",null,null,"brunsvol@chapman.com",{"$f":"IF(ISBLANK($D57),\"\",IF(ISNA(MATCH($D57,TRIM(DoNotSendList[Do Not Send Address]),0)<>0),D57,\"\"))","v":"brunsvol@chapman.com"},null,"judig2819@juno.com"]
["csowell@redflex.com",null,null,"bubba71574@comcast.com",{"$f":"IF(ISBLANK($D58),\"\",IF(ISNA(MATCH($D58,TRIM(DoNotSendList[Do Not Send Address]),0)<>0),D58,\"\"))","v":""},null,"kalexandersen@gsfn.com"]
["carad@go.com",null,null,"bvdeneka.allen26@ameritrade.com",{"$f":"IF(ISBLANK($D59),\"\",IF(ISNA(MATCH($D59,TRIM(DoNotSendList[Do Not Send Address]),0)<>0),D59,\"\"))","v":""},null,"kathy.day1@cox.net"]
["cdowdle@ameritrade.com",null,null,"c.mallett@dmc.org",{"$f":"IF(ISBLANK($D60),\"\",IF(ISNA(MATCH($D60,TRIM(DoNotSendList[Do Not Send Address]),0)<>0),D60,\"\"))","v":""},null,"kca@gsfn.com"]
["carlaha@attb1.com",null,null,"c.seifu@yahoo.com",{"$f":"IF(ISBLANK($D61),\"\",IF(ISNA(MATCH($D61,TRIM(DoNotSendList[Do Not Send Address]),0)<>0),D61,\"\"))","v":"c.seifu@yahoo.com"},null,"kcox4058@hotmail.com"]
["teejay2442@yahoo.com",null,null,"cakosile@ameritrade.com",{"$f":"IF(ISBLANK($D62),\"\",IF(ISNA(MATCH($D62,TRIM(DoNotSendList[Do Not Send Address]),0)<>0),D62,\"\"))","v":""},null,"ken@one.net"]
["wdn6woog46@aol.com",null,null,"calvin-james@blackplanet.com",{"$f":"IF(ISBLANK($D63),\"\",IF(ISNA(MATCH($D63,TRIM(DoNotSendList[Do Not Send Address]),0)<>0),D63,\"\"))","v":""},null,"kennethdavis18@yahoo.com"]
["v.j333@yahoo.com",null,null,"carad@go.com",{"$f":"IF(ISBLANK($D64),\"\",IF(ISNA(MATCH($D64,TRIM(DoNotSendList[Do Not Send Address]),0)<>0),D64,\"\"))","v":""},null,"kerik.salguerox56@hotmail.com"]
["shadyshade@adelphia.com",null,null,"caren_zbot2@yahoo.com",{"$f":"IF(ISBLANK($D65),\"\",IF(ISNA(MATCH($D65,TRIM(DoNotSendList[Do Not Send Address]),0)<>0),D65,\"\"))","v":"caren_zbot2@yahoo.com"},null,"kfain1@bellsouth.net"]
["seak@iquest.net",null,null,"carla.mackey@aol.com",{"$f":"IF(ISBLANK($D66),\"\",IF(ISNA(MATCH($D66,TRIM(DoNotSendList[Do Not Send Address]),0)<>0),D66,\"\"))","v":""},null,"killaklaw92@yahoo.com"]
["smalltara@yahoo.com",null,null,"carlaha@attb1.com",{"$f":"IF(ISBLANK($D67),\"\",IF(ISNA(MATCH($D67,TRIM(DoNotSendList[Do Not Send Address]),0)<>0),D67,\"\"))","v":""},null,"kpjoshua.adkins84@netscape.net"]
["rdmerrioni53@verizon.net",null,null,"carolvibbert@yahoo.com",{"$f":"IF(ISBLANK($D68),\"\",IF(ISNA(MATCH($D68,TRIM(DoNotSendList[Do Not Send Address]),0)<>0),D68,\"\"))","v":""},null,"larrymaxson@worldnet.att.net"]
["ouciguchi61@cs.com",null,null,"carolyn.greene@msn.com",{"$f":"IF(ISBLANK($D69),\"\",IF(ISNA(MATCH($D69,TRIM(DoNotSendList[Do Not Send Address]),0)<>0),D69,\"\"))","v":""},null,"loechatman17@themanors.net"]
["keith8824@aol.com",null,null,"cchappell002@cinci.rr.com",{"$f":"IF(ISBLANK($D70),\"\",IF(ISNA(MATCH($D70,TRIM(DoNotSendList[Do Not Send Address]),0)<>0),D70,\"\"))","v":""},null,"luv@gci.net"]
["grshermom@blackplanet.com",null,null,"cciguchi5@cs.com",{"$f":"IF(ISBLANK($D71),\"\",IF(ISNA(MATCH($D71,TRIM(DoNotSendList[Do Not Send Address]),0)<>0),D71,\"\"))","v":""},null,"melinda.anderson@cs.com"]
["grantmo@bc.edu",null,null,"cdeveaux@adelphia.net",{"$f":"IF(ISBLANK($D72),\"\",IF(ISNA(MATCH($D72,TRIM(DoNotSendList[Do Not Send Address]),0)<>0),D72,\"\"))","v":"cdeveaux@adelphia.net"},null,"melissa.france@webtv.net"]
["cposso@horwitzlaw.com",null,null,"cdowdle@ameritrade.com",{"$f":"IF(ISBLANK($D73),\"\",IF(ISNA(MATCH($D73,TRIM(DoNotSendList[Do Not Send Address]),0)<>0),D73,\"\"))","v":""},null,"ms.gonnamakeit@yahoo.com"]
["ciguchiw5@cs.com",null,null,"charlesg3967@gmail.com",{"$f":"IF(ISBLANK($D74),\"\",IF(ISNA(MATCH($D74,TRIM(DoNotSendList[Do Not Send Address]),0)<>0),D74,\"\"))","v":""},null,"niceman@thrunet.com"]
["christopherking@netscape.net",null,null,"charlesnussbu@live.com",{"$f":"IF(ISBLANK($D75),\"\",IF(ISNA(MATCH($D75,TRIM(DoNotSendList[Do Not Send Address]),0)<>0),D75,\"\"))","v":""},null,"patricia.malone@ameritrade.com"]
["cciguchi5@cs.com",null,null,"chio@blackplanet.com",{"$f":"IF(ISBLANK($D76),\"\",IF(ISNA(MATCH($D76,TRIM(DoNotSendList[Do Not Send Address]),0)<>0),D76,\"\"))","v":"chio@blackplanet.com"},null,"perthib@lycos.com"]
["carolvibbert@yahoo.com",null,null,"christina.gutierrezu9@juno.com",{"$f":"IF(ISBLANK($D77),\"\",IF(ISNA(MATCH($D77,TRIM(DoNotSendList[Do Not Send Address]),0)<>0),D77,\"\"))","v":""},null,"pmcmillen@angelfire.com"]
["calvin-james@blackplanet.com",null,null,"christopherking@netscape.net",{"$f":"IF(ISBLANK($D78),\"\",IF(ISNA(MATCH($D78,TRIM(DoNotSendList[Do Not Send Address]),0)<>0),D78,\"\"))","v":""},null,"randall@nursefinders.com"]
["bubba71574@comcast.com",null,null,"cierrapetties@yahoo.com",{"$f":"IF(ISBLANK($D79),\"\",IF(ISNA(MATCH($D79,TRIM(DoNotSendList[Do Not Send Address]),0)<>0),D79,\"\"))","v":""},null,"rcrobinson04@yahoo.com"]
["brian.kucha1@ccity.com",null,null,"ciguchiw5@cs.com",{"$f":"IF(ISBLANK($D80),\"\",IF(ISNA(MATCH($D80,TRIM(DoNotSendList[Do Not Send Address]),0)<>0),D80,\"\"))","v":""},null,"rgeller@paulgordon.org"]
["antkblonde@msn.com",null,null,"clydschap@aol.com",{"$f":"IF(ISBLANK($D81),\"\",IF(ISNA(MATCH($D81,TRIM(DoNotSendList[Do Not Send Address]),0)<>0),D81,\"\"))","v":""},null,"rob.lee1976@yahoo.com"]
["riley312@aol.com",null,null,"colonialdesigns@bellsouth.net",{"$f":"IF(ISBLANK($D82),\"\",IF(ISNA(MATCH($D82,TRIM(DoNotSendList[Do Not Send Address]),0)<>0),D82,\"\"))","v":""},null,"sfatal@centurytel.net"]
["possoconnie@yahoo.com",null,null,"cposso@horwitzlaw.com",{"$f":"IF(ISBLANK($D83),\"\",IF(ISNA(MATCH($D83,TRIM(DoNotSendList[Do Not Send Address]),0)<>0),D83,\"\"))","v":""},null,"speedymaintenance@swohio.twcbc.com"]
["jonathan@backyardpros.net",null,null,"csowell@redflex.com",{"$f":"IF(ISBLANK($D84),\"\",IF(ISNA(MATCH($D84,TRIM(DoNotSendList[Do Not Send Address]),0)<>0),D84,\"\"))","v":""},null,"stealthself13@gmail.com"]
["dumb-ed@stupid.com",null,null,"daniel.j.day@worldnet.att.net",{"$f":"IF(ISBLANK($D85),\"\",IF(ISNA(MATCH($D85,TRIM(DoNotSendList[Do Not Send Address]),0)<>0),D85,\"\"))","v":""},null,"steve.harris@uswest.net"]
["cierrapetties@yahoo.com",null,null,"danperkins831@yahoo.com",{"$f":"IF(ISBLANK($D86),\"\",IF(ISNA(MATCH($D86,TRIM(DoNotSendList[Do Not Send Address]),0)<>0),D86,\"\"))","v":"danperkins831@yahoo.com"},null,"swcamie.alexander91@aol.com"]
["carolyn.greene@msn.com",null,null,"darryl_dewberry@hotmail.com",{"$f":"IF(ISBLANK($D87),\"\",IF(ISNA(MATCH($D87,TRIM(DoNotSendList[Do Not Send Address]),0)<>0),D87,\"\"))","v":""},null,"tacticaladvisors@neo.rr.com"]
["c.mallett@dmc.org",null,null,"dashdenise@yahoo.com",{"$f":"IF(ISBLANK($D88),\"\",IF(ISNA(MATCH($D88,TRIM(DoNotSendList[Do Not Send Address]),0)<>0),D88,\"\"))","v":""},null,"tecaren_zbot217@yahoo.com"]
["braxtonsmommy0914@yahoo.com",null,null,"davidgarcia801@sbcglobal.net",{"$f":"IF(ISBLANK($D89),\"\",IF(ISNA(MATCH($D89,TRIM(DoNotSendList[Do Not Send Address]),0)<>0),D89,\"\"))","v":"davidgarcia801@sbcglobal.net"},null,"theresa.battles@yahoo.com"]
["andyleutheuser2@gmail.com",null,null,"deadliestdiver@yahoo.com",{"$f":"IF(ISBLANK($D90),\"\",IF(ISNA(MATCH($D90,TRIM(DoNotSendList[Do Not Send Address]),0)<>0),D90,\"\"))","v":""},null,"thp01@charter.net"]
["nvm.art.hollis@hotmail.com",null,null,"deneka.allen@ameritrade.com",{"$f":"IF(ISBLANK($D91),\"\",IF(ISNA(MATCH($D91,TRIM(DoNotSendList[Do Not Send Address]),0)<>0),D91,\"\"))","v":"deneka.allen@ameritrade.com"},null,"toblermd@hotmail.com"]
["greenec@scdhhs.gov",null,null,"dennis.denewitt@worldnet.att.net",{"$f":"IF(ISBLANK($D92),\"\",IF(ISNA(MATCH($D92,TRIM(DoNotSendList[Do Not Send Address]),0)<>0),D92,\"\"))","v":""},null,"vervasmo.hernandez@att.net"]
["charlesnussbu@live.com",null,null,"dethel.hallb78@bright.net",{"$f":"IF(ISBLANK($D93),\"\",IF(ISNA(MATCH($D93,TRIM(DoNotSendList[Do Not Send Address]),0)<>0),D93,\"\"))","v":"dethel.hallb78@bright.net"},null,"wvrealtor1@yahoo.com"]
["brian@bergconstruction.com",null,null,"dhatchett@go.com",{"$f":"IF(ISBLANK($D94),\"\",IF(ISNA(MATCH($D94,TRIM(DoNotSendList[Do Not Send Address]),0)<>0),D94,\"\"))","v":""},null,"xelliott.sadams54@hotmail.com"]
["joihibbler05@gmail.com",null,null,"diamond_brocks@yahoo.com",{"$f":"IF(ISBLANK($D95),\"\",IF(ISNA(MATCH($D95,TRIM(DoNotSendList[Do Not Send Address]),0)<>0),D95,\"\"))","v":"diamond_brocks@yahoo.com"},null,"ylbrandyapid@aol.com"]
["ribarbara.cannady25@worldnet.att.net",null,null,"dmcmillen2@woh.rr.com",{"$f":"IF(ISBLANK($D96),\"\",IF(ISNA(MATCH($D96,TRIM(DoNotSendList[Do Not Send Address]),0)<>0),D96,\"\"))","v":""},null,"zone_15@blackplanet.com"]
["clydschap@aol.com",null,null,"dmprice2300@address.com",{"$f":"IF(ISBLANK($D97),\"\",IF(ISNA(MATCH($D97,TRIM(DoNotSendList[Do Not Send Address]),0)<>0),D97,\"\"))","v":"dmprice2300@address.com"}]
["bensworld9@ec.rr.com",null,null,"dumb-ed@stupid.com",{"$f":"IF(ISBLANK($D98),\"\",IF(ISNA(MATCH($D98,TRIM(DoNotSendList[Do Not Send Address]),0)<>0),D98,\"\"))","v":""}]
["kjbeth.welch86@yahoo.com ",null,null,"ebsworldwide@msn.com",{"$f":"IF(ISBLANK($D99),\"\",IF(ISNA(MATCH($D99,TRIM(DoNotSendList[Do Not Send Address]),0)<>0),D99,\"\"))","v":""}]
["carla.mackey@aol.com",null,null,"ehroy@msn.com",{"$f":"IF(ISBLANK($D100),\"\",IF(ISNA(MATCH($D100,TRIM(DoNotSendList[Do Not Send Address]),0)<>0),D100,\"\"))","v":"ehroy@msn.com"}]
["kjbeth.welch86@yahoo.com ",null,null,"eksteigerk3@bellsouth.net",{"$f":"IF(ISBLANK($D101),\"\",IF(ISNA(MATCH($D101,TRIM(DoNotSendList[Do Not Send Address]),0)<>0),D101,\"\"))","v":""}]
["kjbeth.welch86@yahoo.com ",null,null,"elizabeth.brunsvold@netscape.net",{"$f":"IF(ISBLANK($D102),\"\",IF(ISNA(MATCH($D102,TRIM(DoNotSendList[Do Not Send Address]),0)<>0),D102,\"\"))","v":"elizabeth.brunsvold@netscape.net"}]
["100 Placement Llc",null,null,"emilia_a_bg@yahoo.com",{"$f":"IF(ISBLANK($D103),\"\",IF(ISNA(MATCH($D103,TRIM(DoNotSendList[Do Not Send Address]),0)<>0),D103,\"\"))","v":""}]
["1kchristen@erols.com",null,null,"ems6415@gmail.com",{"$f":"IF(ISBLANK($D104),\"\",IF(ISNA(MATCH($D104,TRIM(DoNotSendList[Do Not Send Address]),0)<>0),D104,\"\"))","v":""}]
["accurateexams@cox.net",null,null,"emt@gci.net",{"$f":"IF(ISBLANK($D105),\"\",IF(ISNA(MATCH($D105,TRIM(DoNotSendList[Do Not Send Address]),0)<>0),D105,\"\"))","v":"emt@gci.net"}]
["acjames52@yahoo.com",null,null,"emt71@webtv.com",{"$f":"IF(ISBLANK($D106),\"\",IF(ISNA(MATCH($D106,TRIM(DoNotSendList[Do Not Send Address]),0)<>0),D106,\"\"))","v":""}]
["adboxdirect@yahoo.com",null,null,"epeecher@concentric.net",{"$f":"IF(ISBLANK($D107),\"\",IF(ISNA(MATCH($D107,TRIM(DoNotSendList[Do Not Send Address]),0)<>0),D107,\"\"))","v":"epeecher@concentric.net"}]
["adebola@ureach.com",null,null,"erasmo.hernandez@att.net",{"$f":"IF(ISBLANK($D108),\"\",IF(ISNA(MATCH($D108,TRIM(DoNotSendList[Do Not Send Address]),0)<>0),D108,\"\"))","v":""}]
["ahaaris@aol.com",null,null,"eswaffor@us.ibm.com",{"$f":"IF(ISBLANK($D109),\"\",IF(ISNA(MATCH($D109,TRIM(DoNotSendList[Do Not Send Address]),0)<>0),D109,\"\"))","v":"eswaffor@us.ibm.com"}]
["www.andreaab@umich.edu",null,null,"ethelhall@comcast.net",{"$f":"IF(ISBLANK($D110),\"\",IF(ISNA(MATCH($D110,TRIM(DoNotSendList[Do Not Send Address]),0)<>0),D110,\"\"))","v":""}]
["andron@yahoo.com",null,null,"eugea2006@haoo.com",{"$f":"IF(ISBLANK($D111),\"\",IF(ISNA(MATCH($D111,TRIM(DoNotSendList[Do Not Send Address]),0)<>0),D111,\"\"))","v":"eugea2006@haoo.com"}]
["antonio.johnson@msn.com",null,null,"eveespada32@earthlink.net",{"$f":"IF(ISBLANK($D112),\"\",IF(ISNA(MATCH($D112,TRIM(DoNotSendList[Do Not Send Address]),0)<>0),D112,\"\"))","v":""}]
["asarradet@worldnet.att.net",null,null,"eydebbie.davis80@gmail.com",{"$f":"IF(ISBLANK($D113),\"\",IF(ISNA(MATCH($D113,TRIM(DoNotSendList[Do Not Send Address]),0)<>0),D113,\"\"))","v":"eydebbie.davis80@gmail.com"}]
["azizabdul10@yahoo.com",null,null,"fedaadela@hotmail.com",{"$f":"IF(ISBLANK($D114),\"\",IF(ISNA(MATCH($D114,TRIM(DoNotSendList[Do Not Send Address]),0)<>0),D114,\"\"))","v":""}]
["battle@uakron.edu",null,null,"fedaadela@yahoo.com",{"$f":"IF(ISBLANK($D115),\"\",IF(ISNA(MATCH($D115,TRIM(DoNotSendList[Do Not Send Address]),0)<>0),D115,\"\"))","v":""}]
["bijohnson@trane.com",null,null,"fkmmd@comcast.com",{"$f":"IF(ISBLANK($D116),\"\",IF(ISNA(MATCH($D116,TRIM(DoNotSendList[Do Not Send Address]),0)<>0),D116,\"\"))","v":""}]
["broof@asicentral.com",null,null,"g5ksteiger@bellsouth.net",{"$f":"IF(ISBLANK($D117),\"\",IF(ISNA(MATCH($D117,TRIM(DoNotSendList[Do Not Send Address]),0)<>0),D117,\"\"))","v":"g5ksteiger@bellsouth.net"}]
["bvdeneka.allen26@ameritrade.com",null,null,"garnisawinbush@yahoo.com",{"$f":"IF(ISBLANK($D118),\"\",IF(ISNA(MATCH($D118,TRIM(DoNotSendList[Do Not Send Address]),0)<>0),D118,\"\"))","v":""}]
["cakosile@ameritrade.com",null,null,"gcagbabanua@webtv.net",{"$f":"IF(ISBLANK($D119),\"\",IF(ISNA(MATCH($D119,TRIM(DoNotSendList[Do Not Send Address]),0)<>0),D119,\"\"))","v":"gcagbabanua@webtv.net"}]
["cchappell002@cinci.rr.com",null,null,"gd110700@yahoo.com",{"$f":"IF(ISBLANK($D120),\"\",IF(ISNA(MATCH($D120,TRIM(DoNotSendList[Do Not Send Address]),0)<>0),D120,\"\"))","v":""}]
["charlesg3967@gmail.com",null,null,"genestorey01@yahoo.com",{"$f":"IF(ISBLANK($D121),\"\",IF(ISNA(MATCH($D121,TRIM(DoNotSendList[Do Not Send Address]),0)<>0),D121,\"\"))","v":"genestorey01@yahoo.com"}]
["daniel.j.day@worldnet.att.net",null,null,"george.boyd@webtv.net",{"$f":"IF(ISBLANK($D122),\"\",IF(ISNA(MATCH($D122,TRIM(DoNotSendList[Do Not Send Address]),0)<>0),D122,\"\"))","v":""}]
["dashdenise@yahoo.com",null,null,"george4@ou.edu",{"$f":"IF(ISBLANK($D123),\"\",IF(ISNA(MATCH($D123,TRIM(DoNotSendList[Do Not Send Address]),0)<>0),D123,\"\"))","v":""}]
["deadliestdiver@yahoo.com",null,null,"giorgio.missaglia@enet.it",{"$f":"IF(ISBLANK($D124),\"\",IF(ISNA(MATCH($D124,TRIM(DoNotSendList[Do Not Send Address]),0)<>0),D124,\"\"))","v":"giorgio.missaglia@enet.it"}]
["dennis.denewitt@worldnet.att.net",null,null,"gnandraau52@rediffmail.com",{"$f":"IF(ISBLANK($D125),\"\",IF(ISNA(MATCH($D125,TRIM(DoNotSendList[Do Not Send Address]),0)<>0),D125,\"\"))","v":""}]
["dhatchett@go.com",null,null,"goldiechristensen@netzero.net",{"$f":"IF(ISBLANK($D126),\"\",IF(ISNA(MATCH($D126,TRIM(DoNotSendList[Do Not Send Address]),0)<>0),D126,\"\"))","v":"goldiechristensen@netzero.net"}]
["dmcmillen2@woh.rr.com",null,null,"grantmo@bc.edu",{"$f":"IF(ISBLANK($D127),\"\",IF(ISNA(MATCH($D127,TRIM(DoNotSendList[Do Not Send Address]),0)<>0),D127,\"\"))","v":""}]
["ebsworldwide@msn.com",null,null,"greenec@scdhhs.gov",{"$f":"IF(ISBLANK($D128),\"\",IF(ISNA(MATCH($D128,TRIM(DoNotSendList[Do Not Send Address]),0)<>0),D128,\"\"))","v":""}]
["eksteigerk3@bellsouth.net",null,null,"grshermom@blackplanet.com",{"$f":"IF(ISBLANK($D129),\"\",IF(ISNA(MATCH($D129,TRIM(DoNotSendList[Do Not Send Address]),0)<>0),D129,\"\"))","v":""}]
["ems6415@gmail.com",null,null,"gtucke0414@yahoo.com",{"$f":"IF(ISBLANK($D130),\"\",IF(ISNA(MATCH($D130,TRIM(DoNotSendList[Do Not Send Address]),0)<>0),D130,\"\"))","v":""}]
["emt71@webtv.com",null,null,"gtucker_04@yahoo.com",{"$f":"IF(ISBLANK($D131),\"\",IF(ISNA(MATCH($D131,TRIM(DoNotSendList[Do Not Send Address]),0)<>0),D131,\"\"))","v":"gtucker_04@yahoo.com"}]
["erasmo.hernandez@att.net",null,null,"h0christina.gutierrez@juno.com",{"$f":"IF(ISBLANK($D132),\"\",IF(ISNA(MATCH($D132,TRIM(DoNotSendList[Do Not Send Address]),0)<>0),D132,\"\"))","v":""}]
["ethelhall@comcast.net",null,null,"hamptonmarshall@hamptonmarshall.com",{"$f":"IF(ISBLANK($D133),\"\",IF(ISNA(MATCH($D133,TRIM(DoNotSendList[Do Not Send Address]),0)<>0),D133,\"\"))","v":""}]
["eveespada32@earthlink.net",null,null,"harveyfreeman@worldnet.att.net",{"$f":"IF(ISBLANK($D134),\"\",IF(ISNA(MATCH($D134,TRIM(DoNotSendList[Do Not Send Address]),0)<>0),D134,\"\"))","v":""}]
["fkmmd@comcast.com",null,null,"hatchett@go.com",{"$f":"IF(ISBLANK($D135),\"\",IF(ISNA(MATCH($D135,TRIM(DoNotSendList[Do Not Send Address]),0)<>0),D135,\"\"))","v":"hatchett@go.com"}]
["garnisawinbush@yahoo.com",null,null,"hawk@techie.com",{"$f":"IF(ISBLANK($D136),\"\",IF(ISNA(MATCH($D136,TRIM(DoNotSendList[Do Not Send Address]),0)<>0),D136,\"\"))","v":""}]
["gd110700@yahoo.com",null,null,"hkkunkel0@bellsouth.net",{"$f":"IF(ISBLANK($D137),\"\",IF(ISNA(MATCH($D137,TRIM(DoNotSendList[Do Not Send Address]),0)<>0),D137,\"\"))","v":"hkkunkel0@bellsouth.net"}]
["gd110700@yahoo.com",null,null,"hkkunkelo79@bellsouth.net",{"$f":"IF(ISBLANK($D138),\"\",IF(ISNA(MATCH($D138,TRIM(DoNotSendList[Do Not Send Address]),0)<>0),D138,\"\"))","v":""}]
["gnandraau52@rediffmail.com",null,null,"homeofdunn@tampabay.rr.com",{"$f":"IF(ISBLANK($D139),\"\",IF(ISNA(MATCH($D139,TRIM(DoNotSendList[Do Not Send Address]),0)<>0),D139,\"\"))","v":"homeofdunn@tampabay.rr.com"}]
["gtucke0414@yahoo.com",null,null,"hoop@qcnet.net",{"$f":"IF(ISBLANK($D140),\"\",IF(ISNA(MATCH($D140,TRIM(DoNotSendList[Do Not Send Address]),0)<>0),D140,\"\"))","v":""}]
["harveyfreeman@worldnet.att.net",null,null,"hottgurl4440@adelphia.net",{"$f":"IF(ISBLANK($D141),\"\",IF(ISNA(MATCH($D141,TRIM(DoNotSendList[Do Not Send Address]),0)<>0),D141,\"\"))","v":"hottgurl4440@adelphia.net"}]
["hawk@techie.com",null,null,"ibrahim.valdes@yahoo.com",{"$f":"IF(ISBLANK($D142),\"\",IF(ISNA(MATCH($D142,TRIM(DoNotSendList[Do Not Send Address]),0)<>0),D142,\"\"))","v":""}]
["hkkunkelo79@bellsouth.net",null,null,"ibrkthngs@netscape.com",{"$f":"IF(ISBLANK($D143),\"\",IF(ISNA(MATCH($D143,TRIM(DoNotSendList[Do Not Send Address]),0)<>0),D143,\"\"))","v":"ibrkthngs@netscape.com"}]
["hoop@qcnet.net",null,null,"ijohnson@rocketmail.com",{"$f":"IF(ISBLANK($D144),\"\",IF(ISNA(MATCH($D144,TRIM(DoNotSendList[Do Not Send Address]),0)<>0),D144,\"\"))","v":""}]
["ibrahim.valdes@yahoo.com",null,null,"interventionmedia@yahoo.com",{"$f":"IF(ISBLANK($D145),\"\",IF(ISNA(MATCH($D145,TRIM(DoNotSendList[Do Not Send Address]),0)<>0),D145,\"\"))","v":"interventionmedia@yahoo.com"}]
["ijohnson@rocketmail.com",null,null,"jacquelinecofield@bigfoot.com",{"$f":"IF(ISBLANK($D146),\"\",IF(ISNA(MATCH($D146,TRIM(DoNotSendList[Do Not Send Address]),0)<>0),D146,\"\"))","v":""}]
["jacquelinecofield@bigfoot.com",null,null,"james.aboudln51@yahoo.com",{"$f":"IF(ISBLANK($D147),\"\",IF(ISNA(MATCH($D147,TRIM(DoNotSendList[Do Not Send Address]),0)<>0),D147,\"\"))","v":"james.aboudln51@yahoo.com"}]
["jasmith@carlson.com",null,null,"jasmith@carlson.com",{"$f":"IF(ISBLANK($D148),\"\",IF(ISNA(MATCH($D148,TRIM(DoNotSendList[Do Not Send Address]),0)<>0),D148,\"\"))","v":""}]
["jblasius@communityalliancecu.org",null,null,"jason.krish@aol.com",{"$f":"IF(ISBLANK($D149),\"\",IF(ISNA(MATCH($D149,TRIM(DoNotSendList[Do Not Send Address]),0)<>0),D149,\"\"))","v":"jason.krish@aol.com"}]
["jdipa@msn.com",null,null,"jblasius@communityalliancecu.org",{"$f":"IF(ISBLANK($D150),\"\",IF(ISNA(MATCH($D150,TRIM(DoNotSendList[Do Not Send Address]),0)<>0),D150,\"\"))","v":""}]
["jedmistonwj20@earthlink.net",null,null,"jcortezjones@hotmail.com",{"$f":"IF(ISBLANK($D151),\"\",IF(ISNA(MATCH($D151,TRIM(DoNotSendList[Do Not Send Address]),0)<>0),D151,\"\"))","v":"jcortezjones@hotmail.com"}]
["jim.jenkins@jenkinsconstruction.com",null,null,"jdipa@msn.com",{"$f":"IF(ISBLANK($D152),\"\",IF(ISNA(MATCH($D152,TRIM(DoNotSendList[Do Not Send Address]),0)<>0),D152,\"\"))","v":""}]
["jkim17@roadrunner.com",null,null,"jediyamato@aol.com",{"$f":"IF(ISBLANK($D153),\"\",IF(ISNA(MATCH($D153,TRIM(DoNotSendList[Do Not Send Address]),0)<>0),D153,\"\"))","v":"jediyamato@aol.com"}]
["jm@amimobility.com",null,null,"jedmistonwj20@earthlink.net",{"$f":"IF(ISBLANK($D154),\"\",IF(ISNA(MATCH($D154,TRIM(DoNotSendList[Do Not Send Address]),0)<>0),D154,\"\"))","v":""}]
["jrt879@bigfoot.com",null,null,"jessica@dcontinuum.com",{"$f":"IF(ISBLANK($D155),\"\",IF(ISNA(MATCH($D155,TRIM(DoNotSendList[Do Not Send Address]),0)<>0),D155,\"\"))","v":"jessica@dcontinuum.com"}]
["judimgreen@bigfoot.com",null,null,"jim.jenkins@jenkinsconstruction.com",{"$f":"IF(ISBLANK($D156),\"\",IF(ISNA(MATCH($D156,TRIM(DoNotSendList[Do Not Send Address]),0)<>0),D156,\"\"))","v":""}]
["karen.byrd@attb1.com",null,null,"jkim17@adelphia.net",{"$f":"IF(ISBLANK($D157),\"\",IF(ISNA(MATCH($D157,TRIM(DoNotSendList[Do Not Send Address]),0)<>0),D157,\"\"))","v":"jkim17@adelphia.net"}]
["kathy.day42@cox.net",null,null,"jkim17@roadrunner.com",{"$f":"IF(ISBLANK($D158),\"\",IF(ISNA(MATCH($D158,TRIM(DoNotSendList[Do Not Send Address]),0)<>0),D158,\"\"))","v":""}]
["kchristen@erols.com",null,null,"jkpatton711@aol.com",{"$f":"IF(ISBLANK($D159),\"\",IF(ISNA(MATCH($D159,TRIM(DoNotSendList[Do Not Send Address]),0)<>0),D159,\"\"))","v":"jkpatton711@aol.com"}]
["kdh78r@yahoo.com",null,null,"jm@amimobility.com",{"$f":"IF(ISBLANK($D160),\"\",IF(ISNA(MATCH($D160,TRIM(DoNotSendList[Do Not Send Address]),0)<>0),D160,\"\"))","v":""}]
["kennethc19@aol.com",null,null,"jodynsusan@netscape.com",{"$f":"IF(ISBLANK($D161),\"\",IF(ISNA(MATCH($D161,TRIM(DoNotSendList[Do Not Send Address]),0)<>0),D161,\"\"))","v":""}]
["kenny2416@gateway.com",null,null,"johnbailey@comcast.net",{"$f":"IF(ISBLANK($D162),\"\",IF(ISNA(MATCH($D162,TRIM(DoNotSendList[Do Not Send Address]),0)<>0),D162,\"\"))","v":""}]
["kevin.johnson@adelphia.net",null,null,"johnnydangerous@yahoo.com",{"$f":"IF(ISBLANK($D163),\"\",IF(ISNA(MATCH($D163,TRIM(DoNotSendList[Do Not Send Address]),0)<>0),D163,\"\"))","v":""}]
["khemmer@scboces.org",null,null,"joihibbler05@gmail.com",{"$f":"IF(ISBLANK($D164),\"\",IF(ISNA(MATCH($D164,TRIM(DoNotSendList[Do Not Send Address]),0)<>0),D164,\"\"))","v":""}]
["kkunkels1@bellsouth.net",null,null,"jonathan@backyardpros.net",{"$f":"IF(ISBLANK($D165),\"\",IF(ISNA(MATCH($D165,TRIM(DoNotSendList[Do Not Send Address]),0)<>0),D165,\"\"))","v":""}]
["kymiguelina.arocha46@verizon.net",null,null,"josemshuman@hotmail.com",{"$f":"IF(ISBLANK($D166),\"\",IF(ISNA(MATCH($D166,TRIM(DoNotSendList[Do Not Send Address]),0)<>0),D166,\"\"))","v":""}]
["lewpisbabygirl@aol.com",null,null,"joshua.harmon@nmfn.com",{"$f":"IF(ISBLANK($D167),\"\",IF(ISNA(MATCH($D167,TRIM(DoNotSendList[Do Not Send Address]),0)<>0),D167,\"\"))","v":"joshua.harmon@nmfn.com"}]
["lpbrandyapid72@aol.com",null,null,"jrt879@bigfoot.com",{"$f":"IF(ISBLANK($D168),\"\",IF(ISNA(MATCH($D168,TRIM(DoNotSendList[Do Not Send Address]),0)<>0),D168,\"\"))","v":""}]
["madel74@juno.com",null,null,"judig2819@juno.com",{"$f":"IF(ISBLANK($D169),\"\",IF(ISNA(MATCH($D169,TRIM(DoNotSendList[Do Not Send Address]),0)<>0),D169,\"\"))","v":"judig2819@juno.com"}]
["melissa.france@gmail.com",null,null,"judimgreen@bigfoot.com",{"$f":"IF(ISBLANK($D170),\"\",IF(ISNA(MATCH($D170,TRIM(DoNotSendList[Do Not Send Address]),0)<>0),D170,\"\"))","v":""}]
["mmanderson1365k51@netscape.net",null,null,"kalexandersen@gsfn.com",{"$f":"IF(ISBLANK($D171),\"\",IF(ISNA(MATCH($D171,TRIM(DoNotSendList[Do Not Send Address]),0)<>0),D171,\"\"))","v":"kalexandersen@gsfn.com"}]
["mwesnzkf@onsitecomputersinc.com",null,null,"karen.byrd@attb1.com",{"$f":"IF(ISBLANK($D172),\"\",IF(ISNA(MATCH($D172,TRIM(DoNotSendList[Do Not Send Address]),0)<>0),D172,\"\"))","v":""}]
["olowea@email.uc.edu",null,null,"kathy.day1@cox.net",{"$f":"IF(ISBLANK($D173),\"\",IF(ISNA(MATCH($D173,TRIM(DoNotSendList[Do Not Send Address]),0)<>0),D173,\"\"))","v":"kathy.day1@cox.net"}]
["pendergrass04@mail2world.com",null,null,"kathy.day42@cox.net",{"$f":"IF(ISBLANK($D174),\"\",IF(ISNA(MATCH($D174,TRIM(DoNotSendList[Do Not Send Address]),0)<>0),D174,\"\"))","v":""}]
["pkrobinson937w55@hotmail.com",null,null,"kca@gsfn.com",{"$f":"IF(ISBLANK($D175),\"\",IF(ISNA(MATCH($D175,TRIM(DoNotSendList[Do Not Send Address]),0)<>0),D175,\"\"))","v":"kca@gsfn.com"}]
["qmanderson1365j83@netscape.net",null,null,"kchristen@erols.com",{"$f":"IF(ISBLANK($D176),\"\",IF(ISNA(MATCH($D176,TRIM(DoNotSendList[Do Not Send Address]),0)<>0),D176,\"\"))","v":""}]
["rarrigo@insight.rr.com",null,null,"kcox4058@hotmail.com",{"$f":"IF(ISBLANK($D177),\"\",IF(ISNA(MATCH($D177,TRIM(DoNotSendList[Do Not Send Address]),0)<>0),D177,\"\"))","v":"kcox4058@hotmail.com"}]
["reespadai95@earthlink.net",null,null,"kdh78r@yahoo.com",{"$f":"IF(ISBLANK($D178),\"\",IF(ISNA(MATCH($D178,TRIM(DoNotSendList[Do Not Send Address]),0)<>0),D178,\"\"))","v":""}]
["rikkim@iwarp.net",null,null,"keith8824@aol.com",{"$f":"IF(ISBLANK($D179),\"\",IF(ISNA(MATCH($D179,TRIM(DoNotSendList[Do Not Send Address]),0)<>0),D179,\"\"))","v":""}]
["ruconnells50@comcast.net",null,null,"ken@one.net",{"$f":"IF(ISBLANK($D180),\"\",IF(ISNA(MATCH($D180,TRIM(DoNotSendList[Do Not Send Address]),0)<>0),D180,\"\"))","v":"ken@one.net"}]
["shandra28@hotmail.com",null,null,"kennethc19@aol.com",{"$f":"IF(ISBLANK($D181),\"\",IF(ISNA(MATCH($D181,TRIM(DoNotSendList[Do Not Send Address]),0)<>0),D181,\"\"))","v":""}]
["ssheffield@ameritrade.com",null,null,"kennethdavis18@yahoo.com",{"$f":"IF(ISBLANK($D182),\"\",IF(ISNA(MATCH($D182,TRIM(DoNotSendList[Do Not Send Address]),0)<>0),D182,\"\"))","v":"kennethdavis18@yahoo.com"}]
["stephen.stewart3@worldnet.att.net",null,null,"kenny2416@gateway.com",{"$f":"IF(ISBLANK($D183),\"\",IF(ISNA(MATCH($D183,TRIM(DoNotSendList[Do Not Send Address]),0)<>0),D183,\"\"))","v":""}]
["supportm@bellsouth.net",null,null,"kerik.salguerox56@hotmail.com",{"$f":"IF(ISBLANK($D184),\"\",IF(ISNA(MATCH($D184,TRIM(DoNotSendList[Do Not Send Address]),0)<>0),D184,\"\"))","v":"kerik.salguerox56@hotmail.com"}]
["t.adams@ingaonline.com",null,null,"kevin.johnson@adelphia.net",{"$f":"IF(ISBLANK($D185),\"\",IF(ISNA(MATCH($D185,TRIM(DoNotSendList[Do Not Send Address]),0)<>0),D185,\"\"))","v":""}]
["taras_box2@yahoo.com",null,null,"kfain1@bellsouth.net",{"$f":"IF(ISBLANK($D186),\"\",IF(ISNA(MATCH($D186,TRIM(DoNotSendList[Do Not Send Address]),0)<>0),D186,\"\"))","v":"kfain1@bellsouth.net"}]
["tgnandraf29@rediffmail.com",null,null,"khemmer@scboces.org",{"$f":"IF(ISBLANK($D187),\"\",IF(ISNA(MATCH($D187,TRIM(DoNotSendList[Do Not Send Address]),0)<>0),D187,\"\"))","v":""}]
["thompson.rob@yahoo.com",null,null,"killaklaw92@yahoo.com",{"$f":"IF(ISBLANK($D188),\"\",IF(ISNA(MATCH($D188,TRIM(DoNotSendList[Do Not Send Address]),0)<>0),D188,\"\"))","v":"killaklaw92@yahoo.com"}]
["toblermd@compuserve.com",null,null,"kjbeth.welch86@yahoo.com",{"$f":"IF(ISBLANK($D189),\"\",IF(ISNA(MATCH($D189,TRIM(DoNotSendList[Do Not Send Address]),0)<>0),D189,\"\"))","v":""}]
["tysonburt@hotmail.com",null,null,"kkunkels1@bellsouth.net",{"$f":"IF(ISBLANK($D190),\"\",IF(ISNA(MATCH($D190,TRIM(DoNotSendList[Do Not Send Address]),0)<>0),D190,\"\"))","v":""}]
["vtmcydelmallari2@hotmail.com",null,null,"kpjoshua.adkins84@netscape.net",{"$f":"IF(ISBLANK($D191),\"\",IF(ISNA(MATCH($D191,TRIM(DoNotSendList[Do Not Send Address]),0)<>0),D191,\"\"))","v":"kpjoshua.adkins84@netscape.net"}]
["xaviersupergx@adelphia.net",null,null,"kymiguelina.arocha46@verizon.net",{"$f":"IF(ISBLANK($D192),\"\",IF(ISNA(MATCH($D192,TRIM(DoNotSendList[Do Not Send Address]),0)<>0),D192,\"\"))","v":""}]
["xnesha.webstert69@yahoo.com",null,null,"larrainanthony@gmail.com",{"$f":"IF(ISBLANK($D193),\"\",IF(ISNA(MATCH($D193,TRIM(DoNotSendList[Do Not Send Address]),0)<>0),D193,\"\"))","v":""}]
["zajazpatricia@yahoo.com",null,null,"larrymaxson@worldnet.att.net",{"$f":"IF(ISBLANK($D194),\"\",IF(ISNA(MATCH($D194,TRIM(DoNotSendList[Do Not Send Address]),0)<>0),D194,\"\"))","v":"larrymaxson@worldnet.att.net"}]
[null,null,null,"lewpisbabygirl@aol.com",{"$f":"IF(ISBLANK($D195),\"\",IF(ISNA(MATCH($D195,TRIM(DoNotSendList[Do Not Send Address]),0)<>0),D195,\"\"))","v":""}]
[null,null,null,"loechatman17@themanors.net",{"$f":"IF(ISBLANK($D196),\"\",IF(ISNA(MATCH($D196,TRIM(DoNotSendList[Do Not Send Address]),0)<>0),D196,\"\"))","v":"loechatman17@themanors.net"}]
[null,null,null,"lpbrandyapid72@aol.com",{"$f":"IF(ISBLANK($D197),\"\",IF(ISNA(MATCH($D197,TRIM(DoNotSendList[Do Not Send Address]),0)<>0),D197,\"\"))","v":""}]
[null,null,null,"luv@gci.net",{"$f":"IF(ISBLANK($D198),\"\",IF(ISNA(MATCH($D198,TRIM(DoNotSendList[Do Not Send Address]),0)<>0),D198,\"\"))","v":"luv@gci.net"}]
[null,null,null,"madel74@juno.com",{"$f":"IF(ISBLANK($D199),\"\",IF(ISNA(MATCH($D199,TRIM(DoNotSendList[Do Not Send Address]),0)<>0),D199,\"\"))","v":""}]
[null,null,null,"melinda.anderson@cs.com",{"$f":"IF(ISBLANK($D200),\"\",IF(ISNA(MATCH($D200,TRIM(DoNotSendList[Do Not Send Address]),0)<>0),D200,\"\"))","v":"melinda.anderson@cs.com"}]
[null,null,null,"melissa.france@gmail.com",{"$f":"IF(ISBLANK($D201),\"\",IF(ISNA(MATCH($D201,TRIM(DoNotSendList[Do Not Send Address]),0)<>0),D201,\"\"))","v":""}]
[null,null,null,"melissa.france@webtv.net",{"$f":"IF(ISBLANK($D202),\"\",IF(ISNA(MATCH($D202,TRIM(DoNotSendList[Do Not Send Address]),0)<>0),D202,\"\"))","v":"melissa.france@webtv.net"}]
[null,null,null,"merritt@airnowhvac.com",{"$f":"IF(ISBLANK($D203),\"\",IF(ISNA(MATCH($D203,TRIM(DoNotSendList[Do Not Send Address]),0)<>0),D203,\"\"))","v":""}]
[null,null,null,"mmanderson1365k51@netscape.net",{"$f":"IF(ISBLANK($D204),\"\",IF(ISNA(MATCH($D204,TRIM(DoNotSendList[Do Not Send Address]),0)<>0),D204,\"\"))","v":""}]
[null,null,null,"mortgage_solomon@yahoo.com",{"$f":"IF(ISBLANK($D205),\"\",IF(ISNA(MATCH($D205,TRIM(DoNotSendList[Do Not Send Address]),0)<>0),D205,\"\"))","v":""}]
[null,null,null,"mpchristina.gutierrez39@juno.com",{"$f":"IF(ISBLANK($D206),\"\",IF(ISNA(MATCH($D206,TRIM(DoNotSendList[Do Not Send Address]),0)<>0),D206,\"\"))","v":""}]
[null,null,null,"ms.gonnamakeit@yahoo.com",{"$f":"IF(ISBLANK($D207),\"\",IF(ISNA(MATCH($D207,TRIM(DoNotSendList[Do Not Send Address]),0)<>0),D207,\"\"))","v":"ms.gonnamakeit@yahoo.com"}]
[null,null,null,"mwesnzkf@onsitecomputersinc.com",{"$f":"IF(ISBLANK($D208),\"\",IF(ISNA(MATCH($D208,TRIM(DoNotSendList[Do Not Send Address]),0)<>0),D208,\"\"))","v":""}]
[null,null,null,"niceman@thrunet.com",{"$f":"IF(ISBLANK($D209),\"\",IF(ISNA(MATCH($D209,TRIM(DoNotSendList[Do Not Send Address]),0)<>0),D209,\"\"))","v":"niceman@thrunet.com"}]
[null,null,null,"nthonydavis773@starspath.com",{"$f":"IF(ISBLANK($D210),\"\",IF(ISNA(MATCH($D210,TRIM(DoNotSendList[Do Not Send Address]),0)<>0),D210,\"\"))","v":""}]
[null,null,null,"nvm.art.hollis@hotmail.com",{"$f":"IF(ISBLANK($D211),\"\",IF(ISNA(MATCH($D211,TRIM(DoNotSendList[Do Not Send Address]),0)<>0),D211,\"\"))","v":""}]
[null,null,null,"ocean1034@aol.com",{"$f":"IF(ISBLANK($D212),\"\",IF(ISNA(MATCH($D212,TRIM(DoNotSendList[Do Not Send Address]),0)<>0),D212,\"\"))","v":""}]
[null,null,null,"olowea@email.uc.edu",{"$f":"IF(ISBLANK($D213),\"\",IF(ISNA(MATCH($D213,TRIM(DoNotSendList[Do Not Send Address]),0)<>0),D213,\"\"))","v":""}]
[null,null,null,"ouciguchi61@cs.com",{"$f":"IF(ISBLANK($D214),\"\",IF(ISNA(MATCH($D214,TRIM(DoNotSendList[Do Not Send Address]),0)<>0),D214,\"\"))","v":""}]
[null,null,null,"patricia.malone@ameritrade.com",{"$f":"IF(ISBLANK($D215),\"\",IF(ISNA(MATCH($D215,TRIM(DoNotSendList[Do Not Send Address]),0)<>0),D215,\"\"))","v":"patricia.malone@ameritrade.com"}]
[null,null,null,"pendergrass04@mail2world.com",{"$f":"IF(ISBLANK($D216),\"\",IF(ISNA(MATCH($D216,TRIM(DoNotSendList[Do Not Send Address]),0)<>0),D216,\"\"))","v":""}]
[null,null,null,"perthib@lycos.com",{"$f":"IF(ISBLANK($D217),\"\",IF(ISNA(MATCH($D217,TRIM(DoNotSendList[Do Not Send Address]),0)<>0),D217,\"\"))","v":"perthib@lycos.com"}]
[null,null,null,"pkrobinson937w55@hotmail.com",{"$f":"IF(ISBLANK($D218),\"\",IF(ISNA(MATCH($D218,TRIM(DoNotSendList[Do Not Send Address]),0)<>0),D218,\"\"))","v":""}]
[null,null,null,"pmalan@prodigy.net",{"$f":"IF(ISBLANK($D219),\"\",IF(ISNA(MATCH($D219,TRIM(DoNotSendList[Do Not Send Address]),0)<>0),D219,\"\"))","v":""}]
[null,null,null,"pmcmillen@angelfire.com",{"$f":"IF(ISBLANK($D220),\"\",IF(ISNA(MATCH($D220,TRIM(DoNotSendList[Do Not Send Address]),0)<>0),D220,\"\"))","v":"pmcmillen@angelfire.com"}]
[null,null,null,"possoconnie@yahoo.com",{"$f":"IF(ISBLANK($D221),\"\",IF(ISNA(MATCH($D221,TRIM(DoNotSendList[Do Not Send Address]),0)<>0),D221,\"\"))","v":""}]
[null,null,null,"qmanderson1365j83@netscape.net",{"$f":"IF(ISBLANK($D222),\"\",IF(ISNA(MATCH($D222,TRIM(DoNotSendList[Do Not Send Address]),0)<>0),D222,\"\"))","v":""}]
[null,null,null,"randall@nursefinders.com",{"$f":"IF(ISBLANK($D223),\"\",IF(ISNA(MATCH($D223,TRIM(DoNotSendList[Do Not Send Address]),0)<>0),D223,\"\"))","v":"randall@nursefinders.com"}]
[null,null,null,"rarrigo@insight.rr.com",{"$f":"IF(ISBLANK($D224),\"\",IF(ISNA(MATCH($D224,TRIM(DoNotSendList[Do Not Send Address]),0)<>0),D224,\"\"))","v":""}]
[null,null,null,"rcrobinson04@yahoo.com",{"$f":"IF(ISBLANK($D225),\"\",IF(ISNA(MATCH($D225,TRIM(DoNotSendList[Do Not Send Address]),0)<>0),D225,\"\"))","v":"rcrobinson04@yahoo.com"}]
[null,null,null,"rdmerrioni53@verizon.net",{"$f":"IF(ISBLANK($D226),\"\",IF(ISNA(MATCH($D226,TRIM(DoNotSendList[Do Not Send Address]),0)<>0),D226,\"\"))","v":""}]
[null,null,null,"reespadai95@earthlink.net",{"$f":"IF(ISBLANK($D227),\"\",IF(ISNA(MATCH($D227,TRIM(DoNotSendList[Do Not Send Address]),0)<>0),D227,\"\"))","v":""}]
[null,null,null,"rgeller@paulgordon.org",{"$f":"IF(ISBLANK($D228),\"\",IF(ISNA(MATCH($D228,TRIM(DoNotSendList[Do Not Send Address]),0)<>0),D228,\"\"))","v":"rgeller@paulgordon.org"}]
[null,null,null,"ribarbara.cannady25@worldnet.att.net",{"$f":"IF(ISBLANK($D229),\"\",IF(ISNA(MATCH($D229,TRIM(DoNotSendList[Do Not Send Address]),0)<>0),D229,\"\"))","v":""}]
[null,null,null,"rikkim@iwarp.net",{"$f":"IF(ISBLANK($D230),\"\",IF(ISNA(MATCH($D230,TRIM(DoNotSendList[Do Not Send Address]),0)<>0),D230,\"\"))","v":""}]
[null,null,null,"riley312@aol.com",{"$f":"IF(ISBLANK($D231),\"\",IF(ISNA(MATCH($D231,TRIM(DoNotSendList[Do Not Send Address]),0)<>0),D231,\"\"))","v":""}]
[null,null,null,"rob.lee1976@yahoo.com",{"$f":"IF(ISBLANK($D232),\"\",IF(ISNA(MATCH($D232,TRIM(DoNotSendList[Do Not Send Address]),0)<>0),D232,\"\"))","v":"rob.lee1976@yahoo.com"}]
[null,null,null,"ruconnells50@comcast.net",{"$f":"IF(ISBLANK($D233),\"\",IF(ISNA(MATCH($D233,TRIM(DoNotSendList[Do Not Send Address]),0)<>0),D233,\"\"))","v":""}]
[null,null,null,"s.allen@hamptonmarshall.com",{"$f":"IF(ISBLANK($D234),\"\",IF(ISNA(MATCH($D234,TRIM(DoNotSendList[Do Not Send Address]),0)<>0),D234,\"\"))","v":""}]
[null,null,null,"seak@iquest.net",{"$f":"IF(ISBLANK($D235),\"\",IF(ISNA(MATCH($D235,TRIM(DoNotSendList[Do Not Send Address]),0)<>0),D235,\"\"))","v":""}]
[null,null,null,"sfatal@centurytel.net",{"$f":"IF(ISBLANK($D236),\"\",IF(ISNA(MATCH($D236,TRIM(DoNotSendList[Do Not Send Address]),0)<>0),D236,\"\"))","v":"sfatal@centurytel.net"}]
[null,null,null,"shadyshade@adelphia.com",{"$f":"IF(ISBLANK($D237),\"\",IF(ISNA(MATCH($D237,TRIM(DoNotSendList[Do Not Send Address]),0)<>0),D237,\"\"))","v":""}]
[null,null,null,"shandra28@hotmail.com",{"$f":"IF(ISBLANK($D238),\"\",IF(ISNA(MATCH($D238,TRIM(DoNotSendList[Do Not Send Address]),0)<>0),D238,\"\"))","v":""}]
[null,null,null,"smalltara@yahoo.com",{"$f":"IF(ISBLANK($D239),\"\",IF(ISNA(MATCH($D239,TRIM(DoNotSendList[Do Not Send Address]),0)<>0),D239,\"\"))","v":""}]
[null,null,null,"speedymaintenance@swohio.twcbc.com",{"$f":"IF(ISBLANK($D240),\"\",IF(ISNA(MATCH($D240,TRIM(DoNotSendList[Do Not Send Address]),0)<>0),D240,\"\"))","v":"speedymaintenance@swohio.twcbc.com"}]
[null,null,null,"ssheffield@ameritrade.com",{"$f":"IF(ISBLANK($D241),\"\",IF(ISNA(MATCH($D241,TRIM(DoNotSendList[Do Not Send Address]),0)<>0),D241,\"\"))","v":""}]
[null,null,null,"stealthself13@gmail.com",{"$f":"IF(ISBLANK($D242),\"\",IF(ISNA(MATCH($D242,TRIM(DoNotSendList[Do Not Send Address]),0)<>0),D242,\"\"))","v":"stealthself13@gmail.com"}]
[null,null,null,"stephen.lancaster@worldnet.att.net",{"$f":"IF(ISBLANK($D243),\"\",IF(ISNA(MATCH($D243,TRIM(DoNotSendList[Do Not Send Address]),0)<>0),D243,\"\"))","v":""}]
[null,null,null,"stephen.stewart3@worldnet.att.net",{"$f":"IF(ISBLANK($D244),\"\",IF(ISNA(MATCH($D244,TRIM(DoNotSendList[Do Not Send Address]),0)<>0),D244,\"\"))","v":""}]
[null,null,null,"steve.harris@uswest.net",{"$f":"IF(ISBLANK($D245),\"\",IF(ISNA(MATCH($D245,TRIM(DoNotSendList[Do Not Send Address]),0)<>0),D245,\"\"))","v":"steve.harris@uswest.net"}]
[null,null,null,"supportm@bellsouth.net",{"$f":"IF(ISBLANK($D246),\"\",IF(ISNA(MATCH($D246,TRIM(DoNotSendList[Do Not Send Address]),0)<>0),D246,\"\"))","v":""}]
[null,null,null,"swcamie.alexander91@aol.com",{"$f":"IF(ISBLANK($D247),\"\",IF(ISNA(MATCH($D247,TRIM(DoNotSendList[Do Not Send Address]),0)<>0),D247,\"\"))","v":"swcamie.alexander91@aol.com"}]
[null,null,null,"swimfreak8813@aol.com",{"$f":"IF(ISBLANK($D248),\"\",IF(ISNA(MATCH($D248,TRIM(DoNotSendList[Do Not Send Address]),0)<>0),D248,\"\"))","v":""}]
[null,null,null,"t.adams@ingaonline.com",{"$f":"IF(ISBLANK($D249),\"\",IF(ISNA(MATCH($D249,TRIM(DoNotSendList[Do Not Send Address]),0)<>0),D249,\"\"))","v":""}]
[null,null,null,"tacticaladvisors@neo.rr.com",{"$f":"IF(ISBLANK($D250),\"\",IF(ISNA(MATCH($D250,TRIM(DoNotSendList[Do Not Send Address]),0)<>0),D250,\"\"))","v":"tacticaladvisors@neo.rr.com"}]
[null,null,null,"taras_box2@yahoo.com",{"$f":"IF(ISBLANK($D251),\"\",IF(ISNA(MATCH($D251,TRIM(DoNotSendList[Do Not Send Address]),0)<>0),D251,\"\"))","v":""}]
[null,null,null,"tecaren_zbot217@yahoo.com",{"$f":"IF(ISBLANK($D252),\"\",IF(ISNA(MATCH($D252,TRIM(DoNotSendList[Do Not Send Address]),0)<>0),D252,\"\"))","v":"tecaren_zbot217@yahoo.com"}]
[null,null,null,"teejay2442@yahoo.com",{"$f":"IF(ISBLANK($D253),\"\",IF(ISNA(MATCH($D253,TRIM(DoNotSendList[Do Not Send Address]),0)<>0),D253,\"\"))","v":""}]
[null,null,null,"tgnandraf29@rediffmail.com",{"$f":"IF(ISBLANK($D254),\"\",IF(ISNA(MATCH($D254,TRIM(DoNotSendList[Do Not Send Address]),0)<>0),D254,\"\"))","v":""}]
[null,null,null,"theresa.battles@yahoo.com",{"$f":"IF(ISBLANK($D255),\"\",IF(ISNA(MATCH($D255,TRIM(DoNotSendList[Do Not Send Address]),0)<>0),D255,\"\"))","v":"theresa.battles@yahoo.com"}]
[null,null,null,"thompson.rob@yahoo.com",{"$f":"IF(ISBLANK($D256),\"\",IF(ISNA(MATCH($D256,TRIM(DoNotSendList[Do Not Send Address]),0)<>0),D256,\"\"))","v":""}]
[null,null,null,"thp01@charter.net",{"$f":"IF(ISBLANK($D257),\"\",IF(ISNA(MATCH($D257,TRIM(DoNotSendList[Do Not Send Address]),0)<>0),D257,\"\"))","v":"thp01@charter.net"}]
[null,null,null,"thruny@aol.com",{"$f":"IF(ISBLANK($D258),\"\",IF(ISNA(MATCH($D258,TRIM(DoNotSendList[Do Not Send Address]),0)<>0),D258,\"\"))","v":""}]
[null,null,null,"tinapedicini13@twc.com",{"$f":"IF(ISBLANK($D259),\"\",IF(ISNA(MATCH($D259,TRIM(DoNotSendList[Do Not Send Address]),0)<>0),D259,\"\"))","v":""}]
[null,null,null,"toblermd@compuserve.com",{"$f":"IF(ISBLANK($D260),\"\",IF(ISNA(MATCH($D260,TRIM(DoNotSendList[Do Not Send Address]),0)<>0),D260,\"\"))","v":""}]
[null,null,null,"toblermd@hotmail.com",{"$f":"IF(ISBLANK($D261),\"\",IF(ISNA(MATCH($D261,TRIM(DoNotSendList[Do Not Send Address]),0)<>0),D261,\"\"))","v":"toblermd@hotmail.com"}]
[null,null,null,"tonyaustin@webtv.net",{"$f":"IF(ISBLANK($D262),\"\",IF(ISNA(MATCH($D262,TRIM(DoNotSendList[Do Not Send Address]),0)<>0),D262,\"\"))","v":""}]
[null,null,null,"tysonburt@hotmail.com",{"$f":"IF(ISBLANK($D263),\"\",IF(ISNA(MATCH($D263,TRIM(DoNotSendList[Do Not Send Address]),0)<>0),D263,\"\"))","v":""}]
[null,null,null,"v.j333@yahoo.com",{"$f":"IF(ISBLANK($D264),\"\",IF(ISNA(MATCH($D264,TRIM(DoNotSendList[Do Not Send Address]),0)<>0),D264,\"\"))","v":""}]
[null,null,null,"vervasmo.hernandez@att.net",{"$f":"IF(ISBLANK($D265),\"\",IF(ISNA(MATCH($D265,TRIM(DoNotSendList[Do Not Send Address]),0)<>0),D265,\"\"))","v":"vervasmo.hernandez@att.net"}]
[null,null,null,"vtmcydelmallari2@hotmail.com",{"$f":"IF(ISBLANK($D266),\"\",IF(ISNA(MATCH($D266,TRIM(DoNotSendList[Do Not Send Address]),0)<>0),D266,\"\"))","v":""}]
[null,null,null,"wdn6woog46@aol.com",{"$f":"IF(ISBLANK($D267),\"\",IF(ISNA(MATCH($D267,TRIM(DoNotSendList[Do Not Send Address]),0)<>0),D267,\"\"))","v":""}]
[null,null,null,"wvrealtor1@yahoo.com",{"$f":"IF(ISBLANK($D268),\"\",IF(ISNA(MATCH($D268,TRIM(DoNotSendList[Do Not Send Address]),0)<>0),D268,\"\"))","v":"wvrealtor1@yahoo.com"}]
[null,null,null,"www.andreaab@umich.edu",{"$f":"IF(ISBLANK($D269),\"\",IF(ISNA(MATCH($D269,TRIM(DoNotSendList[Do Not Send Address]),0)<>0),D269,\"\"))","v":""}]
[null,null,null,"x0apierce@bellsouth.net",{"$f":"IF(ISBLANK($D270),\"\",IF(ISNA(MATCH($D270,TRIM(DoNotSendList[Do Not Send Address]),0)<>0),D270,\"\"))","v":""}]
[null,null,null,"xandyan@juno.com",{"$f":"IF(ISBLANK($D271),\"\",IF(ISNA(MATCH($D271,TRIM(DoNotSendList[Do Not Send Address]),0)<>0),D271,\"\"))","v":""}]
[null,null,null,"xaviersupergx@adelphia.net",{"$f":"IF(ISBLANK($D272),\"\",IF(ISNA(MATCH($D272,TRIM(DoNotSendList[Do Not Send Address]),0)<>0),D272,\"\"))","v":""}]
[null,null,null,"xelliott.sadams54@hotmail.com",{"$f":"IF(ISBLANK($D273),\"\",IF(ISNA(MATCH($D273,TRIM(DoNotSendList[Do Not Send Address]),0)<>0),D273,\"\"))","v":"xelliott.sadams54@hotmail.com"}]
[null,null,null,"xnesha.webstert69@yahoo.com",{"$f":"IF(ISBLANK($D274),\"\",IF(ISNA(MATCH($D274,TRIM(DoNotSendList[Do Not Send Address]),0)<>0),D274,\"\"))","v":""}]
[null,null,null,"xyloboeman@hotmail.com",{"$f":"IF(ISBLANK($D275),\"\",IF(ISNA(MATCH($D275,TRIM(DoNotSendList[Do Not Send Address]),0)<>0),D275,\"\"))","v":""}]
[null,null,null,"ylbrandyapid@aol.com",{"$f":"IF(ISBLANK($D276),\"\",IF(ISNA(MATCH($D276,TRIM(DoNotSendList[Do Not Send Address]),0)<>0),D276,\"\"))","v":"ylbrandyapid@aol.com"}]
[null,null,null,"zajazpatricia@yahoo.com",{"$f":"IF(ISBLANK($D277),\"\",IF(ISNA(MATCH($D277,TRIM(DoNotSendList[Do Not Send Address]),0)<>0),D277,\"\"))","v":""}]
[null,null,null,"zhirovetshkiy@optonline.net",{"$f":"IF(ISBLANK($D278),\"\",IF(ISNA(MATCH($D278,TRIM(DoNotSendList[Do Not Send Address]),0)<>0),D278,\"\"))","v":""}]
[null,null,null,"zone_15@blackplanet.com",{"$f":"IF(ISBLANK($D279),\"\",IF(ISNA(MATCH($D279,TRIM(DoNotSendList[Do Not Send Address]),0)<>0),D279,\"\"))","v":"zone_15@blackplanet.com"}]

{"sheet":"PrepSheet","index":3,"n_rows":2,"n_cols":8,"rows_kept":2,"cut":false,"hidden":false,"merged":[]}
[null,"Sort","Front to back (comma between)","Column1","Trim & Proper (space between)","Front to back (space between)","Fix LLC","Paste as text"]
[null,null,{"$f":"IFERROR(IF(OR(RIGHT(E2,3)=\"Llc\",RIGHT(E2,3)=\"Inc\"),E2,SUBSTITUTE(E2,LEFT(E2,FIND(\",\",E2)),\"\")&\" \"&LEFT(E2,FIND(\",\",E2)-1)),\"\")","v":""},null,{"$f":"TRIM(PROPER(B2))","v":""},{"$f":"IFERROR(IF(OR(RIGHT(E2,3)=\"Llc\",RIGHT(E2,3)=\"Inc\"),E2,SUBSTITUTE(E2,LEFT(E2,FIND(\" \",E2)),\"\")&\" \"&LEFT(E2,FIND(\" \",E2))),\"\")","v":""},{"$f":"IFERROR(SUBSTITUTE(F2,\" Llc\",\" LLC\"),\"\")","v":""}]

{"sheet":"FormatMailList","index":4,"n_rows":100,"n_cols":8,"rows_kept":100,"cut":false,"hidden":false,"merged":[[0,2,0,3]]}
[null,null,"Creates a new mail list from range on \"Leads\" Sheet"]
["Name","Email1","Email2","Email3"]
[]
[]
[]
[]
[]
[]
[]
[]
[]
[]
[]
[]
[]
[]
[]
[]
[]
[]
[]
[]
[]
[]
[]
[]
[]
[]
[]
[]
[]
[]
[]
[]
[]
[]
[]
[]
[]
[]
[]
[]
[]
[]
[]
[]
[]
[]
[]
[]
[null,null,null,null,null,null,"Guriqbal Nandra ","tgnandraf29@rediffmail.com"]
[null,null,null,null,null,null,"GWENDELYN D BRAXTON ","elibrax@yahoo.com"]
[null,null,null,null,null,null,"Henley Dolmon","henleydolmon@gmail.com"]
[null,null,null,null,null,null,"JAMES P CAMPBELL","jcampb6718@aol.com"]
[null,null,null,null,null,null,"Jeffrey A Byer","jdbyers@southernco.com"]
[null,null,null,null,null,null,"John Bracy","tentwofifty.cb@gmail.com"]
[null,null,null,null,null,null,"Kellikidis Dino","m.kellikidis@yahoo.com"]
[null,null,null,null,null,null,"Luna-C Holdings ","dandbfire@hotmail.com"]
[null,null,null,null,null,null,"Michael R Capuano","mcapuano@columbus.rr.com"]
[null,null,null,null,null,null,"Omar Cardenas MD PA","ocardenasmd91@gmail.com"]
[null,null,null,null,null,null,"Richard A Brown","brynabrown@yahoo.com"]
[null,null,null,null,null,null,"Salam Zehra Slim ","zslim@comcast.net"]
[null,null,null,null,null,null,"Sam G Caras","sam_caras@day-intl.com"]
[null,null,null,null,null,null,"Sharon D Cannon","77chriscannon@gmail.com"]
[null,null,null,null,null,null,"Sidney N Jr Clouston ","oclouston@yahoo.com"]
[null,null,null,null,null,null,"Stanton M Mack ","stanmack@gmail.com"]
[null,null,null,null,null,null,"Steven M Such","ssuch716@gmail.com"]
[null,null,null,null,null,null,"Sue Cabadas Dds Llc ","mariseline7068@gmail.com"]
[null,null,null,null,null,null,"Sunday Nwankpa ","ceyx33@gmail.com"]
[null,null,null,null,null,null,"Suzan K Brown ","piassapassa2008@gmail.com"]
[null,null,null,null,null,null,"Tammie L Rodriguez ","tamara.rodriguez@att.net"]
[null,null,null,null,null,null,"Tanya L Bennett ","tanya.bennett97@yahoo.com"]
[null,null,null,null,null,null,"Thelma J Ware ","sdruihet@hotmail.com"]
[null,null,null,null,null,null,"Timothy R Kuban ","nugentnut@cox-internet.com"]
[null,null,null,null,null,null,"Todd E Brown","kbrown53@aol.com"]
[null,null,null,null,null,null,"Tremaine R R Fowler ","liv4money@yahoo.com"]
[null,null,null,null,null,null,"Vabview Llc","dulcineab4@aol.com"]
[null,null,null,null,null,null,"Vajava L Burch","jjavaburchs66@yahoo.com"]
[null,null,null,null,null,null,"Vendetta Tiara Thomas Sr","vendtthomas@gmail.com"]
[null,null,null,null,null,null,"Veterans Construction Services Inc","nealkrantz@earthlink.net"]
[null,null,null,null,null,null,"Vivian Lawrence ","vivianlawrence2010@yahoo.com"]
[null,null,null,null,null,null,"Wanda Cushinberry","iwfarmern40@adasmckinley.org"]
[null,null,null,null,null,null,"Henley Dolmon","simplesolutiontaxes@gmail.com"]
[null,null,null,null,null,null,"JAMES P CAMPBELL","ether322@sbcglobal.net"]
[null,null,null,null,null,null,"John Bracy","john.bracey@gmail.com"]
[null,null,null,null,null,null,"Omar Cardenas MD PA","ocardenas@bigfoot.com"]
[null,null,null,null,null,null,"Salam Zehra Slim ","sami2076@hotmail.com"]
[null,null,null,null,null,null,"Sidney N Jr Clouston ","oclouston@live.com"]
[null,null,null,null,null,null,"Stanton M Mack ","lisamarielmm@aol.com"]
[null,null,null,null,null,null,"Tammie L Rodriguez ","tamlbrown@yahoo.com"]
[null,null,null,null,null,null,"Thelma J Ware ","beckypennethy@tivejo.com"]
[null,null,null,null,null,null,"Timothy R Kuban ","harley66298@yahoo.com"]
[null,null,null,null,null,null,"Vabview Llc","familycourtheroes@hotmail.com"]
[null,null,null,null,null,null,"Vendetta Tiara Thomas Sr","vendettathomas89@gmail.com"]
[null,null,null,null,null,null,"Veterans Construction Services Inc","nealkrantzjr@gmail.com"]
[null,null,null,null,null,null,"Vivian Lawrence ","whiteboyeddie@gmail.com"]
[null,null,null,null,null,null,"Wanda Cushinberry","lowfarmer66@adasmckinley.org"]
[null,null,null,null,null,null,"Gil S Cagbabanua","lig0914@yahoo.com"]
[null,null,null,null,null,null,"Gl Healthcare Inc","mmallari@gmail.com"]
[null,null,null,null,null,null,"Glenesha Webster ","boston49963@gmail.com"]

{"sheet":"NoteSheet","index":5,"n_rows":33,"n_cols":9,"rows_kept":33,"cut":false,"hidden":false,"merged":[[0,4,1,8]]}
[]
[]
[]
[]
[]
[]
[]
[]
["Active Record #:"]
[{"$f":"INDIRECT(\"LEADS!\"&ADDRESS([0]!ActRow,2))","v":20230509154811}]
[null,null,null,null,"RecordNo","ContactRec","Contact Name","Date","Note"]
[null,null,null,null,"Note202304281632",20230427142729,"Walter Lindsey","2023-04-28","TP said that they already resolved issue."]
[null,null,null,null,"Note202305011152","20230427142341","Sweet Melissas Billiards LLC","2023-04-28","Doug is never there.  Doug & Melissa are out of town."]
[null,null,null,null,"Note202305011153","20230427142619","Rush E Simonson","2023-04-28","wireless cst not avail. Try later"]
[null,null,null,null,"Note202305011154","20230427143011","Corey A Spearman","2023-04-28","- voicemail - did not leave message"]
[null,null,null,null,"Note202305011154","20230427142148","Kenneth G Goodhue","2023-04-28","VM - did not leave message"]
[null,null,null,null,"Note202305011155","20230427142019","Christy Jones","2023-04-28","VM of guy named \"Chris\".  Didn't leave message."]
[null,null,null,null,"Note202305011145",20230427144358,"Wilkerson Tile Company LLC","2023-05-01","Tried to call.  The first two numbers were disconnected (423 356-8647 & 423 842-7476).  The third, 423 842-6464 went to a VM message that said I had reached the number 423 667-2969.  I did not leave a message."]
[null,null,null,null,"Note202305011151","20230427144225","Chattanooga Hardwood Center","2023-05-01","Left message with Shawn for Ms. Adams to call me.  She doesn't work on Mondays so she will call me first thing in the a.m."]
[null,null,null,null,"Note202305011154","20230427142729","Walter Lindsey","2023-05-01","already resolved."]
[null,null,null,null,"Note202305011233","20230427144358","Wilkerson Tile Company LLC","2023-05-01","Mr. Wilkerson called me back.  When I answered though, he said he had a wrong number.  I tried to call him back but got VM with \"mailbox full\".  I sent him an email."]
[null,null,null,null,"Note202305011249","20230427144358","Wilkerson Tile Company LLC","05/01/2023","safds"]
[null,null,null,null,"Note202305011318","20230427145450","Mark R Dwyer","05/01/2023","Tried to call but phone just kept ringing"]
[null,null,null,null,"Note202305011335","20230427144358","Wilkerson Tile Company LLC","05/01/2023","Sent email to IYP notifications email address."]
[null,null,null,null,"Note202305031650","20230427150747","Shirley Diane Moore","05/03/2023","Sent Letter:   \r\nThank you for taking my call today.\r\n\r\nI am glad you have someone to help you.  If you have any questions or need additional help, or just have a question, please let me know."]
[null,null,null,null,"Note202305091226","20230427150558","Robert L Pragnell","5/9/2023 12:23:58 PM","Called contact at (423) 875-4964\r\nMailbox is full"]
[null,null,null,null,"Note202305091228","20230427150558","Robert L Pragnell","5/9/2023 12:27:54 PM","Called contact at (423) 874-0885\r\nDisconnected"]
[null,null,null,null,"Note202305091231","20230427150558","Robert L Pragnell","5/9/2023 12:30:54 PM","Called contact at (423) 475-6137\r\nFax number?\r\n"]
[null,null,null,null,"Note202305091247","20230427150445","Edward E West","5/9/2023 12:45:07 PM","Called contact at (423) 320-7139\r\nLeft message on VM"]
[null,null,null,null,"Note202305091448","20230427150232","Edgar L Cagle","5/9/2023 2:45:34 PM","Called contact at (423) 499-5051\r\nPhone number is to \"Cagle Development\".  Receptionist transferred me.  Mr. Cagle just said, \"Yeah, I got all that took care of\" and hung up on me. "]
[null,null,null,null,"Note202305091451","20230427150232","Edgar L Cagle","05/09/2023","Sent Letter:   \r\nThank you for taking my call this afternoon.  I want to give you my contact information if you should have any questions or need anything (hopefully not) in the future.\r\n\r\nThank you and may God bless you."]
[null,null,null,null,"Note202305091533","20230509145625","Hamilton County Register of Deeds","05/09/2023","Called contact at (423) 209-6560\r\nPaid the $50 for another month, but it ends on May 31, \"because it's so close to the beginnng of the month\".  \r\n"]
[null,null,null,null,"Note202305091538","20230509145625","Hamilton County Register of Deeds","05/09/2023","Called contact at (423) 209-6560\r\nPassword didn't work.\r\n"]

{"sheet":"Letterhead","index":6,"n_rows":41,"n_cols":1,"rows_kept":41,"cut":false,"hidden":false,"merged":[[25,0,26,0],[0,0,4,0],[5,0,6,0],[16,0,24,0]]}
["dc Tax, LLC \n9301 Ocoee St, #64\nChattanooga, TN 37363"]
[]
[]
[]
[]
["tax solutions for us common folks"]
[]
[]
[]
[]
[]
[]
[]
[]
[]
[]
["Edgar L Cagle\n6317 Hamilton Island Rd\r\nHarrison, TN 37341"]
[]
[]
[]
[]
[]
[]
[]
[]
[]
[]
[]
[]
[]
[]
[]
[]
["Mr. Cagle"]
[]
["Thank you for taking my call this afternoon.  I want to give you my contact information if you should have any questions or need anything (hopefully not) in the future.\n\nThank you and may God bless you."]
[]
["Sincerely,"]
[]
[]
["David Collins\nEnrolled Agent"]

{"sheet":"New Invoice","index":7,"n_rows":36,"n_cols":16,"rows_kept":36,"cut":false,"hidden":false,"merged":[[1,11,1,12],[6,8,6,9],[31,4,32,5],[31,6,32,7],[35,1,36,7],[22,1,22,3],[22,6,22,7],[25,4,26,5],[25,6,26,7],[27,4,28,5],[27,6,28,7],[29,4,30,5],[29,6,30,7],[20,1,20,3],[20,6,20,7],[21,1,21,3],[23,1,23,3],[23,6,23,7],[16,1,16,3],[17,1,17,3],[17,6,17,7],[18,1,18,3],[18,6,18,7],[19,1,19,3],[19,6,19,7],[16,6,16,7],[12,4,12,5],[10,6,10,7],[11,6,11,7],[12,6,12,7],[21,6,21,7],[2,5,2,7],[3,5,6,7],[4,1,8,2],[10,4,10,5],[11,4,11,5]]}
[]
[null,"Invoice",null,null,null,null,null,null,null,null,null,"Payments Received",null,null,null,"Outstanding Invoices:"]
[null,null,null,null,null,"tax solutions for us common folks",null,null,null,null,null,"Date:"]
[null,null,null,null,null,"dc Tax, LLC\nPO Box 64\nOoltewah, TN 37363\n(423) 482-9737\ninfo@dctax.us",null,null,null,null,null,"Client:"]
[null,null,null,null,null,null,null,null,null,null,null,"Client ID:"]
[null,null,null,null,null,null,null,null,null,null,null,"Amount:"]
[null,null,null,null,null,null,null,null,null,null,null,"Applied to:"]
[null,null,null,null,null,null,null,null,null,null,null,"Payment Ref:"]
[]
[]
[null,null,null,null,"Invoice #"]
[null,null,null,null,"Invoice Date"]
[null,null,null,null,"Invoice Due"]
[]
[]
[]
[null,"Description",null,null,"Qty","Rate","Total"]
[null,null,null,null,null,null,{"$f":"IF(NOT(OR(ISBLANK(E18),ISBLANK(F18))),E18*F18,\"\")","v":""}]
[null,null,null,null,null,null,{"$f":"IF(NOT(AND(ISBLANK(E19),ISBLANK(F19))),E19*F19,\"\")","v":""}]
[null,null,null,null,null,null,""]
[null,null,null,null,null,null,""]
[null,null,null,null,null,null,""]
[null,null,null,null,null,null,{"$f":"IF(NOT(AND(ISBLANK(E23),ISBLANK(F23))),E23*F23,\"\")","v":""}]
[null,null,null,null,null,null,""]
[]
[null,null,null,null,"Sub-Total",null,{"$f":"IF(SUM(G18:H24)>0,SUM(G18:H24),\"\")","v":""}]
[]
[null,null,null,null,"Other"]
[]
[null,null,null,null,"Tax"]
[]
[null,null,null,null,"Invoice Total",null,{"$f":"IF(SUM(G26:H31)>0,SUM(G26:H31),\"\")","v":""}]
[]
[]
[]
[null,"Thank you for your business and may God bless you."]

{"sheet":"Invoices","index":8,"n_rows":19,"n_cols":21,"rows_kept":19,"cut":false,"hidden":false,"merged":[[7,8,7,12],[0,10,0,11],[7,1,7,6],[7,14,7,19],[1,10,2,11],[1,9,2,9]]}
[null,null,null,null,null,null,null,null,null,"# of Invoices","Accounts Receivable:"]
[null,null,null,null,null,null,null,null,null,{"$f":"COUNT(I10:I10006)","v":10},{"$f":"SUM(Invoices!$M$10:$M$19)","v":2258.5}]
[]
[]
[]
[]
[]
[null,"Invoices",null,null,null,null,null,null,"Invoice Summary",null,null,null,null,null,"Payments"]
[null,"Invoice","Invoiced To","Invoiced To Record ID","Invoice Date","Invoice Due","Invoice Total",null,"Number","Name","Amount","Payments","Balance",null,"Invoice","Invoiced To","Invoiced To Record ID","Payment Date","Payment Reference","Payment Amount","Applied to Invoice"]
[null,202341754,"Lambert's Flooring, Inc",459,"2023-04-17","2023-05-17",80,null,{"$f":"_xlfn.UNIQUE(TableInvoiceDetail[Invoice],FALSE)","v":202341754},{"$f":"IF(I10=\"\",\"\",_xlfn.XLOOKUP(I10,TableInvoiceDetail[Invoice],TableInvoiceDetail[Invoiced To]))","v":"Lambert's Flooring, Inc"},{"$f":"_xlfn.XLOOKUP(I10,TableInvoiceDetail[Invoice],TableInvoiceDetail[Invoice Total])","v":80},{"$f":"SUMIF(TablePaymentDetail[Invoice],I10,TablePaymentDetail[Applied to Invoice])","v":0},{"$f":"_xlfn.XLOOKUP(I10,TableInvoiceDetail[Invoice],TableInvoiceDetail[Invoice Total])-SUMIF(TablePaymentDetail[Invoice],I10,TablePaymentDetail[Applied to Invoice])","v":80},null,202331643,{"$f":"_xlfn.XLOOKUP(TablePaymentDetail[[#This Row],[Invoice]],TableInvoiceDetail[Invoice],TableInvoiceDetail[Invoiced To])","v":"Lambert's Flooring, Inc"},{"$f":"_xlfn.XLOOKUP(TablePaymentDetail[[#This Row],[Invoiced To]],LeadTable[Contact],LeadTable[RecordNo])","v":459},"2023-04-12","Check #7436",256.5,256.5]
[null,202331642,"Lambert's Flooring, Inc",459,"2023-03-16","2023-04-15",162,null,202331642,{"$f":"IF(I11=\"\",\"\",_xlfn.XLOOKUP(I11,TableInvoiceDetail[Invoice],TableInvoiceDetail[Invoiced To]))","v":"Lambert's Flooring, Inc"},{"$f":"_xlfn.XLOOKUP(I11,TableInvoiceDetail[Invoice],TableInvoiceDetail[Invoice Total])","v":162},{"$f":"SUMIF(TablePaymentDetail[Invoice],I11,TablePaymentDetail[Applied to Invoice])","v":0},{"$f":"_xlfn.XLOOKUP(I11,TableInvoiceDetail[Invoice],TableInvoiceDetail[Invoice Total])-SUMIF(TablePaymentDetail[Invoice],I11,TablePaymentDetail[Applied to Invoice])","v":162}]
[null,202331643,"Lambert's Flooring, Inc",459,"2023-03-16","2023-04-15",256.5,null,202331643,{"$f":"IF(I12=\"\",\"\",_xlfn.XLOOKUP(I12,TableInvoiceDetail[Invoice],TableInvoiceDetail[Invoiced To]))","v":"Lambert's Flooring, Inc"},{"$f":"_xlfn.XLOOKUP(I12,TableInvoiceDetail[Invoice],TableInvoiceDetail[Invoice Total])","v":256.5},{"$f":"SUMIF(TablePaymentDetail[Invoice],I12,TablePaymentDetail[Applied to Invoice])","v":256.5},{"$f":"_xlfn.XLOOKUP(I12,TableInvoiceDetail[Invoice],TableInvoiceDetail[Invoice Total])-SUMIF(TablePaymentDetail[Invoice],I12,TablePaymentDetail[Applied to Invoice])","v":0}]
[null,202331641,"Lambert's Flooring, Inc",459,"2023-03-16","2023-04-15",414,null,202331641,{"$f":"IF(I13=\"\",\"\",_xlfn.XLOOKUP(I13,TableInvoiceDetail[Invoice],TableInvoiceDetail[Invoiced To]))","v":"Lambert's Flooring, Inc"},{"$f":"_xlfn.XLOOKUP(I13,TableInvoiceDetail[Invoice],TableInvoiceDetail[Invoice Total])","v":414},{"$f":"SUMIF(TablePaymentDetail[Invoice],I13,TablePaymentDetail[Applied to Invoice])","v":0},{"$f":"_xlfn.XLOOKUP(I13,TableInvoiceDetail[Invoice],TableInvoiceDetail[Invoice Total])-SUMIF(TablePaymentDetail[Invoice],I13,TablePaymentDetail[Applied to Invoice])","v":414}]
[null,202331639,"Lambert's Flooring, Inc",459,"2023-03-16","2023-04-15",445,null,202331639,{"$f":"IF(I14=\"\",\"\",_xlfn.XLOOKUP(I14,TableInvoiceDetail[Invoice],TableInvoiceDetail[Invoiced To]))","v":"Lambert's Flooring, Inc"},{"$f":"_xlfn.XLOOKUP(I14,TableInvoiceDetail[Invoice],TableInvoiceDetail[Invoice Total])","v":445},{"$f":"SUMIF(TablePaymentDetail[Invoice],I14,TablePaymentDetail[Applied to Invoice])","v":0},{"$f":"_xlfn.XLOOKUP(I14,TableInvoiceDetail[Invoice],TableInvoiceDetail[Invoice Total])-SUMIF(TablePaymentDetail[Invoice],I14,TablePaymentDetail[Applied to Invoice])","v":445}]
[null,202331648,"Lambert's Southern Pies, Inc",460,"2023-03-16","2023-04-15",314,null,202331648,{"$f":"IF(I15=\"\",\"\",_xlfn.XLOOKUP(I15,TableInvoiceDetail[Invoice],TableInvoiceDetail[Invoiced To]))","v":"Lambert's Southern Pies, Inc"},{"$f":"_xlfn.XLOOKUP(I15,TableInvoiceDetail[Invoice],TableInvoiceDetail[Invoice Total])","v":314},{"$f":"SUMIF(TablePaymentDetail[Invoice],I15,TablePaymentDetail[Applied to Invoice])","v":0},{"$f":"_xlfn.XLOOKUP(I15,TableInvoiceDetail[Invoice],TableInvoiceDetail[Invoice Total])-SUMIF(TablePaymentDetail[Invoice],I15,TablePaymentDetail[Applied to Invoice])","v":314}]
[null,202331647,"Lambert's Southern Pies, Inc",460,"2023-03-16","2023-04-15",256.5,null,202331647,{"$f":"IF(I16=\"\",\"\",_xlfn.XLOOKUP(I16,TableInvoiceDetail[Invoice],TableInvoiceDetail[Invoiced To]))","v":"Lambert's Southern Pies, Inc"},{"$f":"_xlfn.XLOOKUP(I16,TableInvoiceDetail[Invoice],TableInvoiceDetail[Invoice Total])","v":256.5},{"$f":"SUMIF(TablePaymentDetail[Invoice],I16,TablePaymentDetail[Applied to Invoice])","v":0},{"$f":"_xlfn.XLOOKUP(I16,TableInvoiceDetail[Invoice],TableInvoiceDetail[Invoice Total])-SUMIF(TablePaymentDetail[Invoice],I16,TablePaymentDetail[Applied to Invoice])","v":256.5}]
[null,202331646,"Lambert's Southern Pies, Inc",460,"2023-03-16","2023-04-15",162,null,202331646,{"$f":"IF(I17=\"\",\"\",_xlfn.XLOOKUP(I17,TableInvoiceDetail[Invoice],TableInvoiceDetail[Invoiced To]))","v":"Lambert's Southern Pies, Inc"},{"$f":"_xlfn.XLOOKUP(I17,TableInvoiceDetail[Invoice],TableInvoiceDetail[Invoice Total])","v":162},{"$f":"SUMIF(TablePaymentDetail[Invoice],I17,TablePaymentDetail[Applied to Invoice])","v":0},{"$f":"_xlfn.XLOOKUP(I17,TableInvoiceDetail[Invoice],TableInvoiceDetail[Invoice Total])-SUMIF(TablePaymentDetail[Invoice],I17,TablePaymentDetail[Applied to Invoice])","v":162}]
[null,202341751,"Lambert's Southern Pies, Inc",460,"2023-04-17","2023-05-17",80,null,202341751,{"$f":"IF(I18=\"\",\"\",_xlfn.XLOOKUP(I18,TableInvoiceDetail[Invoice],TableInvoiceDetail[Invoiced To]))","v":"Lambert's Southern Pies, Inc"},{"$f":"_xlfn.XLOOKUP(I18,TableInvoiceDetail[Invoice],TableInvoiceDetail[Invoice Total])","v":80},{"$f":"SUMIF(TablePaymentDetail[Invoice],I18,TablePaymentDetail[Applied to Invoice])","v":0},{"$f":"_xlfn.XLOOKUP(I18,TableInvoiceDetail[Invoice],TableInvoiceDetail[Invoice Total])-SUMIF(TablePaymentDetail[Invoice],I18,TablePaymentDetail[Applied to Invoice])","v":80}]
[null,202331644,"Lambert's Southern Pies, Inc",460,"2023-03-16","2023-04-15",345,null,202331644,{"$f":"IF(I19=\"\",\"\",_xlfn.XLOOKUP(I19,TableInvoiceDetail[Invoice],TableInvoiceDetail[Invoiced To]))","v":"Lambert's Southern Pies, Inc"},{"$f":"_xlfn.XLOOKUP(I19,TableInvoiceDetail[Invoice],TableInvoiceDetail[Invoice Total])","v":345},{"$f":"SUMIF(TablePaymentDetail[Invoice],I19,TablePaymentDetail[Applied to Invoice])","v":0},{"$f":"_xlfn.XLOOKUP(I19,TableInvoiceDetail[Invoice],TableInvoiceDetail[Invoice Total])-SUMIF(TablePaymentDetail[Invoice],I19,TablePaymentDetail[Applied to Invoice])","v":345}]

{"sheet":"Sheet6","index":9,"n_rows":1,"n_cols":6,"rows_kept":1,"cut":false,"hidden":false,"merged":[]}
[null,null,null,"Sub SetContactList()\n    Dim ws As Worksheet: Set ws = ThisWorkbook.Sheets(\"Leads\")\n    Dim tbl As ListObject: Set tbl = ws.ListObjects(\"LeadTable\")\n    Dim MyArray\n    Dim rstart As Long: rstart = tbl.AutoFilter.Range.Offset(1).SpecialCells(xlCellTypeVisible).Row\n    Dim rend As Long: rend = tbl.ListColumns(\"Contact\").Range.Rows.Count + tbl.HeaderRowRange.Row\n    Dim cstart As Long: cstart = tbl.ListColumns(\"Row\").Range.column\n    Dim cend As Long: cend = tbl.ListColumns(\"Contact\").Range.column\n    Dim rng As Range: Set rng = Range(Cells(rstart, cstart), Cells(rend, cend))\n    \n        With FormInputs.ContactList\n            .Clear\n            .ColumnHeads = False\n            .ColumnCount = 2\n                 MyArray = rng.SpecialCells(xlCellTypeVisible)\n            .List = MyArray\n            .ColumnWidths = \"0;100\"\n        End With\nEnd Sub","Sub F()\nDim tbl As ListObject, Rng As Range, C As Range\n\nSet tbl = Range(\"LeadTable\").ListObject\n\n'tbl.Range.AutoFilter: tbl.Range.AutoFilter 1, 4 ' (Here you must filter according to your own criteria)\n\nWith FormInputs.ContactList\n  .Clear: .ColumnHeads = False: .ColumnCount = 2\n  If Application.Subtotal(3, tbl.ListColumns(1).DataBodyRange) = 0 Then Exit Sub\n\n  Set C = tbl.HeaderRowRange(1).Offset(2 + tbl.Range.Rows.Count)\n  tbl.DataBodyRange.Copy C\n  .List = C.CurrentRegion.value\n  C.CurrentRegion.Delete xlShiftUp\n  .ColumnWidths = \"0;100\"\nEnd With\n\nEnd Sub","    Dim MyArray, c As Range\n     Dim ws    As Worksheet: Set ws = ThisWorkbook.Sheets(\"Leads\")\n\n     With ws\n          .Range(\"AA1\").Resize(, 10).EntireColumn.Clear     'clear auxiliary range(somewhere where it doesn't harm ....) and 10 columns ????\n          On Error Resume Next               'don't stop on an error\n          Set c = Range(\"Leadtable[[row]:[contact]]\").SpecialCells(xlVisible)     'the visible cells\n          If c Is Nothing Then MsgBox \"no visible cells\": Exit Sub     'encountered an error = stop\n          On Error GoTo 0\n          c.Copy .Range(\"AB1\")               'copy visible cells to 2nd column of auxiliary range\n          On Error GoTo 0\n          MyArray = ws.Range(\"AB1\").CurrentRegion.Value2     'read copied data to array\n     End With\n\n     With FormInputs.ContactList\n          .Clear\n          .ColumnHeads = False\n          .ColumnCount = 2\n          .List = MyArray\n          .ColumnWidths = \"0;100\"\n     End With"]