{"text_format":"1","workbook":"xlsx","n_sheets":8,"sheets":["Calculator","Business Exp","Personal Exp","ScratchPad","National Food","OOP Healthcare","Housing Standards","Transportation"],"not_rendered":{"charts":0,"images":1,"macros":1,"external_links":0,"defined_names":0,"comments":1,"pivot_tables":0},"unopened":[],"bounds":{"document_bytes":16777216,"sheet_cells":100000,"rows_first":2000,"rows_last":500,"rows_between":2000,"halvings":0,"cell_chars":16384,"cell_head_chars":4096},"cells_cut":0,"cells_raw":0,"read":"whole","date_system":"1900"}

{"sheet":"Calculator","index":0,"n_rows":38,"n_cols":23,"rows_kept":38,"cut":false,"hidden":false,"merged":[[10,1,11,1],[17,21,17,22],[4,21,4,22],[25,21,25,22],[12,2,12,8],[5,12,5,16],[24,12,24,16]]}
[]
[null,"# People in household:"]
[null,"# People 65 or over"]
[null,"State"]
[null,"County",null,{"$f":"C5&\" County\"","v":" County"},null,null,null,null,null,null,null,null,null,null,null,null,null,null,null,null,null,"Other Expenses"]
[null,"# Vehicles >",null,null,false,{"$f":"IF(AND(C2<>\"\",OR(C6=\"\",C6=0)),TRUE,FALSE)","v":false},null,null,null,null,null,null,"Household Monthly Income & Expenses",null,null,null,null,"Claimed","Allowable","Override Allowable",null,"Expense","Amount"]
[null,null,"Payment",null,null,null,null,null,null,null,null,null,20,"Wages (Taxpayer)",null,35,"Food, Clothing and Misc.",0,{"$f":"IF(T7=\"\",'National Food'!G7,T7)","v":0}]
[null,"Vehicle 1 Payment",null,null,{"$f":"IF(C8>0,MIN(C8,Transportation!B8),\"\")","v":""},null,null,null,null,null,null,null,21,"Wages (Spouse)",null,36,"Housing and Utilities",0,{"$f":"IF(T8=\"\",'Housing Standards'!K2,T8)","v":0}]
[null,"Vehicle 2 Payment",null,null,{"$f":"IF(AND(C9>0,C6>1),MIN(C9,Transportation!B8),\"\")","v":""},null,null,null,null,null,null,null,22,"Interest - Dividends",null,37,"Vehicle Ownership Costs",{"$f":"SUM(C8:C9)","v":0},{"$f":"IF(T9=\"\",MIN(R9,Transportation!D8),T9)","v":0}]
[null,null,null,null,{"$f":"SUM(E8:E9)","v":0},null,null,null,null,null,null,null,23,"Net Business Income",null,38,"Vehicle Operating Costs",{"$f":"I12","v":0},{"$f":"IF(T10=\"\",MIN(R10,Transportation!K3),T10)","v":0}]
[null,"All Vehicles Operating","Insurance",null,"Gas","Maint.","Other","Manual Total","Operating",null,null,null,24,"Net Rental Income",null,39,"Public Transportation",0,{"$f":"IF(T11=\"\",Transportation!D5,T11)","v":0}]
[null,null,null,null,null,null,null,null,{"$f":"IF(OR(H12=0,H12=\"\"),SUM(C12:G12),H12)","v":0},null,null,null,25,"Distributions (K-1, IRA, etc.)",null,40,"Health Insurance",0,{"$f":"IF(T12=\"\",R12,T12)","v":0}]
[null,null,{"$f":"IF(OR(C4=\"\",C5=\"\"),\"You must add State & County, above to get allowable operating costs.\",\"\")","v":"You must add State & County, above to get allowable operating costs."},null,null,null,null,null,null,null,null,null,26,"Pension (Taxpayer)",null,41,"Out of Pocket Health Care Costs",0,{"$f":"IF(T14=\"\",'OOP Healthcare'!B8,Calculator!T14)","v":0}]
[null,null,null,null,null,null,null,null,null,null,null,null,27,"Pension (Spouse)",null,42,"Court Ordered Payments",0,{"$f":"IF(T14=\"\",R14,T14)","v":0}]
[null,null,null,null,null,null,null,null,null,null,null,null,28,"Social Security (Taxpayer)",null,43,"Child/Dependent Care",0,{"$f":"IF(T15=\"\",R15,T15)","v":0}]
[null,null,null,null,null,null,null,null,null,null,null,null,29,"Social Security (Spouse)",null,44,"Life Insurance",0,0]
[null,null,null,null,null,null,null,null,null,null,null,null,30,"Child Support",null,45,"Current year taxes (Income/FICA)",0,0]
[null,null,null,null,null,null,null,null,null,null,null,null,31,"Alimony",null,46,"Secured Debts (Attach list)",{"$f":"SUM(SecDebtTbl[[#All],[Amount]])","v":0},{"$f":"IF(T18=\"\",SUM(SecDebtTbl[Amount]),T18)","v":0},null,null,"Secured Debts"]
[null,null,null,null,null,null,null,null,null,null,null,null,null,"Other Income (Specify below)",null,47,"Delinquent State or Local Taxes",0,0,null,null,"Lender","Amount"]
[null,null,null,null,null,null,null,null,null,null,null,null,32,null,null,48,"Other Expenses (Attach list)",{"$f":"SUM(OtherExpTbl[[#All],[Amount]])","v":0},{"$f":"IF(T20=\"\",SUM(OtherExpTbl[Amount]),T20)","v":0}]
[null,null,null,null,null,null,null,null,null,null,null,null,33,null,null,49,"Total Living Exps (add lines 35-48)",{"$f":"SUM(R7:R20)","v":0},{"$f":"SUM(S7:S20)","v":0}]
[null,null,null,null,null,null,null,null,null,null,null,null,34,"Total Income (add lines 20-33)",{"$f":"SUM(O7:O21)","v":0},50,"Net difference (Line 34 minus 49)",{"$f":"SUM(O22-R21)","v":0},{"$f":"SUM(O22-S21)","v":0}]
[]
[]
[null,null,null,null,null,null,null,null,null,null,null,null,"Sole Proprietorship/Business Information",null,null,null,null,"Claimed","Allowable"]
[null,null,null,null,null,null,null,null,null,null,null,null,67,"Gross Receipts",null,77,"Materials Purchased",null,null,null,null,"Other Business Expenses"]
[null,null,null,null,null,null,null,null,null,null,null,null,68,"Gross Rental Income",null,78,"Inventory Purchased",null,null,null,null,"Expense","Amount"]
[null,null,null,null,null,null,null,null,null,null,null,null,69,"Interest",null,79,"Gross Wages & Salaries"]
[null,null,null,null,null,null,null,null,null,null,null,null,70,"Dividends",null,80,"Rent"]
[null,null,null,null,null,null,null,null,null,null,null,null,71,"Cash Receipts not incl in 67-70",null,81,"Supplies"]
[null,null,null,null,null,null,null,null,null,null,null,null,null,"Other Income (Specify below)",null,82,"Utilities/Telephone"]
[null,null,null,null,null,null,null,null,null,null,null,null,72,null,null,83,"Vehicle Gasoline/Oil"]
[null,null,null,null,null,null,null,null,null,null,null,null,73,null,null,84,"Repairs & Maintenance"]
[null,null,null,null,null,null,null,null,null,null,null,null,74,null,null,85,"Insurance"]
[null,null,null,null,null,null,null,null,null,null,null,null,75,null,null,86,"Current Taxes"]
[null,null,null,null,null,null,null,null,null,null,null,null,76,"Total Income (Add 67 through 75)",{"$f":"SUM(O26:O35)","v":0},87,"Other Exp, incl install pmts (Specify)",{"$f":"SUM(OtherSPExpTb[[#All],[Amount]])","v":0}]
[null,null,null,null,null,null,null,null,null,null,null,null,null,null,null,88,"Total Exps (Add lines 77 through 87)",{"$f":"SUM(R26:R36)","v":0},{"$f":"SUM(S26:S36)","v":0}]
[null,null,null,null,null,null,null,null,null,null,null,null,null,null,null,89,"Net Bus Income (Line 76 minus 88)",{"$f":"O36-R37","v":0},{"$f":"O36-S37","v":0}]

{"sheet":"Business Exp","index":1,"n_rows":12,"n_cols":8,"rows_kept":12,"cut":false,"hidden":false,"merged":[]}
["Item","Claimed","Allowed","Category",null,77,"Materials Purchased",{"$f":"SUMIF(BusExp[Category],G1,BusExp[Allowed])","v":0}]
[null,null,null,null,null,78,"Inventory Purchased",{"$f":"SUMIF(BusExp[Category],G2,BusExp[Allowed])","v":0}]
[null,null,null,null,null,79,"Gross Wages & Salaries",{"$f":"SUMIF(BusExp[Category],G3,BusExp[Allowed])","v":0}]
[null,null,null,null,null,80,"Rent",{"$f":"SUMIF(BusExp[Category],G4,BusExp[Allowed])","v":0}]
[null,null,null,null,null,81,"Supplies",{"$f":"SUMIF(BusExp[Category],G5,BusExp[Allowed])","v":0}]
[null,null,null,null,null,82,"Utilities/Telephone",{"$f":"SUMIF(BusExp[Category],G6,BusExp[Allowed])","v":0}]
[null,null,null,null,null,83,"Vehicle Gasoline/Oil",{"$f":"SUMIF(BusExp[Category],G7,BusExp[Allowed])","v":0}]
[null,null,null,null,null,84,"Repairs & Maintenance",{"$f":"SUMIF(BusExp[Category],G8,BusExp[Allowed])","v":0}]
[null,null,null,null,null,85,"Insurance",{"$f":"SUMIF(BusExp[Category],G9,BusExp[Allowed])","v":0}]
[null,null,null,null,null,86,"Current Taxes",{"$f":"SUMIF(BusExp[Category],G10,BusExp[Allowed])","v":0}]
[null,null,null,null,null,87,"Other Exp, incl install pmts (Specify)",{"$f":"SUMIF(BusExp[Category],G11,BusExp[Allowed])","v":0}]
[null,null,null,null,null,88,"Total Exps (Add lines 77 through 87)",{"$f":"SUM(H1:H11)","v":0}]

{"sheet":"Personal Exp","index":2,"n_rows":15,"n_cols":8,"rows_kept":15,"cut":false,"hidden":false,"merged":[]}
["Item","Claimed","Allowed","Category",null,35,"Food, Clothing and Misc.",{"$f":"SUMIF(PersExp[Category],G1,PersExp[Allowed])","v":0}]
[null,null,null,null,null,36,"Housing and Utilities",{"$f":"SUMIF(PersExp[Category],G2,PersExp[Allowed])","v":0}]
[null,null,null,null,null,37,"Vehicle Ownership Costs",{"$f":"SUMIF(PersExp[Category],G3,PersExp[Allowed])","v":0}]
[null,null,null,null,null,38,"Vehicle Operating Costs",{"$f":"SUMIF(PersExp[Category],G4,PersExp[Allowed])","v":0}]
[null,null,null,null,null,39,"Public Transportation",{"$f":"SUMIF(PersExp[Category],G5,PersExp[Allowed])","v":0}]
[null,null,null,null,null,40,"Health Insurance",{"$f":"SUMIF(PersExp[Category],G6,PersExp[Allowed])","v":0}]
[null,null,null,null,null,41,"Out of Pocket Health Care Costs",{"$f":"SUMIF(PersExp[Category],G7,PersExp[Allowed])","v":0}]
[null,null,null,null,null,42,"Court Ordered Payments",{"$f":"SUMIF(PersExp[Category],G8,PersExp[Allowed])","v":0}]
[null,null,null,null,null,43,"Child/Dependent Care",{"$f":"SUMIF(PersExp[Category],G9,PersExp[Allowed])","v":0}]
[null,null,null,null,null,44,"Life Insurance",{"$f":"SUMIF(PersExp[Category],G10,PersExp[Allowed])","v":0}]
[null,null,null,null,null,45,"Current year taxes (Income/FICA)",{"$f":"SUMIF(PersExp[Category],G11,PersExp[Allowed])","v":0}]
[null,null,null,null,null,46,"Secured Debts (Attach list)",{"$f":"SUMIF(PersExp[Category],G12,PersExp[Allowed])","v":0}]
[null,null,null,null,null,47,"Delinquent State or Local Taxes",{"$f":"SUMIF(PersExp[Category],G13,PersExp[Allowed])","v":0}]
[null,null,null,null,null,48,"Other Expenses (Attach list)",{"$f":"SUMIF(PersExp[Category],G14,PersExp[Allowed])","v":0}]
[null,null,null,null,null,49,"Total Living Exps (add lines 35-48)",{"$f":"SUM(H1:H14)","v":0}]

{"sheet":"ScratchPad","index":3,"n_rows":0,"n_cols":0,"rows_kept":0,"cut":false,"hidden":false,"merged":[]}

{"sheet":"National Food","index":4,"n_rows":11,"n_cols":7,"rows_kept":11,"cut":false,"hidden":false,"merged":[]}
["Expense",1,2,3,4,null,"Computed"]
["Food",458,820,977,1143,null,{"$f":"_xlfn.IFNA(LOOKUP(Calculator!$C$2,$B$1:$E$1,$B2:$E2),0)","v":0}]
["Housekeeping supplies",44,75,83,82,null,{"$f":"_xlfn.IFNA(LOOKUP(Calculator!$C$2,$B$1:$E$1,$B3:$E3),0)","v":0}]
["Apparel & services",87,157,187,300,null,{"$f":"_xlfn.IFNA(LOOKUP(Calculator!$C$2,$B$1:$E$1,$B4:$E4),0)","v":0}]
["Personal care products & services",48,80,87,97,null,{"$f":"_xlfn.IFNA(LOOKUP(Calculator!$C$2,$B$1:$E$1,$B5:$E5),0)","v":0}]
["Miscellaneous",171,279,343,405,null,{"$f":"_xlfn.IFNA(LOOKUP(Calculator!$C$2,$B$1:$E$1,$B6:$E6),0)","v":0}]
["Total",808,1411,1677,2027,null,{"$f":"_xlfn.IFNA(LOOKUP(Calculator!$C$2,$B$1:$E$1,$B7:$E7)+C11,0)","v":0}]
[]
[]
["More than four persons","Additional Persons Amount"]
["For each additional person, add to four-person total allowance:",386,{"$f":"IF(Calculator!C2>E1,(Calculator!C2-'National Food'!E1)*'National Food'!B11,0)","v":0}]

{"sheet":"OOP Healthcare","index":5,"n_rows":8,"n_cols":2,"rows_kept":8,"cut":false,"hidden":false,"merged":[]}
["Age","Out of Pocket Costs"]
["Under 65",83]
["65 and Older",158]
[]
[]
["Under 65",{"$f":"(Calculator!C2-Calculator!C3)*'OOP Healthcare'!B2","v":0}]
["65 & older",{"$f":"Calculator!C3*'OOP Healthcare'!B3","v":0}]
["Total",{"$f":"SUM(B6:B7)","v":0}]

{"sheet":"Housing Standards","index":6,"n_rows":3225,"n_cols":14,"rows_kept":3225,"cut":false,"hidden":false,"merged":[]}
[null,null,1,2,3,4,5,null,null,{"$f":"SUBSTITUTE(ADDRESS(1, MATCH(Calculator!C2,'Housing Standards'!A1:G1), 4), \"1\", \"\")","v":{"$error":"#N/A"}},{"$f":"_xlfn.XLOOKUP(Calculator!D5&Calculator!C4,Table1[County]&Table1[State Name],Table1[Lookup])","v":{"$error":"#N/A"}},{"$f":"J1&K1","v":{"$error":"#N/A"}}]
["County","State Name","2024 Published\nALE Housing Expense for a Family of 1","2024 Published\nALE Housing Expense for a Family of 2","2024 Published\nALE Housing Expense for a Family of 3","2024 Published\nALE Housing Expense for a Family of 4","2024 Published\nALE Housing Expense for a Family of 5","Lookup",null,null,{"$f":"_xlfn.IFNA(INDIRECT(L1),0)","v":0},null,null,"States"]
["Autauga County","Alabama",1500,1762,1857,2071,2104,{"$f":"ROW()","v":3},null,null,null,null,null,{"$f":"_xlfn.UNIQUE(B3:B3225)","v":"Alabama"}]
["Baldwin County","Alabama",1650,1938,2042,2277,2314,{"$f":"ROW()","v":4},null,null,null,null,null,"Alaska"]
["Barbour County","Alabama",1322,1553,1636,1824,1854,{"$f":"ROW()","v":5},null,null,null,null,null,"Arizona"]
["Bibb County","Alabama",1357,1593,1679,1872,1902,{"$f":"ROW()","v":6},null,null,null,null,null,"Arkansas"]
["Blount County","Alabama",1435,1685,1776,1980,2012,{"$f":"ROW()","v":7},null,null,null,null,null,"California"]
["Bullock County","Alabama",1391,1634,1722,1920,1951,{"$f":"ROW()","v":8},null,null,null,null,null,"Colorado"]
["Butler County","Alabama",1245,1462,1541,1718,1746,{"$f":"ROW()","v":9},null,null,null,null,null,"Connecticut"]
["Calhoun County","Alabama",1329,1561,1645,1834,1864,{"$f":"ROW()","v":10},null,null,null,null,null,"Delaware"]
["Chambers County","Alabama",1307,1535,1617,1803,1832,{"$f":"ROW()","v":11},null,null,null,null,null,"District of Columbia"]
["Cherokee County","Alabama",1412,1658,1747,1948,1979,{"$f":"ROW()","v":12},null,null,null,null,null,"Florida"]
["Chilton County","Alabama",1389,1631,1719,1917,1948,{"$f":"ROW()","v":13},null,null,null,null,null,"Georgia"]
["Choctaw County","Alabama",1272,1494,1574,1755,1783,{"$f":"ROW()","v":14},null,null,null,null,null,"Hawaii"]
["Clarke County","Alabama",1471,1728,1821,2030,2063,{"$f":"ROW()","v":15},null,null,null,null,null,"Idaho"]
["Clay County","Alabama",1311,1540,1623,1810,1839,{"$f":"ROW()","v":16},null,null,null,null,null,"Illinois"]
["Cleburne County","Alabama",1501,1763,1858,2072,2105,{"$f":"ROW()","v":17},null,null,null,null,null,"Indiana"]
["Coffee County","Alabama",1487,1746,1840,2052,2085,{"$f":"ROW()","v":18},null,null,null,null,null,"Iowa"]
["Colbert County","Alabama",1361,1598,1684,1878,1908,{"$f":"ROW()","v":19},null,null,null,null,null,"Kansas"]
["Conecuh County","Alabama",1257,1477,1556,1735,1763,{"$f":"ROW()","v":20},null,null,null,null,null,"Kentucky"]
["Coosa County","Alabama",1250,1468,1547,1725,1753,{"$f":"ROW()","v":21},null,null,null,null,null,"Louisiana"]
["Covington County","Alabama",1315,1545,1628,1815,1845,{"$f":"ROW()","v":22},null,null,null,null,null,"Maine"]
["Crenshaw County","Alabama",1311,1540,1623,1810,1839,{"$f":"ROW()","v":23},null,null,null,null,null,"Maryland"]
["Cullman County","Alabama",1378,1619,1706,1902,1933,{"$f":"ROW()","v":24},null,null,null,null,null,"Massachusetts"]
["Dale County","Alabama",1267,1488,1568,1748,1777,{"$f":"ROW()","v":25},null,null,null,null,null,"Michigan"]
["Dallas County","Alabama",1324,1554,1638,1826,1856,{"$f":"ROW()","v":26},null,null,null,null,null,"Minnesota"]
["DeKalb County","Alabama",1308,1536,1619,1805,1834,{"$f":"ROW()","v":27},null,null,null,null,null,"Mississippi"]
["Elmore County","Alabama",1513,1777,1873,2088,2122,{"$f":"ROW()","v":28},null,null,null,null,null,"Missouri"]
["Escambia County","Alabama",1247,1464,1543,1720,1748,{"$f":"ROW()","v":29},null,null,null,null,null,"Montana"]
["Etowah County","Alabama",1371,1610,1697,1892,1923,{"$f":"ROW()","v":30},null,null,null,null,null,"Nebraska"]
["Fayette County","Alabama",1277,1500,1581,1763,1791,{"$f":"ROW()","v":31},null,null,null,null,null,"Nevada"]
["Franklin County","Alabama",1274,1497,1577,1758,1787,{"$f":"ROW()","v":32},null,null,null,null,null,"New Hampshire"]
["Geneva County","Alabama",1318,1548,1631,1819,1848,{"$f":"ROW()","v":33},null,null,null,null,null,"New Jersey"]
["Greene County","Alabama",1153,1354,1427,1591,1617,{"$f":"ROW()","v":34},null,null,null,null,null,"New Mexico"]
["Hale County","Alabama",1282,1506,1587,1770,1798,{"$f":"ROW()","v":35},null,null,null,null,null,"New York"]
["Henry County","Alabama",1306,1534,1616,1802,1831,{"$f":"ROW()","v":36},null,null,null,null,null,"North Carolina"]
["Houston County","Alabama",1408,1653,1742,1942,1974,{"$f":"ROW()","v":37},null,null,null,null,null,"North Dakota"]
["Jackson County","Alabama",1348,1583,1668,1860,1890,{"$f":"ROW()","v":38},null,null,null,null,null,"Ohio"]
["Jefferson County","Alabama",1648,1936,2040,2275,2311,{"$f":"ROW()","v":39},null,null,null,null,null,"Oklahoma"]
["Lamar County","Alabama",1322,1553,1636,1824,1854,{"$f":"ROW()","v":40},null,null,null,null,null,"Oregon"]
["Lauderdale County","Alabama",1379,1620,1707,1903,1934,{"$f":"ROW()","v":41},null,null,null,null,null,"Pennsylvania"]
["Lawrence County","Alabama",1353,1589,1674,1867,1897,{"$f":"ROW()","v":42},null,null,null,null,null,"Puerto Rico"]
["Lee County","Alabama",1572,1846,1945,2169,2204,{"$f":"ROW()","v":43},null,null,null,null,null,"Rhode Island"]
["Limestone County","Alabama",1553,1824,1922,2143,2178,{"$f":"ROW()","v":44},null,null,null,null,null,"South Carolina"]
["Lowndes County","Alabama",1370,1609,1695,1890,1920,{"$f":"ROW()","v":45},null,null,null,null,null,"South Dakota"]
["Macon County","Alabama",1271,1493,1573,1754,1782,{"$f":"ROW()","v":46},null,null,null,null,null,"Tennessee"]
["Madison County","Alabama",1607,1888,1989,2218,2254,{"$f":"ROW()","v":47},null,null,null,null,null,"Texas"]
["Marengo County","Alabama",1319,1549,1632,1820,1849,{"$f":"ROW()","v":48},null,null,null,null,null,"Utah"]
["Marion County","Alabama",1286,1511,1592,1775,1804,{"$f":"ROW()","v":49},null,null,null,null,null,"Vermont"]
["Marshall County","Alabama",1411,1657,1746,1947,1978,{"$f":"ROW()","v":50},null,null,null,null,null,"Virginia"]
["Mobile County","Alabama",1483,1741,1835,2046,2079,{"$f":"ROW()","v":51},null,null,null,null,null,"Washington"]
["Monroe County","Alabama",1290,1515,1596,1780,1808,{"$f":"ROW()","v":52},null,null,null,null,null,"West Virginia"]
["Montgomery County","Alabama",1444,1696,1787,1993,2025,{"$f":"ROW()","v":53},null,null,null,null,null,"Wisconsin"]
["Morgan County","Alabama",1425,1673,1763,1966,1997,{"$f":"ROW()","v":54},null,null,null,null,null,"Wyoming"]
["Perry County","Alabama",1323,1554,1637,1825,1855,{"$f":"ROW()","v":55}]
["Pickens County","Alabama",1293,1518,1600,1784,1813,{"$f":"ROW()","v":56}]
["Pike County","Alabama",1437,1687,1778,1982,2014,{"$f":"ROW()","v":57}]
["Randolph County","Alabama",1363,1601,1687,1881,1911,{"$f":"ROW()","v":58}]
["Russell County","Alabama",1417,1665,1754,1956,1987,{"$f":"ROW()","v":59}]
["St. Clair County","Alabama",1540,1809,1906,2125,2159,{"$f":"ROW()","v":60}]
{"$rows_left_out":3166}
{"sheet":"Transportation","index":7,"n_rows":270,"n_cols":11,"rows_kept":270,"cut":false,"hidden":false,"merged":[[0,9,1,9],[0,10,1,10]]}
[null,null,null,null,null,"County & State","Region","1 veh","2+ veh","# Vehicles Claimed:","Max Allowed"]
[null,null,null,null,null,{"$f":"IF(OR(Calculator!C5=\"\",Calculator!C4=\"\"),\"\",Calculator!D5&\", \"&Calculator!C4)","v":""},{"$f":"IF(F2=\"\",\"\",_xlfn.IFNA(_xlfn.XLOOKUP(F2,F3:F270,G3:G270),_xlfn.XLOOKUP(Calculator!C4,F3:F270,G3:G270)))","v":""},{"$f":"_xlfn.IFNA(_xlfn.IFNA(_xlfn.XLOOKUP(G2,G3:G270,H3:H270),_xlfn.XLOOKUP(Calculator!E4,G3:G270,H3:H270)),0)","v":0},{"$f":"IFERROR(_xlfn.IFNA(_xlfn.XLOOKUP(H2,H3:H270,I3:I270),_xlfn.XLOOKUP(Calculator!#REF!,H3:H270,I3:I270)),0)","v":0}]
["Public Transportation",null,null,null,null,"Adams County, Colorado","Denver",{"$f":"_xlfn.SINGLE(_xlfn.XLOOKUP(G3,A:A,B:B))","v":279},{"$f":"_xlfn.SINGLE(_xlfn.XLOOKUP(G3,A:A,C:C))","v":558},{"$f":"Calculator!C6","v":0},{"$f":"IF(Calculator!C6>1,Transportation!I2,IF(Calculator!C6=1,Transportation!H2,0))","v":0}]
["Location","Allowed Amount",null,"Pub Trans",null,"Alabama","South Region",242,484]
["National ",218,null,{"$f":"IF(OR(Calculator!E6=TRUE,Calculator!F6=TRUE),Transportation!B5,0)","v":0},null,"Alameda County, California","San Francisco",301,602]
["Ownership Costs",null,null,null,null,"Alaska","West Region",264,528]
["Location","One Car","Two Cars","Max",null,"Alexandria city County, Virginia","Washington, D.C.",294,588]
["National",629,1258,{"$f":"IF(Calculator!C6=1,MIN(Transportation!B8,Calculator!C8),IF(Calculator!C6>1,MIN(Transportation!C8,SUM(Calculator!C8,Calculator!C9)),0))","v":0},null,"Anchorage County, Alaska","Anchorage",208,416]
["Northeast Region Operating Costs",null,null,null,null,"Anne Arundel County, Maryland","Baltimore",277,554]
["Location","One Car","Two Cars",null,null,"Anoka County, Minnosota","Minneapolis-St. Paul",214,428]
["Northeast Region",298,596,null,null,"Arapahoe County, Colorado","Denver",279,558]
["Boston",294,588,null,null,"Arizona","West Region",264,528]
["New York",379,758,null,null,"Arkansas","South Region",242,484]
["Philadelphia",318,636,null,null,"Arlington County, Virginia","Washington, D.C.",294,588]
["Midwest Region Operating Costs",null,null,null,null,"Ashtabula County, Ohio","Cleveland",225,450]
["Location","One Car","Two Cars",null,null,"Austin County, Texas","Houston",312,624]
["Midwest Region",225,450,null,null,"Baltimore city County, Maryland","Baltimore",277,554]
["Chicago",265,530,null,null,"Baltimore county County, Maryland","Baltimore",277,554]
["Cleveland",225,450,null,null,"Barrow County, Georgia","Atlanta",300,600]
["Detroit",315,630,null,null,"Bartow County, Georgia","Atlanta",300,600]
["Minneapolis-St. Paul",214,428,null,null,"Bergen County, New Jersey","New York",379,758]
["St. Louis",244,488,null,null,"Bond County, Illinois","St. Louis",244,488]
["South Region Operating Costs",null,null,null,null,"Brazoria County, Texas","Houston",312,624]
["Location","One Car","Two Cars",null,null,"Bronx County, New York","New York",379,758]
["South Region",242,484,null,null,"Broomfield County, Colorado","Denver",279,558]
["Atlanta",300,600,null,null,"Broward County, Florida","Miami",364,728]
["Baltimore",277,554,null,null,"Bucks County, Pennsylvania","Philadelphia",318,636]
["Dallas-Ft. Worth",288,576,null,null,"Burlington County, New Jersey","Philadelphia",318,636]
["Houston",312,624,null,null,"Butts County, Georgia","Atlanta",300,600]
["Miami",364,728,null,null,"Calhoun County, Illinois","St. Louis",244,488]
["Tampa",297,594,null,null,"California","West Region",264,528]
["Washington, D.C.",294,588,null,null,"Calvert County, Maryland","Washington, D.C.",294,588]
["West Region Operating Costs",null,null,null,null,"Camden County, New Jersey","Philadelphia",318,636]
["Location","One Car","Two Cars",null,null,"Carroll County, Georgia","Atlanta",300,600]
["West Region",264,528,null,null,"Carroll County, Maryland","Baltimore",277,554]
["Anchorage",208,416,null,null,"Carver County, Minnosota","Minneapolis-St. Paul",214,428]
["Denver",279,558,null,null,"Cecil County, Maryland","Philadelphia",318,636]
["Honolulu",243,486,null,null,"Chambers County, Texas","Houston",312,624]
["Los Angeles",339,678,null,null,"Charles County, Maryland","Washington, D.C.",294,588]
["Phoenix",271,542,null,null,"Cherokee County, Georgia","Atlanta",300,600]
["San Diego",322,644,null,null,"Chester County, Pennsylvania","Philadelphia",318,636]
["San Francisco",301,602,null,null,"Chisago County, Minnosota","Minneapolis-St. Paul",214,428]
["Seattle",281,562,null,null,"Clarke County, Virginia","Washington, D.C.",294,588]
[null,null,null,null,null,"Clayton County, Georgia","Atlanta",300,600]
[null,null,null,null,null,"Clear Creek County, Colorado","Denver",279,558]
[null,null,null,null,null,"Clinton County, Illinois","St. Louis",244,488]
[null,null,null,null,null,"Cobb County, Georgia","Atlanta",300,600]
[null,null,null,null,null,"Collin County, Texas","Dallas-Ft. Worth",288,576]
[null,null,null,null,null,"Colorado","West Region",264,528]
[null,null,null,null,null,"Connecticut","Northeast Region",298,596]
[null,null,null,null,null,"Contra Costa County, California","San Francisco",301,602]
[null,null,null,null,null,"Cook County, Illinois","Chicago",265,530]
[null,null,null,null,null,"Coweta County, Georgia","Atlanta",300,600]
[null,null,null,null,null,"Culpeper County, Virginia","Washington, D.C.",294,588]
[null,null,null,null,null,"Cuyahoga County, Ohio","Cleveland",225,450]
[null,null,null,null,null,"Dakota County, Minnosota","Minneapolis-St. Paul",214,428]
[null,null,null,null,null,"Dallas County, Texas","Dallas-Ft. Worth",288,576]
[null,null,null,null,null,"Dawson County, Georgia","Atlanta",300,600]
[null,null,null,null,null,"DeKalb County, Georgia","Atlanta",300,600]
[null,null,null,null,null,"DeKalb County, Illinois","Chicago",265,530]
{"$rows_left_out":210}