{"text_format":"1","workbook":"xlsx","n_sheets":5,"sheets":["Calculator","National Food","OOP Healthcare","Housing Standards","Transportation"],"not_rendered":{"charts":0,"images":0,"macros":0,"external_links":0,"defined_names":0,"comments":0,"pivot_tables":0},"unopened":[],"bounds":{"document_bytes":16777216,"sheet_cells":100000,"rows_first":2000,"rows_last":500,"rows_between":2000,"halvings":0,"cell_chars":16384,"cell_head_chars":4096},"cells_cut":0,"cells_raw":0,"read":"whole","date_system":"1900"}

{"sheet":"Calculator","index":0,"n_rows":40,"n_cols":26,"rows_kept":40,"cut":false,"hidden":false,"merged":[[5,12,5,16],[26,12,26,16],[10,1,11,1],[4,21,4,22],[4,24,4,25],[26,21,26,22]]}
[]
[null,"# People in household:",2]
[null,"# People 65 or over",1]
[null,"State","Tennessee"]
[null,"County","Hamilton",{"$f":"C5&\" County\"","v":"Hamilton County"},null,null,null,null,null,null,null,null,null,null,null,null,null,null,null,null,null,"Secured Debts",null,null,"Other Expenses"]
[null,"# Vehicles >",2,null,null,null,null,null,null,null,null,null,"Household Monthly Income & Expenses",null,null,null,null,"Claimed","Allowable","Manual Allowable",null,"Lender","Amount",null,"Other Expenses:","Amount"]
[null,null,"Payment","Allowable Pmt",null,null,null,null,null,null,null,null,20,"Wages (Taxpayer)",null,35,"Food, Clothing and Misc."]
[null,"Vehicle 1 Payment",null,{"$f":"IF(C8<Transportation!B8,C8,Transportation!B8)","v":0},null,null,null,null,null,null,null,null,21,"Wages (Spouse)",null,36,"Housing and Utilities"]
[null,"Vehicle 2 Payment",null,{"$f":"IF(C9<Transportation!B8,C9,Transportation!B8)","v":0},null,null,null,null,null,null,null,null,22,"Interest - Dividends",null,37,"Vehicle Ownership Costs"]
[null,null,{"$f":"IF(OR(C6=0,C6=\"\"),0,SUM(C8:C9))","v":0},{"$f":"SUM(D8:D9)","v":0},null,null,null,null,null,null,null,null,23,"Net Business Income",null,38,"Vehicle Operating Costs"]
[null,"All Vehicles Operating","Insurance",null,"Gas","Maint.","Other","Operating","Manual Input",null,null,null,24,"Net Rental Income",null,39,"Public Transportation"]
[null,null,0,null,0,0,0,{"$f":"SUM(C12:G12)","v":0},0,null,null,null,25,"Distributions (K-1, IRA, etc.)",null,40,"Health Insurance"]
[null,null,null,null,null,null,null,null,null,null,null,null,26,"Pension (Taxpayer)",null,41,"Out of Pocket Health Care Costs"]
[null,null,null,null,null,null,null,null,null,null,null,null,27,"Pension (Spouse)",null,42,"Court Ordered Payments"]
[null,null,null,null,null,null,null,null,null,null,null,null,28,"Social Security (Taxpayer)",null,43,"Child/Dependent Care"]
[null,null,null,null,null,null,null,null,null,null,null,null,29,"Social Security (Spouse)",null,44,"Life Insurance"]
[null,null,null,null,null,null,null,null,null,null,null,null,30,"Child Support",null,45,"Current year taxes (Income/FICA)"]
[null,null,null,null,null,null,null,null,null,null,null,null,31,"Alimony",null,46,"Secured Debts (Attach list)",{"$f":"SUM(SecDebtTbl[[#All],[Amount]])","v":0}]
[null,null,null,null,null,null,null,null,null,null,null,null,null,"Other Income (Specify below)",null,47,"Delinquent State or Local Taxes"]
[null,null,null,null,null,null,null,null,null,null,null,null,32,"",null,48,"Other Expenses (Attach list)",{"$f":"SUM(OtherExpTbl[[#All],[Amount]])","v":0}]
[null,null,null,null,null,null,null,null,null,null,null,null,33,"",null,49,"Total Living Exps (add lines 35-48)",{"$f":"SUM(R7:R20)","v":0},{"$f":"SUM(S7:S20)","v":0},{"$f":"SUM(T7:T20)","v":0}]
[null,null,null,null,null,null,null,null,null,null,null,null,34,"Total Income (add lines 20-33)",{"$f":"SUM(O7:O21)","v":0},50,"Net difference (Line 34 minus 49)",{"$f":"SUM(O22-R21)","v":0},{"$f":"SUM(O22-S21)","v":0},{"$f":"SUM(O22-T21)","v":0}]
[]
[]
[]
[]
[null,null,null,null,null,null,null,null,null,null,null,null,"Sole Proprietorship Information",null,null,null,null,"Claimed","Allowable",null,null,"Other Sole Prop Expenses"]
[null,null,null,null,null,null,null,null,null,null,null,null,67,"Gross Receipts",null,77,"Materials Purchased",null,null,null,null,"Other SP Expenses:","Amount"]
[null,null,null,null,null,null,null,null,null,null,null,null,68,"Gross Rental Income",null,78,"Inventory Purchased"]
[null,null,null,null,null,null,null,null,null,null,null,null,69,"Interest",null,79,"Gross Wages & Salaries"]
[null,null,null,null,null,null,null,null,null,null,null,null,70,"Dividends",null,80,"Rent"]
[null,null,null,null,null,null,null,null,null,null,null,null,71,"Cash Receipts not incl in 67-70",null,81,"Supplies"]
[null,null,null,null,null,null,null,null,null,null,null,null,null,"Other Income (Specify below)",null,82,"Utilities/Telephone"]
[null,null,null,null,null,null,null,null,null,null,null,null,72,null,null,83,"Vehicle Gasoline/Oil"]
[null,null,null,null,null,null,null,null,null,null,null,null,73,null,null,84,"Repairs & Maintenance"]
[null,null,null,null,null,null,null,null,null,null,null,null,74,null,null,85,"Insurance"]
[null,null,null,null,null,null,null,null,null,null,null,null,75,null,null,86,"Current Taxes"]
[null,null,null,null,null,null,null,null,null,null,null,null,76,"Total Income (Add 67 through 75)",{"$f":"SUM(O28:O37)","v":0},87,"Other Exp, incl install pmts (Specify)",{"$f":"SUM(OtherSPExpTb[[#All],[Amount]])","v":0}]
[null,null,null,null,null,null,null,null,null,null,null,null,null,null,null,88,"Total Exps (Add lines 77 through 87)",{"$f":"SUM(R28:R38)","v":0}]
[null,null,null,null,null,null,null,null,null,null,null,null,null,null,null,89,"Net Bus Income (Line 76 minus 88)",{"$f":"O38-R39","v":0}]

{"sheet":"National Food","index":1,"n_rows":11,"n_cols":7,"rows_kept":11,"cut":false,"hidden":false,"merged":[]}
["Expense",1,2,3,4,5,"Computed"]
["Food",466,777,936,1123,{"$f":"E2","v":1123},{"$f":"_xlfn.IFNA(LOOKUP(Calculator!$C$2,$B$1:$F$1,$B2:$F2),0)","v":777}]
["Housekeeping supplies",47,80,85,90,90,{"$f":"_xlfn.IFNA(LOOKUP(Calculator!$C$2,$B$1:$F$1,$B3:$F3),0)","v":80}]
["Apparel & services",96,145,207,252,252,{"$f":"_xlfn.IFNA(LOOKUP(Calculator!$C$2,$B$1:$F$1,$B4:$F4),0)","v":145}]
["Personal care products & services",43,78,91,97,97,{"$f":"_xlfn.IFNA(LOOKUP(Calculator!$C$2,$B$1:$F$1,$B5:$F5),0)","v":78}]
["Miscellaneous",189,309,381,431,431,{"$f":"_xlfn.IFNA(LOOKUP(Calculator!$C$2,$B$1:$F$1,$B6:$F6),0)","v":309}]
["Total",841,1389,1700,1993,1993,{"$f":"_xlfn.IFNA(LOOKUP(Calculator!$C$2,$B$1:$F$1,$B7:$F7)+C11,0)","v":1389}]
[]
[]
["More than four persons","Additional Persons Amount"]
["For each additional person, add to four-person total allowance:",356,{"$f":"IF(Calculator!C2>E1,(Calculator!C2-'National Food'!E1)*'National Food'!B11,0)","v":0}]

{"sheet":"OOP Healthcare","index":2,"n_rows":8,"n_cols":2,"rows_kept":8,"cut":false,"hidden":false,"merged":[]}
["Age","Out of Pocket Costs"]
["Under 65",79]
["65 and Older",154]
[]
[]
["Under 65",{"$f":"(Calculator!C2-Calculator!C3)*'OOP Healthcare'!B2","v":79}]
["65 & older",{"$f":"Calculator!C3*'OOP Healthcare'!B3","v":154}]
["Total",{"$f":"SUM(B6:B7)","v":233}]

{"sheet":"Housing Standards","index":3,"n_rows":3224,"n_cols":14,"rows_kept":3224,"cut":false,"hidden":false,"merged":[]}
[null,null,1,2,3,4,5,null,null,{"$f":"SUBSTITUTE(ADDRESS(1, MATCH(Calculator!C2,'Housing Standards'!A1:G1), 4), \"1\", \"\")","v":"D"},{"$f":"_xlfn.XLOOKUP(Calculator!D5&Calculator!C4,Table1[County]&Table1[State Name],Table1[Lookup])","v":2542},{"$f":"J1&K1","v":"D2542"}]
["County","State Name","2023 Published ALE\nHousing Expense for a Family of 1","2023 Published ALE\nHousing Expense for a Family of 2","2023 Published ALE\nHousing Expense for a Family of 3","2023 Published ALE\nHousing Expense for a Family of 4","2023 Published ALE\nHousing Expense for a Family of 5","Lookup",null,null,{"$f":"_xlfn.IFNA(INDIRECT(L1),0)","v":1843},null,null,"States"]
["Autauga County","Alabama",1483,1741,1835,2046,2079,{"$f":"ROW()","v":3},null,null,null,null,null,{"$f":"_xlfn.UNIQUE(B3:B3224)","v":"Alabama"}]
["Baldwin County","Alabama",1617,1899,2001,2231,2267,{"$f":"ROW()","v":4},null,null,null,null,null,"Alaska"]
["Barbour County","Alabama",1278,1501,1582,1764,1792,{"$f":"ROW()","v":5},null,null,null,null,null,"Arizona"]
["Bibb County","Alabama",1323,1554,1637,1825,1855,{"$f":"ROW()","v":6},null,null,null,null,null,"Arkansas"]
["Blount County","Alabama",1405,1650,1739,1939,1970,{"$f":"ROW()","v":7},null,null,null,null,null,"California"]
["Bullock County","Alabama",1494,1755,1849,2062,2095,{"$f":"ROW()","v":8},null,null,null,null,null,"Colorado"]
["Butler County","Alabama",1268,1489,1569,1749,1778,{"$f":"ROW()","v":9},null,null,null,null,null,"Connecticut"]
["Calhoun County","Alabama",1339,1572,1657,1848,1877,{"$f":"ROW()","v":10},null,null,null,null,null,"Delaware"]
["Chambers County","Alabama",1285,1509,1590,1773,1801,{"$f":"ROW()","v":11},null,null,null,null,null,"District of Columbia"]
["Cherokee County","Alabama",1429,1678,1768,1971,2003,{"$f":"ROW()","v":12},null,null,null,null,null,"Florida"]
["Chilton County","Alabama",1338,1572,1656,1846,1876,{"$f":"ROW()","v":13},null,null,null,null,null,"Georgia"]
["Choctaw County","Alabama",1195,1404,1479,1649,1676,{"$f":"ROW()","v":14},null,null,null,null,null,"Hawaii"]
["Clarke County","Alabama",1403,1647,1736,1936,1967,{"$f":"ROW()","v":15},null,null,null,null,null,"Idaho"]
["Clay County","Alabama",1217,1429,1506,1679,1706,{"$f":"ROW()","v":16},null,null,null,null,null,"Illinois"]
["Cleburne County","Alabama",1496,1758,1852,2065,2098,{"$f":"ROW()","v":17},null,null,null,null,null,"Indiana"]
["Coffee County","Alabama",1454,1708,1800,2007,2039,{"$f":"ROW()","v":18},null,null,null,null,null,"Iowa"]
["Colbert County","Alabama",1326,1557,1641,1830,1859,{"$f":"ROW()","v":19},null,null,null,null,null,"Kansas"]
["Conecuh County","Alabama",1221,1434,1511,1685,1712,{"$f":"ROW()","v":20},null,null,null,null,null,"Kentucky"]
["Coosa County","Alabama",1201,1411,1487,1658,1685,{"$f":"ROW()","v":21},null,null,null,null,null,"Louisiana"]
["Covington County","Alabama",1289,1514,1595,1778,1807,{"$f":"ROW()","v":22},null,null,null,null,null,"Maine"]
["Crenshaw County","Alabama",1334,1567,1651,1841,1871,{"$f":"ROW()","v":23},null,null,null,null,null,"Maryland"]
["Cullman County","Alabama",1338,1572,1656,1846,1876,{"$f":"ROW()","v":24},null,null,null,null,null,"Massachusetts"]
["Dale County","Alabama",1289,1514,1595,1778,1807,{"$f":"ROW()","v":25},null,null,null,null,null,"Michigan"]
["Dallas County","Alabama",1326,1557,1641,1830,1859,{"$f":"ROW()","v":26},null,null,null,null,null,"Minnesota"]
["DeKalb County","Alabama",1301,1528,1610,1795,1824,{"$f":"ROW()","v":27},null,null,null,null,null,"Mississippi"]
["Elmore County","Alabama",1544,1814,1911,2131,2165,{"$f":"ROW()","v":28},null,null,null,null,null,"Missouri"]
["Escambia County","Alabama",1238,1454,1532,1708,1736,{"$f":"ROW()","v":29},null,null,null,null,null,"Montana"]
["Etowah County","Alabama",1358,1595,1681,1874,1905,{"$f":"ROW()","v":30},null,null,null,null,null,"Nebraska"]
["Fayette County","Alabama",1257,1477,1556,1735,1763,{"$f":"ROW()","v":31},null,null,null,null,null,"Nevada"]
["Franklin County","Alabama",1271,1493,1573,1754,1782,{"$f":"ROW()","v":32},null,null,null,null,null,"New Hampshire"]
["Geneva County","Alabama",1313,1542,1625,1812,1841,{"$f":"ROW()","v":33},null,null,null,null,null,"New Jersey"]
["Greene County","Alabama",1109,1302,1372,1530,1554,{"$f":"ROW()","v":34},null,null,null,null,null,"New Mexico"]
["Hale County","Alabama",1233,1448,1526,1701,1729,{"$f":"ROW()","v":35},null,null,null,null,null,"New York"]
["Henry County","Alabama",1296,1522,1604,1788,1817,{"$f":"ROW()","v":36},null,null,null,null,null,"North Carolina"]
["Houston County","Alabama",1399,1644,1732,1931,1962,{"$f":"ROW()","v":37},null,null,null,null,null,"North Dakota"]
["Jackson County","Alabama",1311,1540,1623,1810,1839,{"$f":"ROW()","v":38},null,null,null,null,null,"Ohio"]
["Jefferson County","Alabama",1629,1913,2016,2248,2284,{"$f":"ROW()","v":39},null,null,null,null,null,"Oklahoma"]
["Lamar County","Alabama",1316,1546,1629,1816,1846,{"$f":"ROW()","v":40},null,null,null,null,null,"Oregon"]
["Lauderdale County","Alabama",1395,1639,1727,1926,1957,{"$f":"ROW()","v":41},null,null,null,null,null,"Pennsylvania"]
["Lawrence County","Alabama",1340,1573,1658,1849,1879,{"$f":"ROW()","v":42},null,null,null,null,null,"Puerto Rico"]
["Lee County","Alabama",1564,1837,1936,2159,2193,{"$f":"ROW()","v":43},null,null,null,null,null,"Rhode Island"]
["Limestone County","Alabama",1495,1756,1850,2063,2096,{"$f":"ROW()","v":44},null,null,null,null,null,"South Carolina"]
["Lowndes County","Alabama",1409,1655,1744,1945,1976,{"$f":"ROW()","v":45},null,null,null,null,null,"South Dakota"]
["Macon County","Alabama",1243,1460,1538,1715,1743,{"$f":"ROW()","v":46},null,null,null,null,null,"Tennessee"]
["Madison County","Alabama",1586,1863,1963,2189,2224,{"$f":"ROW()","v":47},null,null,null,null,null,"Texas"]
["Marengo County","Alabama",1416,1663,1752,1953,1985,{"$f":"ROW()","v":48},null,null,null,null,null,"Utah"]
["Marion County","Alabama",1188,1395,1470,1639,1666,{"$f":"ROW()","v":49},null,null,null,null,null,"Vermont"]
["Marshall County","Alabama",1378,1618,1705,1901,1932,{"$f":"ROW()","v":50},null,null,null,null,null,"Virginia"]
["Mobile County","Alabama",1472,1729,1822,2032,2064,{"$f":"ROW()","v":51},null,null,null,null,null,"Washington"]
["Monroe County","Alabama",1323,1554,1637,1825,1855,{"$f":"ROW()","v":52},null,null,null,null,null,"West Virginia"]
["Montgomery County","Alabama",1429,1679,1769,1972,2004,{"$f":"ROW()","v":53},null,null,null,null,null,"Wisconsin"]
["Morgan County","Alabama",1403,1647,1736,1936,1967,{"$f":"ROW()","v":54},null,null,null,null,null,"Wyoming"]
["Perry County","Alabama",1239,1455,1533,1709,1737,{"$f":"ROW()","v":55}]
["Pickens County","Alabama",1302,1530,1612,1797,1826,{"$f":"ROW()","v":56}]
["Pike County","Alabama",1476,1734,1827,2037,2070,{"$f":"ROW()","v":57}]
["Randolph County","Alabama",1329,1561,1645,1834,1864,{"$f":"ROW()","v":58}]
["Russell County","Alabama",1416,1663,1752,1953,1985,{"$f":"ROW()","v":59}]
["St. Clair County","Alabama",1523,1789,1885,2102,2136,{"$f":"ROW()","v":60}]
{"$rows_left_out":3165}
{"sheet":"Transportation","index":4,"n_rows":270,"n_cols":11,"rows_kept":270,"cut":false,"hidden":false,"merged":[[0,9,1,9],[0,10,1,10]]}
[null,null,null,null,null,"County & State","Region","1 veh","2+ veh","# Vehicles Claimed:","Max Allowed"]
[null,null,null,null,null,{"$f":"IF(OR(Calculator!C5=\"\",Calculator!C4=\"\"),\"\",Calculator!D5&\", \"&Calculator!C4)","v":"Hamilton County, Tennessee"},{"$f":"IF(F2=\"\",\"\",_xlfn.IFNA(_xlfn.XLOOKUP(F2,F3:F270,G3:G270),_xlfn.XLOOKUP(Calculator!C4,F3:F270,G3:G270)))","v":"South Region"},{"$f":"_xlfn.IFNA(_xlfn.IFNA(_xlfn.XLOOKUP(G2,G3:G270,H3:H270),_xlfn.XLOOKUP(Calculator!E4,G3:G270,H3:H270)),0)","v":242},{"$f":"IFERROR(_xlfn.IFNA(_xlfn.XLOOKUP(H2,H3:H270,I3:I270),_xlfn.XLOOKUP(Calculator!#REF!,H3:H270,I3:I270)),0)","v":484}]
["Public Transportation",null,null,null,null,"Adams County, Colorado","Denver",{"$f":"_xlfn.XLOOKUP(G3,A:A,B:B)","v":279},{"$f":"_xlfn.XLOOKUP(G3,A:A,C:C)","v":558},{"$f":"Calculator!C6","v":2},{"$f":"IF(Calculator!C6>1,Transportation!I2,Transportation!H2)","v":484}]
["Location","Allowed Amount",null,null,null,"Alabama","South Region",{"$f":"_xlfn.XLOOKUP(G4,A:A,B:B)","v":242},{"$f":"_xlfn.XLOOKUP(G4,A:A,C:C)","v":484}]
["National ",218,null,null,null,"Alameda County, California","San Francisco",{"$f":"_xlfn.XLOOKUP(G5,A:A,B:B)","v":301},{"$f":"_xlfn.XLOOKUP(G5,A:A,C:C)","v":602}]
["Ownership Costs",null,null,null,null,"Alaska","West Region",{"$f":"_xlfn.XLOOKUP(G6,A:A,B:B)","v":264},{"$f":"_xlfn.XLOOKUP(G6,A:A,C:C)","v":528}]
["Location","One Car","Two Cars",null,null,"Alexandria city County, Virginia","Washington, D.C.",{"$f":"_xlfn.XLOOKUP(G7,A:A,B:B)","v":294},{"$f":"_xlfn.XLOOKUP(G7,A:A,C:C)","v":588}]
["National",629,1258,null,null,"Anchorage County, Alaska","Anchorage",{"$f":"_xlfn.XLOOKUP(G8,A:A,B:B)","v":208},{"$f":"_xlfn.XLOOKUP(G8,A:A,C:C)","v":416}]
["Northeast Region Operating Costs",null,null,null,null,"Anne Arundel County, Maryland","Baltimore",{"$f":"_xlfn.XLOOKUP(G9,A:A,B:B)","v":277},{"$f":"_xlfn.XLOOKUP(G9,A:A,C:C)","v":554}]
["Location","One Car","Two Cars",null,null,"Anoka County, Minnosota","Minneapolis-St. Paul",{"$f":"_xlfn.XLOOKUP(G10,A:A,B:B)","v":214},{"$f":"_xlfn.XLOOKUP(G10,A:A,C:C)","v":428}]
["Northeast Region",298,596,null,null,"Arapahoe County, Colorado","Denver",{"$f":"_xlfn.XLOOKUP(G11,A:A,B:B)","v":279},{"$f":"_xlfn.XLOOKUP(G11,A:A,C:C)","v":558}]
["Boston",294,588,null,null,"Arizona","West Region",{"$f":"_xlfn.XLOOKUP(G12,A:A,B:B)","v":264},{"$f":"_xlfn.XLOOKUP(G12,A:A,C:C)","v":528}]
["New York",379,758,null,null,"Arkansas","South Region",{"$f":"_xlfn.XLOOKUP(G13,A:A,B:B)","v":242},{"$f":"_xlfn.XLOOKUP(G13,A:A,C:C)","v":484}]
["Philadelphia",318,636,null,null,"Arlington County, Virginia","Washington, D.C.",{"$f":"_xlfn.XLOOKUP(G14,A:A,B:B)","v":294},{"$f":"_xlfn.XLOOKUP(G14,A:A,C:C)","v":588}]
["Midwest Region Operating Costs",null,null,null,null,"Ashtabula County, Ohio","Cleveland",{"$f":"_xlfn.XLOOKUP(G15,A:A,B:B)","v":225},{"$f":"_xlfn.XLOOKUP(G15,A:A,C:C)","v":450}]
["Location","One Car","Two Cars",null,null,"Austin County, Texas","Houston",{"$f":"_xlfn.XLOOKUP(G16,A:A,B:B)","v":312},{"$f":"_xlfn.XLOOKUP(G16,A:A,C:C)","v":624}]
["Midwest Region",225,450,null,null,"Baltimore city County, Maryland","Baltimore",{"$f":"_xlfn.XLOOKUP(G17,A:A,B:B)","v":277},{"$f":"_xlfn.XLOOKUP(G17,A:A,C:C)","v":554}]
["Chicago",265,530,null,null,"Baltimore county County, Maryland","Baltimore",{"$f":"_xlfn.XLOOKUP(G18,A:A,B:B)","v":277},{"$f":"_xlfn.XLOOKUP(G18,A:A,C:C)","v":554}]
["Cleveland",225,450,null,null,"Barrow County, Georgia","Atlanta",{"$f":"_xlfn.XLOOKUP(G19,A:A,B:B)","v":300},{"$f":"_xlfn.XLOOKUP(G19,A:A,C:C)","v":600}]
["Detroit",315,630,null,null,"Bartow County, Georgia","Atlanta",{"$f":"_xlfn.XLOOKUP(G20,A:A,B:B)","v":300},{"$f":"_xlfn.XLOOKUP(G20,A:A,C:C)","v":600}]
["Minneapolis-St. Paul",214,428,null,null,"Bergen County, New Jersey","New York",{"$f":"_xlfn.XLOOKUP(G21,A:A,B:B)","v":379},{"$f":"_xlfn.XLOOKUP(G21,A:A,C:C)","v":758}]
["St. Louis",244,488,null,null,"Bond County, Illinois","St. Louis",{"$f":"_xlfn.XLOOKUP(G22,A:A,B:B)","v":244},{"$f":"_xlfn.XLOOKUP(G22,A:A,C:C)","v":488}]
["South Region Operating Costs",null,null,null,null,"Brazoria County, Texas","Houston",{"$f":"_xlfn.XLOOKUP(G23,A:A,B:B)","v":312},{"$f":"_xlfn.XLOOKUP(G23,A:A,C:C)","v":624}]
["Location","One Car","Two Cars",null,null,"Bronx County, New York","New York",{"$f":"_xlfn.XLOOKUP(G24,A:A,B:B)","v":379},{"$f":"_xlfn.XLOOKUP(G24,A:A,C:C)","v":758}]
["South Region",242,484,null,null,"Broomfield County, Colorado","Denver",{"$f":"_xlfn.XLOOKUP(G25,A:A,B:B)","v":279},{"$f":"_xlfn.XLOOKUP(G25,A:A,C:C)","v":558}]
["Atlanta",300,600,null,null,"Broward County, Florida","Miami",{"$f":"_xlfn.XLOOKUP(G26,A:A,B:B)","v":364},{"$f":"_xlfn.XLOOKUP(G26,A:A,C:C)","v":728}]
["Baltimore",277,554,null,null,"Bucks County, Pennsylvania","Philadelphia",{"$f":"_xlfn.XLOOKUP(G27,A:A,B:B)","v":318},{"$f":"_xlfn.XLOOKUP(G27,A:A,C:C)","v":636}]
["Dallas-Ft. Worth",288,576,null,null,"Burlington County, New Jersey","Philadelphia",{"$f":"_xlfn.XLOOKUP(G28,A:A,B:B)","v":318},{"$f":"_xlfn.XLOOKUP(G28,A:A,C:C)","v":636}]
["Houston",312,624,null,null,"Butts County, Georgia","Atlanta",{"$f":"_xlfn.XLOOKUP(G29,A:A,B:B)","v":300},{"$f":"_xlfn.XLOOKUP(G29,A:A,C:C)","v":600}]
["Miami",364,728,null,null,"Calhoun County, Illinois","St. Louis",{"$f":"_xlfn.XLOOKUP(G30,A:A,B:B)","v":244},{"$f":"_xlfn.XLOOKUP(G30,A:A,C:C)","v":488}]
["Tampa",297,594,null,null,"California","West Region",{"$f":"_xlfn.XLOOKUP(G31,A:A,B:B)","v":264},{"$f":"_xlfn.XLOOKUP(G31,A:A,C:C)","v":528}]
["Washington, D.C.",294,588,null,null,"Calvert County, Maryland","Washington, D.C.",{"$f":"_xlfn.XLOOKUP(G32,A:A,B:B)","v":294},{"$f":"_xlfn.XLOOKUP(G32,A:A,C:C)","v":588}]
["West Region Operating Costs",null,null,null,null,"Camden County, New Jersey","Philadelphia",{"$f":"_xlfn.XLOOKUP(G33,A:A,B:B)","v":318},{"$f":"_xlfn.XLOOKUP(G33,A:A,C:C)","v":636}]
["Location","One Car","Two Cars",null,null,"Carroll County, Georgia","Atlanta",{"$f":"_xlfn.XLOOKUP(G34,A:A,B:B)","v":300},{"$f":"_xlfn.XLOOKUP(G34,A:A,C:C)","v":600}]
["West Region",264,528,null,null,"Carroll County, Maryland","Baltimore",{"$f":"_xlfn.XLOOKUP(G35,A:A,B:B)","v":277},{"$f":"_xlfn.XLOOKUP(G35,A:A,C:C)","v":554}]
["Anchorage",208,416,null,null,"Carver County, Minnosota","Minneapolis-St. Paul",{"$f":"_xlfn.XLOOKUP(G36,A:A,B:B)","v":214},{"$f":"_xlfn.XLOOKUP(G36,A:A,C:C)","v":428}]
["Denver",279,558,null,null,"Cecil County, Maryland","Philadelphia",{"$f":"_xlfn.XLOOKUP(G37,A:A,B:B)","v":318},{"$f":"_xlfn.XLOOKUP(G37,A:A,C:C)","v":636}]
["Honolulu",243,486,null,null,"Chambers County, Texas","Houston",{"$f":"_xlfn.XLOOKUP(G38,A:A,B:B)","v":312},{"$f":"_xlfn.XLOOKUP(G38,A:A,C:C)","v":624}]
["Los Angeles",339,678,null,null,"Charles County, Maryland","Washington, D.C.",{"$f":"_xlfn.XLOOKUP(G39,A:A,B:B)","v":294},{"$f":"_xlfn.XLOOKUP(G39,A:A,C:C)","v":588}]
["Phoenix",271,542,null,null,"Cherokee County, Georgia","Atlanta",{"$f":"_xlfn.XLOOKUP(G40,A:A,B:B)","v":300},{"$f":"_xlfn.XLOOKUP(G40,A:A,C:C)","v":600}]
["San Diego",322,644,null,null,"Chester County, Pennsylvania","Philadelphia",{"$f":"_xlfn.XLOOKUP(G41,A:A,B:B)","v":318},{"$f":"_xlfn.XLOOKUP(G41,A:A,C:C)","v":636}]
["San Francisco",301,602,null,null,"Chisago County, Minnosota","Minneapolis-St. Paul",{"$f":"_xlfn.XLOOKUP(G42,A:A,B:B)","v":214},{"$f":"_xlfn.XLOOKUP(G42,A:A,C:C)","v":428}]
["Seattle",281,562,null,null,"Clarke County, Virginia","Washington, D.C.",{"$f":"_xlfn.XLOOKUP(G43,A:A,B:B)","v":294},{"$f":"_xlfn.XLOOKUP(G43,A:A,C:C)","v":588}]
[null,null,null,null,null,"Clayton County, Georgia","Atlanta",{"$f":"_xlfn.XLOOKUP(G44,A:A,B:B)","v":300},{"$f":"_xlfn.XLOOKUP(G44,A:A,C:C)","v":600}]
[null,null,null,null,null,"Clear Creek County, Colorado","Denver",{"$f":"_xlfn.XLOOKUP(G45,A:A,B:B)","v":279},{"$f":"_xlfn.XLOOKUP(G45,A:A,C:C)","v":558}]
[null,null,null,null,null,"Clinton County, Illinois","St. Louis",{"$f":"_xlfn.XLOOKUP(G46,A:A,B:B)","v":244},{"$f":"_xlfn.XLOOKUP(G46,A:A,C:C)","v":488}]
[null,null,null,null,null,"Cobb County, Georgia","Atlanta",{"$f":"_xlfn.XLOOKUP(G47,A:A,B:B)","v":300},{"$f":"_xlfn.XLOOKUP(G47,A:A,C:C)","v":600}]
[null,null,null,null,null,"Collin County, Texas","Dallas-Ft. Worth",{"$f":"_xlfn.XLOOKUP(G48,A:A,B:B)","v":288},{"$f":"_xlfn.XLOOKUP(G48,A:A,C:C)","v":576}]
[null,null,null,null,null,"Colorado","West Region",{"$f":"_xlfn.XLOOKUP(G49,A:A,B:B)","v":264},{"$f":"_xlfn.XLOOKUP(G49,A:A,C:C)","v":528}]
[null,null,null,null,null,"Connecticut","Northeast Region",{"$f":"_xlfn.XLOOKUP(G50,A:A,B:B)","v":298},{"$f":"_xlfn.XLOOKUP(G50,A:A,C:C)","v":596}]
[null,null,null,null,null,"Contra Costa County, California","San Francisco",{"$f":"_xlfn.XLOOKUP(G51,A:A,B:B)","v":301},{"$f":"_xlfn.XLOOKUP(G51,A:A,C:C)","v":602}]
[null,null,null,null,null,"Cook County, Illinois","Chicago",{"$f":"_xlfn.XLOOKUP(G52,A:A,B:B)","v":265},{"$f":"_xlfn.XLOOKUP(G52,A:A,C:C)","v":530}]
[null,null,null,null,null,"Coweta County, Georgia","Atlanta",{"$f":"_xlfn.XLOOKUP(G53,A:A,B:B)","v":300},{"$f":"_xlfn.XLOOKUP(G53,A:A,C:C)","v":600}]
[null,null,null,null,null,"Culpeper County, Virginia","Washington, D.C.",{"$f":"_xlfn.XLOOKUP(G54,A:A,B:B)","v":294},{"$f":"_xlfn.XLOOKUP(G54,A:A,C:C)","v":588}]
[null,null,null,null,null,"Cuyahoga County, Ohio","Cleveland",{"$f":"_xlfn.XLOOKUP(G55,A:A,B:B)","v":225},{"$f":"_xlfn.XLOOKUP(G55,A:A,C:C)","v":450}]
[null,null,null,null,null,"Dakota County, Minnosota","Minneapolis-St. Paul",{"$f":"_xlfn.XLOOKUP(G56,A:A,B:B)","v":214},{"$f":"_xlfn.XLOOKUP(G56,A:A,C:C)","v":428}]
[null,null,null,null,null,"Dallas County, Texas","Dallas-Ft. Worth",{"$f":"_xlfn.XLOOKUP(G57,A:A,B:B)","v":288},{"$f":"_xlfn.XLOOKUP(G57,A:A,C:C)","v":576}]
[null,null,null,null,null,"Dawson County, Georgia","Atlanta",{"$f":"_xlfn.XLOOKUP(G58,A:A,B:B)","v":300},{"$f":"_xlfn.XLOOKUP(G58,A:A,C:C)","v":600}]
[null,null,null,null,null,"DeKalb County, Georgia","Atlanta",{"$f":"_xlfn.XLOOKUP(G59,A:A,B:B)","v":300},{"$f":"_xlfn.XLOOKUP(G59,A:A,C:C)","v":600}]
[null,null,null,null,null,"DeKalb County, Illinois","Chicago",{"$f":"_xlfn.XLOOKUP(G60,A:A,B:B)","v":265},{"$f":"_xlfn.XLOOKUP(G60,A:A,C:C)","v":530}]
{"$rows_left_out":210}