{"text_format":"1","workbook":"xlsx","n_sheets":17,"sheets":["Holidays","Events","Days1-2","Days3-4","Days5-6","Days7-8","Days9-10","Days11-12","Days13-14","Days15-16","Days17-18","Days19-20","Days21-22","Days23-24","Days25-26","Days27-28","Days29-30"],"not_rendered":{"charts":0,"images":0,"macros":1,"external_links":0,"defined_names":26,"comments":1,"pivot_tables":0},"unopened":[],"bounds":{"document_bytes":16777216,"sheet_cells":100000,"rows_first":2000,"rows_last":500,"rows_between":2000,"halvings":0,"cell_chars":16384,"cell_head_chars":4096},"cells_cut":0,"cells_raw":0,"read":"whole","date_system":"1900"}

{"sheet":"Holidays","index":0,"n_rows":87,"n_cols":7,"rows_kept":87,"cut":false,"hidden":false,"merged":[[2,0,5,6]]}
["Holidays and Special Events"]
[]
["This worksheet uses formulas to calculate the dates for various holidays and observances. The dates listed in this worksheet will appear in rows 10, 11, and 12 of the planner. If you want to enter dates for holidays without using formulas, just enter the description in column A and the date in column F."]
[]
[]
[]
[]
["Current Year",{"$f":"YEAR('Days1-2'!$E$1)","v":2024}]
["Current Month",{"$f":"MONTH('Days1-2'!$E$1)","v":4}]
[]
["Holiday/Event","Month","Day","Week","WeekDay","Date","Notes"]
["Taxes Due",4,15,null,null,{"$f":"IF(WEEKDAY(DATE(year,4,16),16)<=2,DATE(year,4,18),IF(WEEKDAY(DATE(year,4,16),1)=2,DATE(year,4,17),DATE(year,4,15)))","v":"2024-04-15"},"Includes the effect of Emancipation Day"]
["Daylight Saving",4,null,null,1,{"$f":"IF(year<2007,(DATE(year,B13,1)+(1-1)*7)+IF(E13<WEEKDAY(DATE(year,B13,1)),E13+7-WEEKDAY(DATE(year,B13,1)),E13-WEEKDAY(DATE(year,B13,1))),(DATE(year,B13-1,1)+(2-1)*7)+IF(E13<WEEKDAY(DATE(year,B13-1,1)),E13+7-WEEKDAY(DATE(year,B13-1,1)),E13-WEEKDAY(DATE(year,B13-1,1))))","v":"2024-03-10"},"2nd Sunday in March (starting in 2007), 1st Sunday in April (prior to 2007)"]
["Daylight Saving",11,null,null,1,{"$f":"IF(year<2007,(DATE(year,B14,1)+(-1)*7)+IF(E14<WEEKDAY(DATE(year,B14,1)),E14+7-WEEKDAY(DATE(year,B14,1)),E14-WEEKDAY(DATE(year,B14,1))),(DATE(year,B14,1)+(1-1)*7)+IF(E14<WEEKDAY(DATE(year,B14,1)),E14+7-WEEKDAY(DATE(year,B14,1)),E14-WEEKDAY(DATE(year,B14,1))))","v":"2024-11-03"},"1st Sunday of November (starting in 2007), Last Sunday in October (prior to 2007)"]
["Grandparents Day",null,null,null,null,{"$f":"F43+6","v":"2024-09-08"},"1st Sunday after Labor Day"]
["Admin Assist Day",4,null,null,4,{"$f":"IF(WEEKDAY(DATE(year,B16+1,0),1)=7,DATE(year,B16+1,0)-(7-E16),(DATE(year,B16+1,0)-WEEKDAY(DATE(year,B16+1,0),1))-(7-E16))","v":"2024-04-24"},"Wednesday of last full week in April"]
["Easter",null,null,null,null,{"$f":"IF(AND(year>1900,year<2199),ROUND(DATE(year,4,1)/7+MOD(19*MOD(year,19)-7,30)*0.14,0)*7-6,\"\")","v":"2024-03-31"},"http://www.smart.net/~mmontes/ec-cal.html"]
["Good Friday","relative to Easter",null,null,null,{"$f":"F17-2","v":"2024-03-29"},"The Friday before Easter Sunday"]
["Pentecost","relative to Easter",null,null,null,{"$f":"F17+49","v":"2024-05-19"},"7 weeks after Easter"]
["Ash Wednesday","relative to Easter",null,null,null,{"$f":"F17-46","v":"2024-02-14"},"46 days before Easter"]
["Mardi Gras","relative to Easter",null,null,null,{"$f":"F18-47","v":"2024-02-11"},"47 days before Easter"]
["Vernal equinox",null,null,null,null,{"$f":"ROUNDDOWN((DATE(2000,3,20)+TIME(7,29,0))+(year-2000)*365.24238,0)","v":"2024-03-20"},"For 1900-2099"]
["June Solstice",null,null,null,null,{"$f":"ROUNDDOWN((DATE(2000,6,21)+TIME(1,36,0))+(year-2000)*365.24163,0)","v":"2024-06-20"},"For 1900-2099"]
["Autumnal equinox",null,null,null,null,{"$f":"ROUNDDOWN((DATE(2000,9,22)+TIME(17,17,0))+(year-2000)*365.24205,0)","v":"2024-09-22"},"For 1900-2099"]
["Dec. Solstice",null,null,null,null,{"$f":"ROUNDDOWN((DATE(2000,12,21)+TIME(13,30,0))+(year-2000)*365.242743,0)","v":"2024-12-21"},"For 1900-2099"]
["Chinese New Year",null,null,null,null,{"$f":"IF(AND(year>=2013,year<=2030),DATEVALUE(INDEX({\"2013-02-10\";\"2014-01-31\";\"2015-02-19\";\"2016-02-08\";\"2017-01-28\";\"2018-02-16\";\"2019-02-05\";\"2020-01-25\";\"2021-02-12\";\"2022-02-01\";\"2023-01-22\";\"2024-02-10\";\"2025-01-29\";\"2026-02-17\";\"2027-02-06\";\"2028-01-26\";\"2029-02-13\";\"2030-02-03\"},year-2012)),\"\")","v":"2024-02-10"},"For 2013-2030"]
["Ramadan begins",null,null,null,null,{"$f":"IF(AND(year>=2013,year<=2030),DATEVALUE(INDEX({\"2013-07-09\";\"2014-06-28\";\"2015-06-18\";\"2016-06-06\";\"2017-05-27\";\"2018-05-16\";\"2019-05-06\";\"2020-04-24\";\"2021-04-13\";\"2022-04-03\";\"2023-03-23\";\"2024-03-11\";\"2025-03-01\";\"2026-02-18\";\"2027-02-08\";\"2028-01-28\";\"2029-01-16\";\"2030-01-06\"},year-2012)),\"\")","v":"2024-03-11"},"For 2013-2030"]
["Ramadan ends","relative to Ramadan begins",null,null,null,{"$f":"IF(ISERROR(F27+30),\"\",F27+30)","v":"2024-04-10"},"For 2013-2030"]
["Rosh Hashanah",null,null,null,null,{"$f":"IF(AND(year>=2013,year<=2030),DATEVALUE(INDEX({\"2013-09-05\";\"2014-09-25\";\"2015-09-14\";\"2016-10-03\";\"2017-09-21\";\"2018-09-10\";\"2019-09-30\";\"2020-09-19\";\"2021-09-07\";\"2022-09-26\";\"2023-09-16\";\"2024-10-03\";\"2025-09-23\";\"2026-09-12\";\"2027-10-02\";\"2028-09-21\";\"2029-09-10\";\"2030-09-28\"},year-2012)),\"\")","v":"2024-10-03"},"For 2013-2030"]
["Yom Kippur","relative to Rosh Hashanah",null,null,null,{"$f":"IF(ISERROR(F29+9),\"\",F29+9)","v":"2024-10-12"},"For 2013-2030"]
["Passover","relative to Rosh Hashanah",null,null,null,{"$f":"IF(ISERROR(F29-163),\"\",F29-163)","v":"2024-04-23"},"For 2013-2030"]
["Hanukkah begins",null,null,null,null,{"$f":"IF(AND(year>=2013,year<=2030),DATEVALUE(INDEX({\"2013-11-27\";\"2014-12-16\";\"2015-12-06\";\"2016-12-24\";\"2017-12-12\";\"2018-12-02\";\"2019-12-22\";\"2020-12-10\";\"2021-11-28\";\"2022-12-18\";\"2023-12-07\";\"2024-12-25\";\"2025-12-14\";\"2026-12-04\";\"2027-12-24\";\"2028-12-12\";\"2029-12-01\";\"2030-12-20\"},year-2012)),\"\")","v":"2024-12-25"},"For 2013-2030"]
["Victoria Day (Canada)",null,null,null,null,{"$f":"DATE(year,5,24)-MOD(WEEKDAY(DATE(year,5,24),1)-2,7)","v":"2024-05-20"},"Monday on or before May 24"]
[]
[]
["Holidays occuring on a Specific Day of the Week"]
["Thanksgiving",11,null,4,5,{"$f":"IF(OR(OR(B37=\"\",D37=\"\"),E37=\"\"),\"\",(DATE(year,B37,1)+(D37-1)*7)+E37-WEEKDAY(DATE(year,B37,1))+IF(E37<WEEKDAY(DATE(year,B37,1)),7,0))","v":"2024-11-28"},"4th Thursday of November"]
["ML King Day",1,null,3,2,{"$f":"IF(OR(OR(B38=\"\",D38=\"\"),E38=\"\"),\"\",(DATE(year,B38,1)+(D38-1)*7)+E38-WEEKDAY(DATE(year,B38,1))+IF(E38<WEEKDAY(DATE(year,B38,1)),7,0))","v":"2024-01-15"},"3rd Monday of January"]
["ML King Day",1,null,3,2,{"$f":"IF(OR(OR(B39=\"\",D39=\"\"),E39=\"\"),\"\",(DATE(year+1,B39,1)+(D39-1)*7)+E39-WEEKDAY(DATE(year+1,B39,1))+IF(E39<WEEKDAY(DATE(year+1,B39,1)),7,0))","v":"2025-01-20"},"3rd Monday of January"]
["Mother's Day",5,null,2,1,{"$f":"IF(OR(OR(B40=\"\",D40=\"\"),E40=\"\"),\"\",(DATE(year,B40,1)+(D40-1)*7)+E40-WEEKDAY(DATE(year,B40,1))+IF(E40<WEEKDAY(DATE(year,B40,1)),7,0))","v":"2024-05-12"},"2nd Sunday of May"]
["Father's Day",6,null,3,1,"2024-06-16","3rd Sunday of June"]
["Parents' Day",7,null,4,1,"2024-07-28","4th Sunday in July"]
["Labor Day",9,null,1,2,"2024-09-02","1st Monday of September"]
["President's Day",2,null,3,2,"2024-02-19","3rd Monday of February"]
["Columbus Day",10,null,2,2,"2024-10-14","2nd Monday of October"]
["Memorial Day",6,null,0,2,"2024-05-27","Last Monday of May"]
["May Day (UK)",5,null,1,2,"2024-05-06"]
["Summer Bank Holiday (UK)",8,null,1,2,"2024-08-05"]
["Late Summer Bank Holiday (UK)",9,null,0,2,"2024-08-26"]
[]
[null,null,null,null,null,""]
[null,null,null,null,null,""]
[]
["Holidays occuring on a Specific Day of the Year"]
["New Year's Day",1,1,null,null,{"$f":"IF(OR(B55=\"\",C55=\"\"),\"\",DATE(year,B55,C55))","v":"2024-01-01"}]
["New Year's Day",1,1,null,null,{"$f":"IF(OR(B56=\"\",C56=\"\"),\"\",DATE(year+1,B56,C56))","v":"2025-01-01"}]
["Groundhog Day",2,2,null,null,{"$f":"IF(OR(B57=\"\",C57=\"\"),\"\",DATE(year,B57,C57))","v":"2024-02-02"}]
["Lincoln's B-Day",2,12,null,null,"2024-02-12"]
["Valentines Day",2,14,null,null,"2024-02-14"]
["Pi Day",3,14,null,null,"2024-03-14"]
["St. Patrick's Day",3,17,null,null,"2024-03-17"]
["April Fool's Day",4,1,null,null,"2024-04-01"]
["Earth Day",4,22,null,null,"2024-04-22"]
["Star Wars Day",5,4,null,null,"2024-05-04"]
["Cinco de Mayo",5,5,null,null,"2024-05-05"]
["Flag Day",6,14,null,null,"2024-06-14"]
["Independence Day",7,4,null,null,"2024-07-04"]
["Aviation Day",8,19,null,null,"2024-08-19"]
["Patriot Day",9,11,null,null,"2024-09-11"]
["Constitution Day",9,17,null,null,"2024-09-17"]
["Boss's Day",10,16,null,null,"2024-10-16"]
["United Nations Day",10,24,null,null,"2024-10-24"]
["Halloween",10,31,null,null,"2024-10-31"]
["Veterans Day",11,11,null,null,"2024-11-11"]
["Pearl Harbor",12,7,null,null,"2024-12-07"]
["Christmas Eve",12,24,null,null,"2024-12-24"]
["Christmas Day",12,25,null,null,"2024-12-25"]
["Kwanzaa begins",12,26,null,null,"2024-12-26"]
["Boxing Day (UK)",12,26,null,null,"2024-12-26"]
["New Year's Eve",12,31,null,null,"2024-12-31"]
[null,null,null,null,null,""]
[]
["Other Holidays"]
[null,null,null,null,null,{"$f":"IF(OR(B84=\"\",C84=\"\"),\"\",DATE(year,B84,C84))","v":""}]
[null,null,null,null,null,{"$f":"IF(OR(B85=\"\",C85=\"\"),\"\",DATE(year,B85,C85))","v":""}]
[null,null,null,null,null,{"$f":"IF(OR(B86=\"\",C86=\"\"),\"\",DATE(year,B86,C86))","v":""}]
[null,null,null,null,null,{"$f":"IF(OR(B87=\"\",C87=\"\"),\"\",DATE(year,B87,C87))","v":""}]

{"sheet":"Events","index":1,"n_rows":24,"n_cols":5,"rows_kept":24,"cut":false,"hidden":false,"merged":[[2,0,4,4]]}
["Events to list as Reminders"]
[]
["Use this worksheet to list birthdays, anniversaries, and other annual events. You can enter a date manually instead of using the formula in the Date column."]
[]
[]
[]
[]
["Description","Month","Day","Date","Date2"]
["Chris's Birthday",{"$f":"Table1[[#This Row],[Date]]","v":"1995-01-29"},{"$f":"DAY(Table1[[#This Row],[Date]])","v":29},"1995-01-29",{"$f":"IF(OR(B9=\"\",C9=\"\"),\"\",DATE(YEAR(TODAY()),MONTH(Table1[[#This Row],[Month]]),DAY(Table1[[#This Row],[Day]])))","v":"2024-01-29"}]
["Tracy's Birthday",{"$f":"Table1[[#This Row],[Date]]","v":"1967-02-04"},4,"1967-02-04",{"$f":"IF(OR(B10=\"\",C10=\"\"),\"\",DATE(YEAR(TODAY()),MONTH(Table1[[#This Row],[Month]]),DAY(Table1[[#This Row],[Day]])))","v":"2024-02-04"}]
["Marian's Birthday",{"$f":"Table1[[#This Row],[Date]]","v":"1970-02-17"},17,"1970-02-17",{"$f":"IF(OR(B11=\"\",C11=\"\"),\"\",DATE(YEAR(TODAY()),MONTH(Table1[[#This Row],[Month]]),DAY(Table1[[#This Row],[Day]])))","v":"2024-02-17"}]
["Anniversary",{"$f":"Table1[[#This Row],[Date]]","v":"1994-03-26"},26,"1994-03-26",{"$f":"IF(OR(B12=\"\",C12=\"\"),\"\",DATE(YEAR(TODAY()),MONTH(Table1[[#This Row],[Month]]),DAY(Table1[[#This Row],[Day]])))","v":"2024-03-26"}]
["My Birthday",{"$f":"Table1[[#This Row],[Date]]","v":"1963-03-30"},30,"1963-03-30",{"$f":"IF(OR(B13=\"\",C13=\"\"),\"\",DATE(YEAR(TODAY()),MONTH(Table1[[#This Row],[Month]]),DAY(Table1[[#This Row],[Day]])))","v":"2024-03-30"}]
["Mama's Birthday",{"$f":"Table1[[#This Row],[Date]]","v":"1944-04-14"},14,"1944-04-14",{"$f":"IF(OR(B14=\"\",C14=\"\"),\"\",DATE(YEAR(TODAY()),MONTH(Table1[[#This Row],[Month]]),DAY(Table1[[#This Row],[Day]])))","v":"2024-04-14"}]
["Sherry's Birthday",{"$f":"Table1[[#This Row],[Date]]","v":"1959-06-03"},3,"1959-06-03",{"$f":"IF(OR(B15=\"\",C15=\"\"),\"\",DATE(YEAR(TODAY()),MONTH(Table1[[#This Row],[Month]]),DAY(Table1[[#This Row],[Day]])))","v":"2024-06-03"}]
["Debra's Birthday",{"$f":"Table1[[#This Row],[Date]]","v":"1964-07-25"},25,"1964-07-25",{"$f":"IF(OR(B16=\"\",C16=\"\"),\"\",DATE(YEAR(TODAY()),MONTH(Table1[[#This Row],[Month]]),DAY(Table1[[#This Row],[Day]])))","v":"2024-07-25"}]
["Erin's Birthday",{"$f":"Table1[[#This Row],[Date]]","v":"1998-08-12"},12,"1998-08-12",{"$f":"IF(OR(B17=\"\",C17=\"\"),\"\",DATE(YEAR(TODAY()),MONTH(Table1[[#This Row],[Month]]),DAY(Table1[[#This Row],[Day]])))","v":"2024-08-12"}]
["Henry's Birthday",{"$f":"Table1[[#This Row],[Date]]","v":"1996-08-15"},15,"1996-08-15",{"$f":"IF(OR(B18=\"\",C18=\"\"),\"\",DATE(YEAR(TODAY()),MONTH(Table1[[#This Row],[Month]]),DAY(Table1[[#This Row],[Day]])))","v":"2024-08-15"}]
["Alex's Birthday",{"$f":"Table1[[#This Row],[Date]]","v":"2007-08-15"},15,"2007-08-15",{"$f":"IF(OR(B19=\"\",C19=\"\"),\"\",DATE(YEAR(TODAY()),MONTH(Table1[[#This Row],[Month]]),DAY(Table1[[#This Row],[Day]])))","v":"2024-08-15"}]
["Jen's Brithday",{"$f":"Table1[[#This Row],[Date]]","v":"1985-11-09"},9,"1985-11-09",{"$f":"IF(OR(B20=\"\",C20=\"\"),\"\",DATE(YEAR(TODAY()),MONTH(Table1[[#This Row],[Month]]),DAY(Table1[[#This Row],[Day]])))","v":"2024-11-09"}]
["Vic's Birthday",{"$f":"Table1[[#This Row],[Date]]","v":"2020-11-09"},9,"2020-11-09",{"$f":"IF(OR(B21=\"\",C21=\"\"),\"\",DATE(YEAR(TODAY()),MONTH(Table1[[#This Row],[Month]]),DAY(Table1[[#This Row],[Day]])))","v":"2024-11-09"}]
["Chloe's Birthday",{"$f":"Table1[[#This Row],[Date]]","v":"2010-12-28"},28,"2010-12-28",{"$f":"IF(OR(B22=\"\",C22=\"\"),\"\",DATE(YEAR(TODAY()),MONTH(Table1[[#This Row],[Month]]),DAY(Table1[[#This Row],[Day]])))","v":"2024-12-28"}]
["Gramp's Birthday",{"$f":"Table1[[#This Row],[Date]]","v":"2020-12-18"},18,"2020-12-18",{"$f":"IF(OR(B23=\"\",C23=\"\"),\"\",DATE(YEAR(TODAY()),MONTH(Table1[[#This Row],[Month]]),DAY(Table1[[#This Row],[Day]])))","v":"2024-12-18"}]
["Melody's Birthday",{"$f":"Table1[[#This Row],[Date]]","v":"2020-12-28"},28,"2020-12-28",{"$f":"IF(OR(B24=\"\",C24=\"\"),\"\",DATE(YEAR(TODAY()),MONTH(Table1[[#This Row],[Month]]),DAY(Table1[[#This Row],[Day]])))","v":"2024-12-28"}]

{"sheet":"Days1-2","index":2,"n_rows":40,"n_cols":46,"rows_kept":40,"cut":false,"hidden":false,"merged":[[54,24,54,27],[54,28,54,41],[54,42,54,45],[55,24,55,27],[55,28,55,41],[55,42,55,45],[56,24,56,27],[56,28,56,41],[56,42,56,45],[50,42,50,45],[51,24,51,27],[51,28,51,41],[51,42,51,45],[52,24,52,27],[52,28,52,41],[52,42,52,45],[53,24,53,27],[53,28,53,41],[53,42,53,45],[46,42,46,45],[47,24,47,27],[47,28,47,41],[47,42,47,45],[48,24,48,27],[48,28,48,41],[48,42,48,45],[49,24,49,27],[49,28,49,41],[49,42,49,45],[43,24,43,27],[43,28,43,41],[43,42,43,45],[44,24,44,27],[44,28,44,41],[44,42,44,45],[45,24,45,27],[45,28,45,41],[45,42,45,45],[40,24,40,27],[40,28,40,41],[40,42,40,45],[41,24,41,27],[41,28,41,41],[41,42,41,45],[42,24,42,27],[42,28,42,41],[42,42,42,45],[33,26,33,27],[34,24,34,25],[34,26,34,27],[35,24,35,25],[35,26,35,27],[36,24,36,25],[36,26,36,27],[38,24,38,45],[39,24,39,27],[39,28,39,41],[39,42,39,45],[56,1,56,4],[56,5,56,18],[56,19,56,22],[57,1,57,4],[57,5,57,18],[57,19,57,22],[58,1,58,4],[58,5,58,18],[58,19,58,22],[53,1,53,4],[53,5,53,18],[53,19,53,22],[54,1,54,4],[54,5,54,18],[54,19,54,22],[55,1,55,4],[55,5,55,18],[55,19,55,22],[50,1,50,4],[50,5,50,18],[50,19,50,22],[51,1,51,4],[51,5,51,18],[51,19,51,22],[52,1,52,4],[52,5,52,18],[52,19,52,22],[46,19,46,22],[47,1,47,4],[47,5,47,18],[47,19,47,22],[48,1,48,4],[48,5,48,18],[48,19,48,22],[49,1,49,4],[49,5,49,18],[49,19,49,22],[62,24,62,27],[62,28,62,41],[62,42,62,45],[29,1,29,2],[40,1,40,4],[40,5,40,18],[40,19,40,22],[41,1,41,4],[41,5,41,18],[41,19,41,22],[42,1,42,4],[42,5,42,18],[42,19,42,22],[43,1,43,4],[43,5,43,18],[43,19,43,22],[44,1,44,4],[44,5,44,18],[44,19,44,22],[45,1,45,4],[45,5,45,18],[45,19,45,22],[46,1,46,4],[46,5,46,18],[61,24,61,27],[61,28,61,41],[61,42,61,45],[58,24,58,27],[58,28,58,41],[58,42,58,45],[59,24,59,27],[59,28,59,41],[59,42,59,45],[60,24,60,27],[60,28,60,41],[60,42,60,45],[57,24,57,27],[57,28,57,41],[57,42,57,45],[15,29,16,29],[17,29,18,29],[19,29,20,29],[21,24,21,25],[21,26,21,27],[0,32,0,33],[0,9,0,10],[12,16,12,22],[2,1,5,3],[2,4,3,7],[4,4,5,6],[2,27,3,30],[2,31,2,37],[2,24,5,26],[23,6,24,6],[25,6,26,6],[27,6,28,6],[29,6,30,6],[21,1,21,2],[2,39,2,45],[4,27,5,29],[12,1,12,4],[12,39,12,45],[6,28,6,29],[12,24,12,27],[13,6,14,6],[6,5,6,6],[2,8,2,14],[2,16,2,22],[15,6,16,6],[17,6,18,6],[19,6,20,6],[21,6,22,6],[22,3,22,4],[21,3,21,4],[22,1,22,2],[13,29,14,29],[36,1,36,2],[36,3,36,4],[29,3,29,4],[31,3,31,4],[31,1,31,2],[31,6,32,6],[33,6,34,6],[35,6,36,6],[46,24,46,27],[46,28,46,41],[50,24,50,27],[50,28,50,41],[33,1,33,2],[33,3,33,4],[34,1,34,2],[34,3,34,4],[32,3,32,4],[38,1,38,22],[35,3,35,4],[23,1,23,2],[23,3,23,4],[24,1,24,2],[24,3,24,4],[25,1,25,2],[25,3,25,4],[26,1,26,2],[26,3,26,4],[27,1,27,2],[27,3,27,4],[31,29,32,29],[33,29,34,29],[35,29,36,29],[28,1,28,2],[28,3,28,4],[29,24,29,25],[31,24,31,25],[31,26,31,27],[32,24,32,25],[32,26,32,27],[33,24,33,25],[62,1,62,4],[62,5,62,18],[62,19,62,22],[61,5,61,18],[61,19,61,22],[61,1,61,4],[39,5,39,18],[39,19,39,22],[59,5,59,18],[59,19,59,22],[60,5,60,18],[60,19,60,22],[35,1,35,2],[39,1,39,4],[59,1,59,4],[60,1,60,4],[32,1,32,2],[21,29,22,29],[23,29,24,29],[25,29,26,29],[22,24,22,25],[22,26,22,27],[23,24,23,25],[23,26,23,27],[28,24,28,25],[28,26,28,27],[29,26,29,27],[24,24,24,25],[24,26,24,27],[25,24,25,25],[25,26,25,27],[26,24,26,25],[26,26,26,27],[27,24,27,25],[27,26,27,27],[27,29,28,29],[29,29,30,29]]}
[null,null,null,"Date:","2024-04-30",null,null,null,"Start Day:",1,null,"1:Sun, 2:Mon"]
[]
[null,{"$f":"DAY(E3)","v":30},null,null,{"$f":"E1","v":"2024-04-30"},null,null,null,{"$f":"DATE(YEAR($E$3),MONTH($E$3),1)","v":"2024-04-01"},null,null,null,null,null,null,null,{"$f":"DATE(YEAR(I3+35),MONTH(I3+35),1)","v":"2024-05-01"},null,null,null,null,null,null,null,{"$f":"DAY(AB3)","v":1},null,null,{"$f":"E3+1","v":"2024-05-01"},null,null,null,{"$f":"DATE(YEAR($E$3),MONTH($E$3),1)","v":"2024-04-01"},null,null,null,null,null,null,null,{"$f":"DATE(YEAR(AF3+35),MONTH(AF3+35),1)","v":"2024-05-01"}]
[null,null,null,null,null,null,null,null,{"$f":"CHOOSE(1+MOD($J$1+1-2,7),\"Su\",\"M\",\"Tu\",\"W\",\"Th\",\"F\",\"Sa\")","v":"Su"},{"$f":"CHOOSE(1+MOD($J$1+2-2,7),\"Su\",\"M\",\"Tu\",\"W\",\"Th\",\"F\",\"Sa\")","v":"M"},{"$f":"CHOOSE(1+MOD($J$1+3-2,7),\"Su\",\"M\",\"Tu\",\"W\",\"Th\",\"F\",\"Sa\")","v":"Tu"},{"$f":"CHOOSE(1+MOD($J$1+4-2,7),\"Su\",\"M\",\"Tu\",\"W\",\"Th\",\"F\",\"Sa\")","v":"W"},{"$f":"CHOOSE(1+MOD($J$1+5-2,7),\"Su\",\"M\",\"Tu\",\"W\",\"Th\",\"F\",\"Sa\")","v":"Th"},{"$f":"CHOOSE(1+MOD($J$1+6-2,7),\"Su\",\"M\",\"Tu\",\"W\",\"Th\",\"F\",\"Sa\")","v":"F"},{"$f":"CHOOSE(1+MOD($J$1+7-2,7),\"Su\",\"M\",\"Tu\",\"W\",\"Th\",\"F\",\"Sa\")","v":"Sa"},null,{"$f":"CHOOSE(1+MOD($J$1+1-2,7),\"Su\",\"M\",\"Tu\",\"W\",\"Th\",\"F\",\"Sa\")","v":"Su"},{"$f":"CHOOSE(1+MOD($J$1+2-2,7),\"Su\",\"M\",\"Tu\",\"W\",\"Th\",\"F\",\"Sa\")","v":"M"},{"$f":"CHOOSE(1+MOD($J$1+3-2,7),\"Su\",\"M\",\"Tu\",\"W\",\"Th\",\"F\",\"Sa\")","v":"Tu"},{"$f":"CHOOSE(1+MOD($J$1+4-2,7),\"Su\",\"M\",\"Tu\",\"W\",\"Th\",\"F\",\"Sa\")","v":"W"},{"$f":"CHOOSE(1+MOD($J$1+5-2,7),\"Su\",\"M\",\"Tu\",\"W\",\"Th\",\"F\",\"Sa\")","v":"Th"},{"$f":"CHOOSE(1+MOD($J$1+6-2,7),\"Su\",\"M\",\"Tu\",\"W\",\"Th\",\"F\",\"Sa\")","v":"F"},{"$f":"CHOOSE(1+MOD($J$1+7-2,7),\"Su\",\"M\",\"Tu\",\"W\",\"Th\",\"F\",\"Sa\")","v":"Sa"},null,null,null,null,null,null,null,null,{"$f":"CHOOSE(1+MOD($J$1+1-2,7),\"Su\",\"M\",\"Tu\",\"W\",\"Th\",\"F\",\"Sa\")","v":"Su"},{"$f":"CHOOSE(1+MOD($J$1+2-2,7),\"Su\",\"M\",\"Tu\",\"W\",\"Th\",\"F\",\"Sa\")","v":"M"},{"$f":"CHOOSE(1+MOD($J$1+3-2,7),\"Su\",\"M\",\"Tu\",\"W\",\"Th\",\"F\",\"Sa\")","v":"Tu"},{"$f":"CHOOSE(1+MOD($J$1+4-2,7),\"Su\",\"M\",\"Tu\",\"W\",\"Th\",\"F\",\"Sa\")","v":"W"},{"$f":"CHOOSE(1+MOD($J$1+5-2,7),\"Su\",\"M\",\"Tu\",\"W\",\"Th\",\"F\",\"Sa\")","v":"Th"},{"$f":"CHOOSE(1+MOD($J$1+6-2,7),\"Su\",\"M\",\"Tu\",\"W\",\"Th\",\"F\",\"Sa\")","v":"F"},{"$f":"CHOOSE(1+MOD($J$1+7-2,7),\"Su\",\"M\",\"Tu\",\"W\",\"Th\",\"F\",\"Sa\")","v":"Sa"},null,{"$f":"CHOOSE(1+MOD($J$1+1-2,7),\"Su\",\"M\",\"Tu\",\"W\",\"Th\",\"F\",\"Sa\")","v":"Su"},{"$f":"CHOOSE(1+MOD($J$1+2-2,7),\"Su\",\"M\",\"Tu\",\"W\",\"Th\",\"F\",\"Sa\")","v":"M"},{"$f":"CHOOSE(1+MOD($J$1+3-2,7),\"Su\",\"M\",\"Tu\",\"W\",\"Th\",\"F\",\"Sa\")","v":"Tu"},{"$f":"CHOOSE(1+MOD($J$1+4-2,7),\"Su\",\"M\",\"Tu\",\"W\",\"Th\",\"F\",\"Sa\")","v":"W"},{"$f":"CHOOSE(1+MOD($J$1+5-2,7),\"Su\",\"M\",\"Tu\",\"W\",\"Th\",\"F\",\"Sa\")","v":"Th"},{"$f":"CHOOSE(1+MOD($J$1+6-2,7),\"Su\",\"M\",\"Tu\",\"W\",\"Th\",\"F\",\"Sa\")","v":"F"},{"$f":"CHOOSE(1+MOD($J$1+7-2,7),\"Su\",\"M\",\"Tu\",\"W\",\"Th\",\"F\",\"Sa\")","v":"Sa"}]
[null,null,null,null,{"$f":"INDEX({\"Sunday\",\"Monday\",\"Tuesday\",\"Wednesday\",\"Thursday\",\"Friday\",\"Saturday\"},WEEKDAY(E3))","v":"Tuesday"},null,null,null,{"$f":"IF(WEEKDAY(I3,1)=$J$1,I3,\"\")","v":""},{"$f":"IF(I5=\"\",IF(WEEKDAY(I3,1)=MOD($J$1,7)+1,I3,\"\"),I5+1)","v":"2024-04-01"},{"$f":"IF(J5=\"\",IF(WEEKDAY(I3,1)=MOD($J$1+1,7)+1,I3,\"\"),J5+1)","v":"2024-04-02"},{"$f":"IF(K5=\"\",IF(WEEKDAY(I3,1)=MOD($J$1+2,7)+1,I3,\"\"),K5+1)","v":"2024-04-03"},{"$f":"IF(L5=\"\",IF(WEEKDAY(I3,1)=MOD($J$1+3,7)+1,I3,\"\"),L5+1)","v":"2024-04-04"},{"$f":"IF(M5=\"\",IF(WEEKDAY(I3,1)=MOD($J$1+4,7)+1,I3,\"\"),M5+1)","v":"2024-04-05"},{"$f":"IF(N5=\"\",IF(WEEKDAY(I3,1)=MOD($J$1+5,7)+1,I3,\"\"),N5+1)","v":"2024-04-06"},null,{"$f":"IF(WEEKDAY(Q3,1)=$J$1,Q3,\"\")","v":""},{"$f":"IF(Q5=\"\",IF(WEEKDAY(Q3,1)=MOD($J$1,7)+1,Q3,\"\"),Q5+1)","v":""},{"$f":"IF(R5=\"\",IF(WEEKDAY(Q3,1)=MOD($J$1+1,7)+1,Q3,\"\"),R5+1)","v":""},{"$f":"IF(S5=\"\",IF(WEEKDAY(Q3,1)=MOD($J$1+2,7)+1,Q3,\"\"),S5+1)","v":"2024-05-01"},{"$f":"IF(T5=\"\",IF(WEEKDAY(Q3,1)=MOD($J$1+3,7)+1,Q3,\"\"),T5+1)","v":"2024-05-02"},{"$f":"IF(U5=\"\",IF(WEEKDAY(Q3,1)=MOD($J$1+4,7)+1,Q3,\"\"),U5+1)","v":"2024-05-03"},{"$f":"IF(V5=\"\",IF(WEEKDAY(Q3,1)=MOD($J$1+5,7)+1,Q3,\"\"),V5+1)","v":"2024-05-04"},null,null,null,null,{"$f":"INDEX({\"Sunday\",\"Monday\",\"Tuesday\",\"Wednesday\",\"Thursday\",\"Friday\",\"Saturday\"},WEEKDAY(AB3))","v":"Wednesday"},null,null,null,{"$f":"IF(WEEKDAY(AF3,1)=$J$1,AF3,\"\")","v":""},{"$f":"IF(AF5=\"\",IF(WEEKDAY(AF3,1)=MOD($J$1,7)+1,AF3,\"\"),AF5+1)","v":"2024-04-01"},{"$f":"IF(AG5=\"\",IF(WEEKDAY(AF3,1)=MOD($J$1+1,7)+1,AF3,\"\"),AG5+1)","v":"2024-04-02"},{"$f":"IF(AH5=\"\",IF(WEEKDAY(AF3,1)=MOD($J$1+2,7)+1,AF3,\"\"),AH5+1)","v":"2024-04-03"},{"$f":"IF(AI5=\"\",IF(WEEKDAY(AF3,1)=MOD($J$1+3,7)+1,AF3,\"\"),AI5+1)","v":"2024-04-04"},{"$f":"IF(AJ5=\"\",IF(WEEKDAY(AF3,1)=MOD($J$1+4,7)+1,AF3,\"\"),AJ5+1)","v":"2024-04-05"},{"$f":"IF(AK5=\"\",IF(WEEKDAY(AF3,1)=MOD($J$1+5,7)+1,AF3,\"\"),AK5+1)","v":"2024-04-06"},null,{"$f":"IF(WEEKDAY(AN3,1)=$J$1,AN3,\"\")","v":""},{"$f":"IF(AN5=\"\",IF(WEEKDAY(AN3,1)=MOD($J$1,7)+1,AN3,\"\"),AN5+1)","v":""},{"$f":"IF(AO5=\"\",IF(WEEKDAY(AN3,1)=MOD($J$1+1,7)+1,AN3,\"\"),AO5+1)","v":""},{"$f":"IF(AP5=\"\",IF(WEEKDAY(AN3,1)=MOD($J$1+2,7)+1,AN3,\"\"),AP5+1)","v":"2024-05-01"},{"$f":"IF(AQ5=\"\",IF(WEEKDAY(AN3,1)=MOD($J$1+3,7)+1,AN3,\"\"),AQ5+1)","v":"2024-05-02"},{"$f":"IF(AR5=\"\",IF(WEEKDAY(AN3,1)=MOD($J$1+4,7)+1,AN3,\"\"),AR5+1)","v":"2024-05-03"},{"$f":"IF(AS5=\"\",IF(WEEKDAY(AN3,1)=MOD($J$1+5,7)+1,AN3,\"\"),AS5+1)","v":"2024-05-04"}]
[null,null,null,null,null,null,null,null,{"$f":"IF(O5=\"\",\"\",IF(MONTH(O5+1)<>MONTH(O5),\"\",O5+1))","v":"2024-04-07"},{"$f":"IF(I6=\"\",\"\",IF(MONTH(I6+1)<>MONTH(I6),\"\",I6+1))","v":"2024-04-08"},{"$f":"IF(J6=\"\",\"\",IF(MONTH(J6+1)<>MONTH(J6),\"\",J6+1))","v":"2024-04-09"},{"$f":"IF(K6=\"\",\"\",IF(MONTH(K6+1)<>MONTH(K6),\"\",K6+1))","v":"2024-04-10"},"2024-04-11","2024-04-12","2024-04-13",null,{"$f":"IF(W5=\"\",\"\",IF(MONTH(W5+1)<>MONTH(W5),\"\",W5+1))","v":"2024-05-05"},{"$f":"IF(Q6=\"\",\"\",IF(MONTH(Q6+1)<>MONTH(Q6),\"\",Q6+1))","v":"2024-05-06"},{"$f":"IF(R6=\"\",\"\",IF(MONTH(R6+1)<>MONTH(R6),\"\",R6+1))","v":"2024-05-07"},{"$f":"IF(S6=\"\",\"\",IF(MONTH(S6+1)<>MONTH(S6),\"\",S6+1))","v":"2024-05-08"},{"$f":"IF(T6=\"\",\"\",IF(MONTH(T6+1)<>MONTH(T6),\"\",T6+1))","v":"2024-05-09"},{"$f":"IF(U6=\"\",\"\",IF(MONTH(U6+1)<>MONTH(U6),\"\",U6+1))","v":"2024-05-10"},{"$f":"IF(V6=\"\",\"\",IF(MONTH(V6+1)<>MONTH(V6),\"\",V6+1))","v":"2024-05-11"},null,null,null,null,null,null,null,null,{"$f":"IF(AL5=\"\",\"\",IF(MONTH(AL5+1)<>MONTH(AL5),\"\",AL5+1))","v":"2024-04-07"},{"$f":"IF(AF6=\"\",\"\",IF(MONTH(AF6+1)<>MONTH(AF6),\"\",AF6+1))","v":"2024-04-08"},{"$f":"IF(AG6=\"\",\"\",IF(MONTH(AG6+1)<>MONTH(AG6),\"\",AG6+1))","v":"2024-04-09"},{"$f":"IF(AH6=\"\",\"\",IF(MONTH(AH6+1)<>MONTH(AH6),\"\",AH6+1))","v":"2024-04-10"},{"$f":"IF(AI6=\"\",\"\",IF(MONTH(AI6+1)<>MONTH(AI6),\"\",AI6+1))","v":"2024-04-11"},{"$f":"IF(AJ6=\"\",\"\",IF(MONTH(AJ6+1)<>MONTH(AJ6),\"\",AJ6+1))","v":"2024-04-12"},{"$f":"IF(AK6=\"\",\"\",IF(MONTH(AK6+1)<>MONTH(AK6),\"\",AK6+1))","v":"2024-04-13"},null,{"$f":"IF(AT5=\"\",\"\",IF(MONTH(AT5+1)<>MONTH(AT5),\"\",AT5+1))","v":"2024-05-05"},{"$f":"IF(AN6=\"\",\"\",IF(MONTH(AN6+1)<>MONTH(AN6),\"\",AN6+1))","v":"2024-05-06"},{"$f":"IF(AO6=\"\",\"\",IF(MONTH(AO6+1)<>MONTH(AO6),\"\",AO6+1))","v":"2024-05-07"},{"$f":"IF(AP6=\"\",\"\",IF(MONTH(AP6+1)<>MONTH(AP6),\"\",AP6+1))","v":"2024-05-08"},{"$f":"IF(AQ6=\"\",\"\",IF(MONTH(AQ6+1)<>MONTH(AQ6),\"\",AQ6+1))","v":"2024-05-09"},{"$f":"IF(AR6=\"\",\"\",IF(MONTH(AR6+1)<>MONTH(AR6),\"\",AR6+1))","v":"2024-05-10"},{"$f":"IF(AS6=\"\",\"\",IF(MONTH(AS6+1)<>MONTH(AS6),\"\",AS6+1))","v":"2024-05-11"}]
[null,{"$f":"IFERROR(INDEX(arr_holiday,SMALL(IF(arr_holidaydate=$E$3,ROW(arr_holidaydate)),ROW()-ROW($B$6))),\"\")","v":""},null,null,null,null,null,null,{"$f":"IF(O6=\"\",\"\",IF(MONTH(O6+1)<>MONTH(O6),\"\",O6+1))","v":"2024-04-14"},{"$f":"IF(I7=\"\",\"\",IF(MONTH(I7+1)<>MONTH(I7),\"\",I7+1))","v":"2024-04-15"},"2024-04-16","2024-04-17","2024-04-18","2024-04-19","2024-04-20",null,{"$f":"IF(W6=\"\",\"\",IF(MONTH(W6+1)<>MONTH(W6),\"\",W6+1))","v":"2024-05-12"},{"$f":"IF(Q7=\"\",\"\",IF(MONTH(Q7+1)<>MONTH(Q7),\"\",Q7+1))","v":"2024-05-13"},"2024-05-14",{"$f":"IF(S7=\"\",\"\",IF(MONTH(S7+1)<>MONTH(S7),\"\",S7+1))","v":"2024-05-15"},"2024-05-16","2024-05-17","2024-05-18",null,{"$f":"IFERROR(INDEX(arr_holiday,SMALL(IF(arr_holidaydate=$AB$3,ROW(arr_holidaydate)),ROW()-ROW($B$6))),\"\")","v":""},null,null,null,null,null,null,{"$f":"IF(AL6=\"\",\"\",IF(MONTH(AL6+1)<>MONTH(AL6),\"\",AL6+1))","v":"2024-04-14"},{"$f":"IF(AF7=\"\",\"\",IF(MONTH(AF7+1)<>MONTH(AF7),\"\",AF7+1))","v":"2024-04-15"},"2024-04-16",{"$f":"IF(AH7=\"\",\"\",IF(MONTH(AH7+1)<>MONTH(AH7),\"\",AH7+1))","v":"2024-04-17"},"2024-04-18","2024-04-19","2024-04-20",null,{"$f":"IF(AT6=\"\",\"\",IF(MONTH(AT6+1)<>MONTH(AT6),\"\",AT6+1))","v":"2024-05-12"},{"$f":"IF(AN7=\"\",\"\",IF(MONTH(AN7+1)<>MONTH(AN7),\"\",AN7+1))","v":"2024-05-13"},"2024-05-14",{"$f":"IF(AP7=\"\",\"\",IF(MONTH(AP7+1)<>MONTH(AP7),\"\",AP7+1))","v":"2024-05-15"},"2024-05-16","2024-05-17","2024-05-18"]
[null,{"$f":"IFERROR(INDEX(arr_holiday,SMALL(IF(arr_holidaydate=$E$3,ROW(arr_holidaydate)),ROW()-ROW($B$6))),\"\")","v":""},null,null,null,null,null,null,"2024-04-21","2024-04-22","2024-04-23","2024-04-24","2024-04-25","2024-04-26","2024-04-27",null,"2024-05-19","2024-05-20","2024-05-21","2024-05-22","2024-05-23","2024-05-24","2024-05-25",null,{"$f":"IFERROR(INDEX(arr_holiday,SMALL(IF(arr_holidaydate=$AB$3,ROW(arr_holidaydate)),ROW()-ROW($B$6))),\"\")","v":""},null,null,null,null,null,null,"2024-04-21","2024-04-22","2024-04-23","2024-04-24","2024-04-25","2024-04-26","2024-04-27",null,"2024-05-19","2024-05-20","2024-05-21","2024-05-22","2024-05-23","2024-05-24","2024-05-25"]
[null,{"$f":"IFERROR(INDEX(arr_holiday,SMALL(IF(arr_holidaydate=$E$3,ROW(arr_holidaydate)),ROW()-ROW($B$6))),\"\")","v":""},null,null,null,null,null,null,"2024-04-28","2024-04-29","2024-04-30","","","","",null,"2024-05-26","2024-05-27","2024-05-28","2024-05-29","2024-05-30","2024-05-31","",null,{"$f":"IFERROR(INDEX(arr_holiday,SMALL(IF(arr_holidaydate=$AB$3,ROW(arr_holidaydate)),ROW()-ROW($B$6))),\"\")","v":""},null,null,null,null,null,null,"2024-04-28","2024-04-29","2024-04-30","","","","",null,"2024-05-26","2024-05-27","2024-05-28","2024-05-29","2024-05-30","2024-05-31",""]
[null,{"$f":"IFERROR(INDEX(arr_event,SMALL(IF(arr_eventdate=$E$3,ROW(arr_eventdate)),ROW()-ROW($B$9))),\"\")","v":""},null,null,null,null,null,null,"","","","","","","",null,"","","","","","","",null,{"$f":"IFERROR(INDEX(arr_event,SMALL(IF(arr_eventdate=$AB$3,ROW(arr_eventdate)),ROW()-ROW($B$9))),\"\")","v":""},null,null,null,null,null,null,"","","","","","","",null,"","","","","","",""]
[null,{"$f":"IFERROR(INDEX(arr_event,SMALL(IF(arr_eventdate=$E$3,ROW(arr_eventdate)),ROW()-ROW($B$9))),\"\")","v":""},null,null,null,null,null,null,null,null,null,null,null,null,null,null,null,null,null,null,null,null,null,null,{"$f":"IFERROR(INDEX(arr_event,SMALL(IF(arr_eventdate=$AB$3,ROW(arr_eventdate)),ROW()-ROW($B$9))),\"\")","v":""}]
[null,{"$f":"IFERROR(INDEX(arr_event,SMALL(IF(arr_eventdate=$E$3,ROW(arr_eventdate)),ROW()-ROW($B$9))),\"\")","v":""},null,null,null,null,null,null,null,null,null,null,null,null,null,null,null,null,null,null,null,null,null,null,{"$f":"IFERROR(INDEX(arr_event,SMALL(IF(arr_eventdate=$AB$3,ROW(arr_eventdate)),ROW()-ROW($B$9))),\"\")","v":""}]
[null,"Reminders",null,null,null,null,null,null,"Appointments",null,null,null,null,null,null,null,"Notes",null,null,null,null,null,null,null,"Reminders",null,null,null,null,null,null,"Appointments",null,null,null,null,null,null,null,"Notes"]
[null,{"$f":"IFERROR(INDEX(arr_event,SMALL(IF(arr_eventdate=$E$3,ROW(arr_eventdate)),ROW()-ROW($B$13))),\"\")","v":""},null,null,null,null,7,":00",null,null,null,null,null,null,null,null,null,null,null,null,null,null,null,null,{"$f":"IFERROR(INDEX(arr_event,SMALL(IF(arr_eventdate=$E$3,ROW(arr_eventdate)),ROW()-ROW($B$13))),\"\")","v":""},null,null,null,null,7,":00"]
[null,"",null,null,null,null,null,":30",null,null,null,null,null,null,null,null,null,null,null,null,null,null,null,null,"",null,null,null,null,null,":30"]
[null,"",null,null,null,null,8,":00",null,null,null,null,null,null,null,null,null,null,null,null,null,null,null,null,"",null,null,null,null,8,":00"]
[null,"",null,null,null,null,null,":30",null,null,null,null,null,null,null,null,null,null,null,null,null,null,null,null,"",null,null,null,null,null,":30"]
[null,"",null,null,null,null,9,":00",null,null,null,null,null,null,null,null,null,null,null,null,null,null,null,null,"",null,null,null,null,9,":00"]
[null,"",null,null,null,null,null,":30",null,null,null,null,null,null,null,null,null,null,null,null,null,null,null,null,"",null,null,null,null,null,":30"]
[null,"",null,null,null,null,10,":00",null,null,null,null,null,null,null,null,null,null,null,null,null,null,null,null,"",null,null,null,null,10,":00"]
[null,"",null,null,null,null,null,":30",null,null,null,null,null,null,null,null,null,null,null,null,null,null,null,null,"",null,null,null,null,null,":30"]
[null,"From",null,"Actions Carried Forward",null,null,11,":00",null,null,null,null,null,null,null,null,null,null,null,null,null,null,null,null,"From",null,"Actions Carried Forward",null,null,11,":00"]
[null,{"$f":"IFERROR(INDEX(arr_event,SMALL(IF(arr_eventdate=$E$3,ROW(arr_eventdate)),ROW()-ROW($B$13))),\"\")","v":""},null,null,null,null,null,":30",null,null,null,null,null,null,null,null,null,null,null,null,null,null,null,null,{"$f":"IFERROR(INDEX(arr_event,SMALL(IF(arr_eventdate=$E$3,ROW(arr_eventdate)),ROW()-ROW($B$13))),\"\")","v":""},null,null,null,null,null,":30"]
[null,{"$f":"IFERROR(INDEX(arr_event,SMALL(IF(arr_eventdate=$E$3,ROW(arr_eventdate)),ROW()-ROW($B$13))),\"\")","v":""},null,null,null,null,12,":00",null,null,null,null,null,null,null,null,null,null,null,null,null,null,null,null,{"$f":"IFERROR(INDEX(arr_event,SMALL(IF(arr_eventdate=$E$3,ROW(arr_eventdate)),ROW()-ROW($B$13))),\"\")","v":""},null,null,null,null,12,":00"]
[null,{"$f":"IFERROR(INDEX(arr_event,SMALL(IF(arr_eventdate=$E$3,ROW(arr_eventdate)),ROW()-ROW($B$13))),\"\")","v":""},null,null,null,null,null,":30",null,null,null,null,null,null,null,null,null,null,null,null,null,null,null,null,{"$f":"IFERROR(INDEX(arr_event,SMALL(IF(arr_eventdate=$E$3,ROW(arr_eventdate)),ROW()-ROW($B$13))),\"\")","v":""},null,null,null,null,null,":30"]
[null,{"$f":"IFERROR(INDEX(arr_event,SMALL(IF(arr_eventdate=$E$3,ROW(arr_eventdate)),ROW()-ROW($B$13))),\"\")","v":""},null,null,null,null,1,":00",null,null,null,null,null,null,null,null,null,null,null,null,null,null,null,null,{"$f":"IFERROR(INDEX(arr_event,SMALL(IF(arr_eventdate=$E$3,ROW(arr_eventdate)),ROW()-ROW($B$13))),\"\")","v":""},null,null,null,null,1,":00"]
[null,{"$f":"IFERROR(INDEX(arr_event,SMALL(IF(arr_eventdate=$E$3,ROW(arr_eventdate)),ROW()-ROW($B$13))),\"\")","v":""},null,null,null,null,null,":30",null,null,null,null,null,null,null,null,null,null,null,null,null,null,null,null,{"$f":"IFERROR(INDEX(arr_event,SMALL(IF(arr_eventdate=$E$3,ROW(arr_eventdate)),ROW()-ROW($B$13))),\"\")","v":""},null,null,null,null,null,":30"]
[null,{"$f":"IFERROR(INDEX(arr_event,SMALL(IF(arr_eventdate=$E$3,ROW(arr_eventdate)),ROW()-ROW($B$13))),\"\")","v":""},null,null,null,null,2,":00",null,null,null,null,null,null,null,null,null,null,null,null,null,null,null,null,{"$f":"IFERROR(INDEX(arr_event,SMALL(IF(arr_eventdate=$E$3,ROW(arr_eventdate)),ROW()-ROW($B$13))),\"\")","v":""},null,null,null,null,2,":00"]
[null,{"$f":"IFERROR(INDEX(arr_event,SMALL(IF(arr_eventdate=$E$3,ROW(arr_eventdate)),ROW()-ROW($B$13))),\"\")","v":""},null,null,null,null,null,":30",null,null,null,null,null,null,null,null,null,null,null,null,null,null,null,null,{"$f":"IFERROR(INDEX(arr_event,SMALL(IF(arr_eventdate=$E$3,ROW(arr_eventdate)),ROW()-ROW($B$13))),\"\")","v":""},null,null,null,null,null,":30"]
[null,{"$f":"IFERROR(INDEX(arr_event,SMALL(IF(arr_eventdate=$E$3,ROW(arr_eventdate)),ROW()-ROW($B$13))),\"\")","v":""},null,null,null,null,3,":00",null,null,null,null,null,null,null,null,null,null,null,null,null,null,null,null,{"$f":"IFERROR(INDEX(arr_event,SMALL(IF(arr_eventdate=$E$3,ROW(arr_eventdate)),ROW()-ROW($B$13))),\"\")","v":""},null,null,null,null,3,":00"]
[null,null,null,null,null,null,null,":30",null,null,null,null,null,null,null,null,null,null,null,null,null,null,null,null,null,null,null,null,null,null,":30"]
[null,"$Amt",null,"Expenses",null,null,4,":00",null,null,null,null,null,null,null,null,null,null,null,null,null,null,null,null,"$Amt",null,"Expenses",null,null,4,":00"]
[null,null,null,null,null,null,null,":30",null,null,null,null,null,null,null,null,null,null,null,null,null,null,null,null,null,null,null,null,null,null,":30"]
[null,null,null,null,null,null,5,":00",null,null,null,null,null,null,null,null,null,null,null,null,null,null,null,null,null,null,null,null,null,5,":00"]
[null,null,null,null,null,null,null,":30",null,null,null,null,null,null,null,null,null,null,null,null,null,null,null,null,null,null,null,null,null,null,":30"]
[null,null,null,null,null,null,6,":00",null,null,null,null,null,null,null,null,null,null,null,null,null,null,null,null,null,null,null,null,null,6,":00"]
[null,null,null,null,null,null,null,":30",null,null,null,null,null,null,null,null,null,null,null,null,null,null,null,null,null,null,null,null,null,null,":30"]
[]
[null,"Planned cases for today",null,null,null,null,null,":30",null,null,null,null,null,null,null,null,null,null,null,null,null,null,null,null,"Planned cases for today",null,null,null,null,null,":30"]
[null,"Case",null,null,null,"Action",null,null,null,null,null,null,null,null,null,null,null,null,null,"Follow-up",null,null,null,null,"Case",null,null,null,"Action",null,null,null,null,null,null,null,null,null,null,null,null,null,"Follow-up"]

{"sheet":"Days3-4","index":3,"n_rows":40,"n_cols":46,"rows_kept":40,"cut":false,"hidden":false,"merged":[[55,24,55,27],[55,28,55,41],[55,42,55,45],[56,24,56,27],[56,28,56,41],[56,42,56,45],[57,24,57,27],[57,28,57,41],[57,42,57,45],[52,24,52,27],[52,28,52,41],[52,42,52,45],[53,24,53,27],[53,28,53,41],[53,42,53,45],[54,24,54,27],[54,28,54,41],[54,42,54,45],[48,42,48,45],[49,24,49,27],[49,28,49,41],[49,42,49,45],[50,24,50,27],[50,28,50,41],[50,42,50,45],[51,24,51,27],[51,28,51,41],[51,42,51,45],[44,42,44,45],[45,24,45,27],[45,28,45,41],[45,42,45,45],[46,24,46,27],[46,28,46,41],[46,42,46,45],[47,24,47,27],[47,28,47,41],[47,42,47,45],[40,42,40,45],[41,24,41,27],[41,28,41,41],[41,42,41,45],[42,24,42,27],[42,28,42,41],[42,42,42,45],[43,24,43,27],[43,28,43,41],[43,42,43,45],[57,1,57,4],[57,5,57,18],[57,19,57,22],[58,1,58,4],[58,5,58,18],[58,19,58,22],[29,24,29,25],[31,24,31,25],[31,26,31,27],[32,24,32,25],[32,26,32,27],[33,24,33,25],[33,26,33,27],[34,24,34,25],[34,26,34,27],[35,24,35,25],[35,26,35,27],[36,24,36,25],[36,26,36,27],[38,24,38,45],[39,24,39,27],[39,28,39,41],[39,42,39,45],[40,24,40,27],[54,1,54,4],[54,5,54,18],[54,19,54,22],[55,1,55,4],[55,5,55,18],[55,19,55,22],[56,1,56,4],[56,5,56,18],[56,19,56,22],[51,1,51,4],[51,5,51,18],[51,19,51,22],[52,1,52,4],[52,5,52,18],[52,19,52,22],[53,1,53,4],[53,5,53,18],[53,19,53,22],[29,1,29,2],[40,1,40,4],[40,5,40,18],[40,19,40,22],[41,1,41,4],[41,5,41,18],[41,19,41,22],[42,1,42,4],[42,5,42,18],[42,19,42,22],[62,1,62,4],[62,5,62,18],[62,19,62,22],[62,24,62,27],[62,28,62,41],[62,42,62,45],[61,1,61,4],[61,5,61,18],[61,19,61,22],[61,24,61,27],[61,28,61,41],[61,42,61,45],[59,1,59,4],[59,5,59,18],[59,19,59,22],[59,24,59,27],[59,28,59,41],[59,42,59,45],[35,1,35,2],[35,3,35,4],[39,1,39,4],[39,5,39,18],[39,19,39,22],[58,24,58,27],[58,28,58,41],[58,42,58,45],[36,1,36,2],[36,3,36,4],[38,1,38,22],[43,1,43,4],[43,5,43,18],[43,19,43,22],[44,1,44,4],[33,1,33,2],[33,3,33,4],[34,1,34,2],[34,3,34,4],[44,5,44,18],[44,19,44,22],[45,1,45,4],[45,5,45,18],[45,19,45,22],[46,1,46,4],[46,5,46,18],[46,19,46,22],[47,1,47,4],[47,5,47,18],[47,19,47,22],[48,1,48,4],[48,5,48,18],[48,19,48,22],[31,1,31,2],[31,3,31,4],[32,1,32,2],[32,3,32,4],[49,1,49,4],[49,5,49,18],[49,19,49,22],[50,1,50,4],[50,5,50,18],[50,19,50,22],[40,28,40,41],[44,24,44,27],[44,28,44,41],[48,24,48,27],[48,28,48,41],[29,3,29,4],[29,6,30,6],[29,26,29,27],[29,29,30,29],[31,6,32,6],[31,29,32,29],[33,6,34,6],[33,29,34,29],[35,6,36,6],[35,29,36,29],[27,1,27,2],[27,3,27,4],[27,6,28,6],[27,24,27,25],[27,26,27,27],[27,29,28,29],[28,1,28,2],[28,3,28,4],[28,24,28,25],[28,26,28,27],[25,1,25,2],[25,3,25,4],[25,6,26,6],[25,24,25,25],[25,26,25,27],[25,29,26,29],[26,1,26,2],[26,3,26,4],[26,24,26,25],[26,26,26,27],[22,24,22,25],[22,26,22,27],[23,1,23,2],[23,3,23,4],[23,6,24,6],[23,24,23,25],[23,26,23,27],[19,6,20,6],[19,29,20,29],[21,1,21,2],[21,3,21,4],[21,6,22,6],[21,24,21,25],[21,26,21,27],[21,29,22,29],[22,1,22,2],[22,3,22,4],[23,29,24,29],[24,1,24,2],[24,3,24,4],[24,24,24,25],[24,26,24,27],[15,6,16,6],[15,29,16,29],[17,6,18,6],[17,29,18,29],[2,39,2,45],[4,4,5,6],[4,27,5,29],[6,5,6,6],[6,28,6,29],[12,1,12,4],[12,16,12,22],[12,24,12,27],[12,39,12,45],[0,32,0,33],[2,1,5,3],[2,4,3,7],[2,8,2,14],[2,16,2,22],[2,24,5,26],[2,27,3,30],[2,31,2,37],[13,6,14,6],[13,29,14,29]]}
[]
[]
[null,{"$f":"DAY(E3)","v":2},null,null,{"$f":"'Days1-2'!AB3+1","v":"2024-05-02"},null,null,null,{"$f":"DATE(YEAR($E$3),MONTH($E$3),1)","v":"2024-05-01"},null,null,null,null,null,null,null,{"$f":"DATE(YEAR(I3+35),MONTH(I3+35),1)","v":"2024-06-01"},null,null,null,null,null,null,null,{"$f":"DAY(AB3)","v":3},null,null,{"$f":"E3+1","v":"2024-05-03"},null,null,null,{"$f":"DATE(YEAR(AB3),MONTH(AB3),1)","v":"2024-05-01"},null,null,null,null,null,null,null,{"$f":"DATE(YEAR(AF3+35),MONTH(AF3+35),1)","v":"2024-06-01"}]
[null,null,null,null,null,null,null,null,{"$f":"CHOOSE(1+MOD('Days1-2'!J1+1-2,7),\"Su\",\"M\",\"Tu\",\"W\",\"Th\",\"F\",\"Sa\")","v":"Su"},{"$f":"CHOOSE(1+MOD('Days1-2'!$J$1+2-2,7),\"Su\",\"M\",\"Tu\",\"W\",\"Th\",\"F\",\"Sa\")","v":"M"},{"$f":"CHOOSE(1+MOD('Days1-2'!$J$1+3-2,7),\"Su\",\"M\",\"Tu\",\"W\",\"Th\",\"F\",\"Sa\")","v":"Tu"},{"$f":"CHOOSE(1+MOD('Days1-2'!$J$1+4-2,7),\"Su\",\"M\",\"Tu\",\"W\",\"Th\",\"F\",\"Sa\")","v":"W"},{"$f":"CHOOSE(1+MOD('Days1-2'!$J$1+5-2,7),\"Su\",\"M\",\"Tu\",\"W\",\"Th\",\"F\",\"Sa\")","v":"Th"},{"$f":"CHOOSE(1+MOD('Days1-2'!$J$1+6-2,7),\"Su\",\"M\",\"Tu\",\"W\",\"Th\",\"F\",\"Sa\")","v":"F"},{"$f":"CHOOSE(1+MOD('Days1-2'!$J$1+7-2,7),\"Su\",\"M\",\"Tu\",\"W\",\"Th\",\"F\",\"Sa\")","v":"Sa"},null,{"$f":"CHOOSE(1+MOD('Days1-2'!J1+1-2,7),\"Su\",\"M\",\"Tu\",\"W\",\"Th\",\"F\",\"Sa\")","v":"Su"},{"$f":"CHOOSE(1+MOD('Days1-2'!J1+2-2,7),\"Su\",\"M\",\"Tu\",\"W\",\"Th\",\"F\",\"Sa\")","v":"M"},{"$f":"CHOOSE(1+MOD('Days1-2'!J1+3-2,7),\"Su\",\"M\",\"Tu\",\"W\",\"Th\",\"F\",\"Sa\")","v":"Tu"},{"$f":"CHOOSE(1+MOD('Days1-2'!J1+4-2,7),\"Su\",\"M\",\"Tu\",\"W\",\"Th\",\"F\",\"Sa\")","v":"W"},{"$f":"CHOOSE(1+MOD('Days1-2'!J1+5-2,7),\"Su\",\"M\",\"Tu\",\"W\",\"Th\",\"F\",\"Sa\")","v":"Th"},{"$f":"CHOOSE(1+MOD('Days1-2'!J1+6-2,7),\"Su\",\"M\",\"Tu\",\"W\",\"Th\",\"F\",\"Sa\")","v":"F"},{"$f":"CHOOSE(1+MOD('Days1-2'!J1+7-2,7),\"Su\",\"M\",\"Tu\",\"W\",\"Th\",\"F\",\"Sa\")","v":"Sa"},null,null,null,null,null,null,null,null,{"$f":"CHOOSE(1+MOD('Days1-2'!$J$1+1-2,7),\"Su\",\"M\",\"Tu\",\"W\",\"Th\",\"F\",\"Sa\")","v":"Su"},{"$f":"CHOOSE(1+MOD('Days1-2'!$J$1+2-2,7),\"Su\",\"M\",\"Tu\",\"W\",\"Th\",\"F\",\"Sa\")","v":"M"},{"$f":"CHOOSE(1+MOD('Days1-2'!$J$1+3-2,7),\"Su\",\"M\",\"Tu\",\"W\",\"Th\",\"F\",\"Sa\")","v":"Tu"},{"$f":"CHOOSE(1+MOD('Days1-2'!$J$1+4-2,7),\"Su\",\"M\",\"Tu\",\"W\",\"Th\",\"F\",\"Sa\")","v":"W"},{"$f":"CHOOSE(1+MOD('Days1-2'!$J$1+5-2,7),\"Su\",\"M\",\"Tu\",\"W\",\"Th\",\"F\",\"Sa\")","v":"Th"},{"$f":"CHOOSE(1+MOD('Days1-2'!$J$1+6-2,7),\"Su\",\"M\",\"Tu\",\"W\",\"Th\",\"F\",\"Sa\")","v":"F"},{"$f":"CHOOSE(1+MOD('Days1-2'!$J$1+7-2,7),\"Su\",\"M\",\"Tu\",\"W\",\"Th\",\"F\",\"Sa\")","v":"Sa"},null,{"$f":"CHOOSE(1+MOD('Days1-2'!$J$1+1-2,7),\"Su\",\"M\",\"Tu\",\"W\",\"Th\",\"F\",\"Sa\")","v":"Su"},{"$f":"CHOOSE(1+MOD('Days1-2'!$J$1+2-2,7),\"Su\",\"M\",\"Tu\",\"W\",\"Th\",\"F\",\"Sa\")","v":"M"},{"$f":"CHOOSE(1+MOD('Days1-2'!$J$1+3-2,7),\"Su\",\"M\",\"Tu\",\"W\",\"Th\",\"F\",\"Sa\")","v":"Tu"},{"$f":"CHOOSE(1+MOD('Days1-2'!$J$1+4-2,7),\"Su\",\"M\",\"Tu\",\"W\",\"Th\",\"F\",\"Sa\")","v":"W"},{"$f":"CHOOSE(1+MOD('Days1-2'!$J$1+5-2,7),\"Su\",\"M\",\"Tu\",\"W\",\"Th\",\"F\",\"Sa\")","v":"Th"},{"$f":"CHOOSE(1+MOD('Days1-2'!$J$1+6-2,7),\"Su\",\"M\",\"Tu\",\"W\",\"Th\",\"F\",\"Sa\")","v":"F"},{"$f":"CHOOSE(1+MOD('Days1-2'!$J$1+7-2,7),\"Su\",\"M\",\"Tu\",\"W\",\"Th\",\"F\",\"Sa\")","v":"Sa"}]
[null,null,null,null,{"$f":"INDEX({\"Sunday\",\"Monday\",\"Tuesday\",\"Wednesday\",\"Thursday\",\"Friday\",\"Saturday\"},WEEKDAY(E3))","v":"Thursday"},null,null,null,{"$f":"IF(WEEKDAY(I3,1)='Days1-2'!$J$1,I3,\"\")","v":""},{"$f":"IF(I5=\"\",IF(WEEKDAY(I3,1)=MOD('Days1-2'!$J$1,7)+1,I3,\"\"),I5+1)","v":""},{"$f":"IF(J5=\"\",IF(WEEKDAY(I3,1)=MOD('Days1-2'!$J$1+1,7)+1,I3,\"\"),J5+1)","v":""},{"$f":"IF(K5=\"\",IF(WEEKDAY(I3,1)=MOD('Days1-2'!$J$1+2,7)+1,I3,\"\"),K5+1)","v":"2024-05-01"},{"$f":"IF(L5=\"\",IF(WEEKDAY(I3,1)=MOD('Days1-2'!$J$1+3,7)+1,I3,\"\"),L5+1)","v":"2024-05-02"},{"$f":"IF(M5=\"\",IF(WEEKDAY(I3,1)=MOD('Days1-2'!$J$1+4,7)+1,I3,\"\"),M5+1)","v":"2024-05-03"},{"$f":"IF(N5=\"\",IF(WEEKDAY(I3,1)=MOD('Days1-2'!$J$1+5,7)+1,I3,\"\"),N5+1)","v":"2024-05-04"},null,{"$f":"IF(WEEKDAY(Q3,1)='Days1-2'!$J$1,Q3,\"\")","v":""},{"$f":"IF(Q5=\"\",IF(WEEKDAY(Q3,1)=MOD('Days1-2'!$J$1,7)+1,Q3,\"\"),Q5+1)","v":""},{"$f":"IF(R5=\"\",IF(WEEKDAY(Q3,1)=MOD('Days1-2'!$J$1+1,7)+1,Q3,\"\"),R5+1)","v":""},{"$f":"IF(S5=\"\",IF(WEEKDAY(Q3,1)=MOD('Days1-2'!$J$1+2,7)+1,Q3,\"\"),S5+1)","v":""},{"$f":"IF(T5=\"\",IF(WEEKDAY(Q3,1)=MOD('Days1-2'!$J$1+3,7)+1,Q3,\"\"),T5+1)","v":""},{"$f":"IF(U5=\"\",IF(WEEKDAY(Q3,1)=MOD('Days1-2'!$J$1+4,7)+1,Q3,\"\"),U5+1)","v":""},{"$f":"IF(V5=\"\",IF(WEEKDAY(Q3,1)=MOD('Days1-2'!$J$1+5,7)+1,Q3,\"\"),V5+1)","v":"2024-06-01"},null,null,null,null,{"$f":"INDEX({\"Sunday\",\"Monday\",\"Tuesday\",\"Wednesday\",\"Thursday\",\"Friday\",\"Saturday\"},WEEKDAY(AB3))","v":"Friday"},null,null,null,{"$f":"IF(WEEKDAY(AF3,1)='Days1-2'!$J$1,AF3,\"\")","v":""},{"$f":"IF(AF5=\"\",IF(WEEKDAY(AF3,1)=MOD('Days1-2'!$J$1,7)+1,AF3,\"\"),AF5+1)","v":""},{"$f":"IF(AG5=\"\",IF(WEEKDAY(AF3,1)=MOD('Days1-2'!$J$1+1,7)+1,AF3,\"\"),AG5+1)","v":""},{"$f":"IF(AH5=\"\",IF(WEEKDAY(AF3,1)=MOD('Days1-2'!$J$1+2,7)+1,AF3,\"\"),AH5+1)","v":"2024-05-01"},{"$f":"IF(AI5=\"\",IF(WEEKDAY(AF3,1)=MOD('Days1-2'!$J$1+3,7)+1,AF3,\"\"),AI5+1)","v":"2024-05-02"},{"$f":"IF(AJ5=\"\",IF(WEEKDAY(AF3,1)=MOD('Days1-2'!$J$1+4,7)+1,AF3,\"\"),AJ5+1)","v":"2024-05-03"},{"$f":"IF(AK5=\"\",IF(WEEKDAY(AF3,1)=MOD('Days1-2'!$J$1+5,7)+1,AF3,\"\"),AK5+1)","v":"2024-05-04"},null,{"$f":"IF(WEEKDAY(AN3,1)='Days1-2'!$J$1,AN3,\"\")","v":""},{"$f":"IF(AN5=\"\",IF(WEEKDAY(AN3,1)=MOD('Days1-2'!$J$1,7)+1,AN3,\"\"),AN5+1)","v":""},{"$f":"IF(AO5=\"\",IF(WEEKDAY(AN3,1)=MOD('Days1-2'!$J$1+1,7)+1,AN3,\"\"),AO5+1)","v":""},{"$f":"IF(AP5=\"\",IF(WEEKDAY(AN3,1)=MOD('Days1-2'!$J$1+2,7)+1,AN3,\"\"),AP5+1)","v":""},{"$f":"IF(AQ5=\"\",IF(WEEKDAY(AN3,1)=MOD('Days1-2'!$J$1+3,7)+1,AN3,\"\"),AQ5+1)","v":""},{"$f":"IF(AR5=\"\",IF(WEEKDAY(AN3,1)=MOD('Days1-2'!$J$1+4,7)+1,AN3,\"\"),AR5+1)","v":""},{"$f":"IF(AS5=\"\",IF(WEEKDAY(AN3,1)=MOD('Days1-2'!$J$1+5,7)+1,AN3,\"\"),AS5+1)","v":"2024-06-01"}]
[null,null,null,null,null,null,null,null,{"$f":"IF(O5=\"\",\"\",IF(MONTH(O5+1)<>MONTH(O5),\"\",O5+1))","v":"2024-05-05"},{"$f":"IF(I6=\"\",\"\",IF(MONTH(I6+1)<>MONTH(I6),\"\",I6+1))","v":"2024-05-06"},{"$f":"IF(J6=\"\",\"\",IF(MONTH(J6+1)<>MONTH(J6),\"\",J6+1))","v":"2024-05-07"},{"$f":"IF(K6=\"\",\"\",IF(MONTH(K6+1)<>MONTH(K6),\"\",K6+1))","v":"2024-05-08"},"2024-05-09","2024-05-10","2024-05-11",null,{"$f":"IF(W5=\"\",\"\",IF(MONTH(W5+1)<>MONTH(W5),\"\",W5+1))","v":"2024-06-02"},{"$f":"IF(Q6=\"\",\"\",IF(MONTH(Q6+1)<>MONTH(Q6),\"\",Q6+1))","v":"2024-06-03"},{"$f":"IF(R6=\"\",\"\",IF(MONTH(R6+1)<>MONTH(R6),\"\",R6+1))","v":"2024-06-04"},{"$f":"IF(S6=\"\",\"\",IF(MONTH(S6+1)<>MONTH(S6),\"\",S6+1))","v":"2024-06-05"},{"$f":"IF(T6=\"\",\"\",IF(MONTH(T6+1)<>MONTH(T6),\"\",T6+1))","v":"2024-06-06"},"2024-06-07","2024-06-08",null,null,null,null,null,null,null,null,{"$f":"IF(AL5=\"\",\"\",IF(MONTH(AL5+1)<>MONTH(AL5),\"\",AL5+1))","v":"2024-05-05"},{"$f":"IF(AF6=\"\",\"\",IF(MONTH(AF6+1)<>MONTH(AF6),\"\",AF6+1))","v":"2024-05-06"},{"$f":"IF(AG6=\"\",\"\",IF(MONTH(AG6+1)<>MONTH(AG6),\"\",AG6+1))","v":"2024-05-07"},{"$f":"IF(AH6=\"\",\"\",IF(MONTH(AH6+1)<>MONTH(AH6),\"\",AH6+1))","v":"2024-05-08"},{"$f":"IF(AI6=\"\",\"\",IF(MONTH(AI6+1)<>MONTH(AI6),\"\",AI6+1))","v":"2024-05-09"},"2024-05-10","2024-05-11",null,{"$f":"IF(AT5=\"\",\"\",IF(MONTH(AT5+1)<>MONTH(AT5),\"\",AT5+1))","v":"2024-06-02"},{"$f":"IF(AN6=\"\",\"\",IF(MONTH(AN6+1)<>MONTH(AN6),\"\",AN6+1))","v":"2024-06-03"},{"$f":"IF(AO6=\"\",\"\",IF(MONTH(AO6+1)<>MONTH(AO6),\"\",AO6+1))","v":"2024-06-04"},{"$f":"IF(AP6=\"\",\"\",IF(MONTH(AP6+1)<>MONTH(AP6),\"\",AP6+1))","v":"2024-06-05"},{"$f":"IF(AQ6=\"\",\"\",IF(MONTH(AQ6+1)<>MONTH(AQ6),\"\",AQ6+1))","v":"2024-06-06"},"2024-06-07","2024-06-08"]
[null,{"$f":"IFERROR(INDEX(arr_holiday,SMALL(IF(arr_holidaydate=$E$3,ROW(arr_holidaydate)),ROW()-ROW($B$6))),\"\")","v":""},null,null,null,null,null,null,{"$f":"IF(O6=\"\",\"\",IF(MONTH(O6+1)<>MONTH(O6),\"\",O6+1))","v":"2024-05-12"},{"$f":"IF(I7=\"\",\"\",IF(MONTH(I7+1)<>MONTH(I7),\"\",I7+1))","v":"2024-05-13"},"2024-05-14","2024-05-15","2024-05-16","2024-05-17","2024-05-18",null,{"$f":"IF(W6=\"\",\"\",IF(MONTH(W6+1)<>MONTH(W6),\"\",W6+1))","v":"2024-06-09"},{"$f":"IF(Q7=\"\",\"\",IF(MONTH(Q7+1)<>MONTH(Q7),\"\",Q7+1))","v":"2024-06-10"},"2024-06-11","2024-06-12","2024-06-13","2024-06-14","2024-06-15",null,{"$f":"IFERROR(INDEX(arr_holiday,SMALL(IF(arr_holidaydate=$AB$3,ROW(arr_holidaydate)),ROW()-ROW($B$6))),\"\")","v":""},null,null,null,null,null,null,{"$f":"IF(AL6=\"\",\"\",IF(MONTH(AL6+1)<>MONTH(AL6),\"\",AL6+1))","v":"2024-05-12"},{"$f":"IF(AF7=\"\",\"\",IF(MONTH(AF7+1)<>MONTH(AF7),\"\",AF7+1))","v":"2024-05-13"},"2024-05-14","2024-05-15","2024-05-16","2024-05-17","2024-05-18",null,{"$f":"IF(AT6=\"\",\"\",IF(MONTH(AT6+1)<>MONTH(AT6),\"\",AT6+1))","v":"2024-06-09"},{"$f":"IF(AN7=\"\",\"\",IF(MONTH(AN7+1)<>MONTH(AN7),\"\",AN7+1))","v":"2024-06-10"},"2024-06-11","2024-06-12","2024-06-13","2024-06-14","2024-06-15"]
[null,{"$f":"IFERROR(INDEX(arr_holiday,SMALL(IF(arr_holidaydate=$E$3,ROW(arr_holidaydate)),ROW()-ROW($B$6))),\"\")","v":""},null,null,null,null,null,null,"2024-05-19","2024-05-20","2024-05-21","2024-05-22","2024-05-23","2024-05-24","2024-05-25",null,"2024-06-16","2024-06-17","2024-06-18","2024-06-19","2024-06-20","2024-06-21","2024-06-22",null,{"$f":"IFERROR(INDEX(arr_holiday,SMALL(IF(arr_holidaydate=$AB$3,ROW(arr_holidaydate)),ROW()-ROW($B$6))),\"\")","v":""},null,null,null,null,null,null,"2024-05-19","2024-05-20","2024-05-21","2024-05-22","2024-05-23","2024-05-24","2024-05-25",null,"2024-06-16","2024-06-17","2024-06-18","2024-06-19","2024-06-20","2024-06-21","2024-06-22"]
[null,{"$f":"IFERROR(INDEX(arr_holiday,SMALL(IF(arr_holidaydate=$E$3,ROW(arr_holidaydate)),ROW()-ROW($B$6))),\"\")","v":""},null,null,null,null,null,null,"2024-05-26","2024-05-27","2024-05-28","2024-05-29","2024-05-30","2024-05-31","",null,"2024-06-23","2024-06-24","2024-06-25","2024-06-26","2024-06-27","2024-06-28","2024-06-29",null,{"$f":"IFERROR(INDEX(arr_holiday,SMALL(IF(arr_holidaydate=$AB$3,ROW(arr_holidaydate)),ROW()-ROW($B$6))),\"\")","v":""},null,null,null,null,null,null,"2024-05-26","2024-05-27","2024-05-28","2024-05-29","2024-05-30","2024-05-31","",null,"2024-06-23","2024-06-24","2024-06-25","2024-06-26","2024-06-27","2024-06-28","2024-06-29"]
[null,{"$f":"IFERROR(INDEX(arr_event,SMALL(IF(arr_eventdate=$E$3,ROW(arr_eventdate)),ROW()-ROW($B$9))),\"\")","v":""},null,null,null,null,null,null,"","","","","","","",null,"2024-06-30","","","","","","",null,{"$f":"IFERROR(INDEX(arr_event,SMALL(IF(arr_eventdate=$AB$3,ROW(arr_eventdate)),ROW()-ROW($B$9))),\"\")","v":""},null,null,null,null,null,null,"","","","","","","",null,"2024-06-30","","","","","",""]
[null,{"$f":"IFERROR(INDEX(arr_event,SMALL(IF(arr_eventdate=$E$3,ROW(arr_eventdate)),ROW()-ROW($B$9))),\"\")","v":""},null,null,null,null,null,null,null,null,null,null,null,null,null,null,null,null,null,null,null,null,null,null,{"$f":"IFERROR(INDEX(arr_event,SMALL(IF(arr_eventdate=$AB$3,ROW(arr_eventdate)),ROW()-ROW($B$9))),\"\")","v":""}]
[null,{"$f":"IFERROR(INDEX(arr_event,SMALL(IF(arr_eventdate=$E$3,ROW(arr_eventdate)),ROW()-ROW($B$9))),\"\")","v":""},null,null,null,null,null,null,null,null,null,null,null,null,null,null,null,null,null,null,null,null,null,null,{"$f":"IFERROR(INDEX(arr_event,SMALL(IF(arr_eventdate=$AB$3,ROW(arr_eventdate)),ROW()-ROW($B$9))),\"\")","v":""}]
[null,"Reminders",null,null,null,null,null,null,"Appointments",null,null,null,null,null,null,null,"Notes",null,null,null,null,null,null,null,"Reminders",null,null,null,null,null,null,"Appointments",null,null,null,null,null,null,null,"Notes"]
[null,{"$f":"IFERROR(INDEX(arr_event,SMALL(IF(arr_eventdate=$E$3,ROW(arr_eventdate)),ROW()-ROW($B$13))),\"\")","v":""},null,null,null,null,7,":00",null,null,null,null,null,null,null,null,null,null,null,null,null,null,null,null,{"$f":"IFERROR(INDEX(arr_event,SMALL(IF(arr_eventdate=$E$3,ROW(arr_eventdate)),ROW()-ROW($B$13))),\"\")","v":""},null,null,null,null,7,":00"]
[null,"",null,null,null,null,null,":30",null,null,null,null,null,null,null,null,null,null,null,null,null,null,null,null,"",null,null,null,null,null,":30"]
[null,"",null,null,null,null,8,":00",null,null,null,null,null,null,null,null,null,null,null,null,null,null,null,null,"",null,null,null,null,8,":00"]
[null,"",null,null,null,null,null,":30",null,null,null,null,null,null,null,null,null,null,null,null,null,null,null,null,"",null,null,null,null,null,":30"]
[null,"",null,null,null,null,9,":00",null,null,null,null,null,null,null,null,null,null,null,null,null,null,null,null,"",null,null,null,null,9,":00"]
[null,"",null,null,null,null,null,":30",null,null,null,null,null,null,null,null,null,null,null,null,null,null,null,null,"",null,null,null,null,null,":30"]
[null,"",null,null,null,null,10,":00",null,null,null,null,null,null,null,null,null,null,null,null,null,null,null,null,"",null,null,null,null,10,":00"]
[null,"",null,null,null,null,null,":30",null,null,null,null,null,null,null,null,null,null,null,null,null,null,null,null,"",null,null,null,null,null,":30"]
[null,"From",null,"Actions Carried Forward",null,null,11,":00",null,null,null,null,null,null,null,null,null,null,null,null,null,null,null,null,"From",null,"Actions Carried Forward",null,null,11,":00"]
[null,{"$f":"IFERROR(INDEX(arr_event,SMALL(IF(arr_eventdate=$E$3,ROW(arr_eventdate)),ROW()-ROW($B$13))),\"\")","v":""},null,null,null,null,null,":30",null,null,null,null,null,null,null,null,null,null,null,null,null,null,null,null,{"$f":"IFERROR(INDEX(arr_event,SMALL(IF(arr_eventdate=$E$3,ROW(arr_eventdate)),ROW()-ROW($B$13))),\"\")","v":""},null,null,null,null,null,":30"]
[null,{"$f":"IFERROR(INDEX(arr_event,SMALL(IF(arr_eventdate=$E$3,ROW(arr_eventdate)),ROW()-ROW($B$13))),\"\")","v":""},null,null,null,null,12,":00",null,null,null,null,null,null,null,null,null,null,null,null,null,null,null,null,{"$f":"IFERROR(INDEX(arr_event,SMALL(IF(arr_eventdate=$E$3,ROW(arr_eventdate)),ROW()-ROW($B$13))),\"\")","v":""},null,null,null,null,12,":00"]
[null,{"$f":"IFERROR(INDEX(arr_event,SMALL(IF(arr_eventdate=$E$3,ROW(arr_eventdate)),ROW()-ROW($B$13))),\"\")","v":""},null,null,null,null,null,":30",null,null,null,null,null,null,null,null,null,null,null,null,null,null,null,null,{"$f":"IFERROR(INDEX(arr_event,SMALL(IF(arr_eventdate=$E$3,ROW(arr_eventdate)),ROW()-ROW($B$13))),\"\")","v":""},null,null,null,null,null,":30"]
[null,{"$f":"IFERROR(INDEX(arr_event,SMALL(IF(arr_eventdate=$E$3,ROW(arr_eventdate)),ROW()-ROW($B$13))),\"\")","v":""},null,null,null,null,1,":00",null,null,null,null,null,null,null,null,null,null,null,null,null,null,null,null,{"$f":"IFERROR(INDEX(arr_event,SMALL(IF(arr_eventdate=$E$3,ROW(arr_eventdate)),ROW()-ROW($B$13))),\"\")","v":""},null,null,null,null,1,":00"]
[null,{"$f":"IFERROR(INDEX(arr_event,SMALL(IF(arr_eventdate=$E$3,ROW(arr_eventdate)),ROW()-ROW($B$13))),\"\")","v":""},null,null,null,null,null,":30",null,null,null,null,null,null,null,null,null,null,null,null,null,null,null,null,{"$f":"IFERROR(INDEX(arr_event,SMALL(IF(arr_eventdate=$E$3,ROW(arr_eventdate)),ROW()-ROW($B$13))),\"\")","v":""},null,null,null,null,null,":30"]
[null,{"$f":"IFERROR(INDEX(arr_event,SMALL(IF(arr_eventdate=$E$3,ROW(arr_eventdate)),ROW()-ROW($B$13))),\"\")","v":""},null,null,null,null,2,":00",null,null,null,null,null,null,null,null,null,null,null,null,null,null,null,null,{"$f":"IFERROR(INDEX(arr_event,SMALL(IF(arr_eventdate=$E$3,ROW(arr_eventdate)),ROW()-ROW($B$13))),\"\")","v":""},null,null,null,null,2,":00"]
[null,{"$f":"IFERROR(INDEX(arr_event,SMALL(IF(arr_eventdate=$E$3,ROW(arr_eventdate)),ROW()-ROW($B$13))),\"\")","v":""},null,null,null,null,null,":30",null,null,null,null,null,null,null,null,null,null,null,null,null,null,null,null,{"$f":"IFERROR(INDEX(arr_event,SMALL(IF(arr_eventdate=$E$3,ROW(arr_eventdate)),ROW()-ROW($B$13))),\"\")","v":""},null,null,null,null,null,":30"]
[null,{"$f":"IFERROR(INDEX(arr_event,SMALL(IF(arr_eventdate=$E$3,ROW(arr_eventdate)),ROW()-ROW($B$13))),\"\")","v":""},null,null,null,null,3,":00",null,null,null,null,null,null,null,null,null,null,null,null,null,null,null,null,{"$f":"IFERROR(INDEX(arr_event,SMALL(IF(arr_eventdate=$E$3,ROW(arr_eventdate)),ROW()-ROW($B$13))),\"\")","v":""},null,null,null,null,3,":00"]
[null,null,null,null,null,null,null,":30",null,null,null,null,null,null,null,null,null,null,null,null,null,null,null,null,null,null,null,null,null,null,":30"]
[null,"$Amt",null,"Expenses",null,null,4,":00",null,null,null,null,null,null,null,null,null,null,null,null,null,null,null,null,"$Amt",null,"Expenses",null,null,4,":00"]
[null,null,null,null,null,null,null,":30",null,null,null,null,null,null,null,null,null,null,null,null,null,null,null,null,null,null,null,null,null,null,":30"]
[null,null,null,null,null,null,5,":00",null,null,null,null,null,null,null,null,null,null,null,null,null,null,null,null,null,null,null,null,null,5,":00"]
[null,null,null,null,null,null,null,":30",null,null,null,null,null,null,null,null,null,null,null,null,null,null,null,null,null,null,null,null,null,null,":30"]
[null,null,null,null,null,null,6,":00",null,null,null,null,null,null,null,null,null,null,null,null,null,null,null,null,null,null,null,null,null,6,":00"]
[null,null,null,null,null,null,null,":30",null,null,null,null,null,null,null,null,null,null,null,null,null,null,null,null,null,null,null,null,null,null,":30"]
[]
[null,"Planned cases for today",null,null,null,null,null,":30",null,null,null,null,null,null,null,null,null,null,null,null,null,null,null,null,"Planned cases for today",null,null,null,null,null,":30"]
[null,"Case",null,null,null,"Action",null,null,null,null,null,null,null,null,null,null,null,null,null,"Follow-up",null,null,null,null,"Case",null,null,null,"Action",null,null,null,null,null,null,null,null,null,null,null,null,null,"Follow-up"]

{"sheet":"Days5-6","index":4,"n_rows":40,"n_cols":46,"rows_kept":40,"cut":false,"hidden":false,"merged":[[56,24,56,27],[56,28,56,41],[56,42,56,45],[57,24,57,27],[57,28,57,41],[57,42,57,45],[52,42,52,45],[53,24,53,27],[53,28,53,41],[53,42,53,45],[54,24,54,27],[54,28,54,41],[54,42,54,45],[55,24,55,27],[55,28,55,41],[55,42,55,45],[48,42,48,45],[49,24,49,27],[49,28,49,41],[49,42,49,45],[50,24,50,27],[50,28,50,41],[50,42,50,45],[51,24,51,27],[51,28,51,41],[51,42,51,45],[44,42,44,45],[45,24,45,27],[45,28,45,41],[45,42,45,45],[46,24,46,27],[46,28,46,41],[46,42,46,45],[47,24,47,27],[47,28,47,41],[47,42,47,45],[40,42,40,45],[41,24,41,27],[41,28,41,41],[41,42,41,45],[42,24,42,27],[42,28,42,41],[42,42,42,45],[43,24,43,27],[43,28,43,41],[43,42,43,45],[57,1,57,4],[57,5,57,18],[57,19,57,22],[58,1,58,4],[58,5,58,18],[58,19,58,22],[29,24,29,25],[31,24,31,25],[31,26,31,27],[32,24,32,25],[32,26,32,27],[33,24,33,25],[33,26,33,27],[34,24,34,25],[34,26,34,27],[35,24,35,25],[35,26,35,27],[36,24,36,25],[36,26,36,27],[38,24,38,45],[39,24,39,27],[39,28,39,41],[39,42,39,45],[40,24,40,27],[0,32,0,33],[2,1,5,3],[2,4,3,7],[2,8,2,14],[2,16,2,22],[2,24,5,26],[2,27,3,30],[2,31,2,37],[29,1,29,2],[13,6,14,6],[13,29,14,29],[15,6,16,6],[15,29,16,29],[17,6,18,6],[17,29,18,29],[2,39,2,45],[4,4,5,6],[4,27,5,29],[6,5,6,6],[6,28,6,29],[12,1,12,4],[12,16,12,22],[12,24,12,27],[12,39,12,45],[22,24,22,25],[22,26,22,27],[23,1,23,2],[23,3,23,4],[23,6,24,6],[23,24,23,25],[23,26,23,27],[19,6,20,6],[19,29,20,29],[21,1,21,2],[21,3,21,4],[21,6,22,6],[21,24,21,25],[21,26,21,27],[21,29,22,29],[22,1,22,2],[22,3,22,4],[23,29,24,29],[24,1,24,2],[24,3,24,4],[24,24,24,25],[24,26,24,27],[25,1,25,2],[25,3,25,4],[25,6,26,6],[25,24,25,25],[25,26,25,27],[25,29,26,29],[26,1,26,2],[26,3,26,4],[26,24,26,25],[26,26,26,27],[27,1,27,2],[27,3,27,4],[27,6,28,6],[27,24,27,25],[27,26,27,27],[27,29,28,29],[28,1,28,2],[28,3,28,4],[28,24,28,25],[28,26,28,27],[29,3,29,4],[29,6,30,6],[29,26,29,27],[29,29,30,29],[31,6,32,6],[31,29,32,29],[33,6,34,6],[33,29,34,29],[35,6,36,6],[35,29,36,29],[40,5,40,18],[40,19,40,22],[41,5,41,18],[41,19,41,22],[42,5,42,18],[42,19,42,22],[40,28,40,41],[42,1,42,4],[43,1,43,4],[43,5,43,18],[43,19,43,22],[44,24,44,27],[44,28,44,41],[31,1,31,2],[31,3,31,4],[40,1,40,4],[41,1,41,4],[44,1,44,4],[44,5,44,18],[44,19,44,22],[45,1,45,4],[45,5,45,18],[45,19,45,22],[46,1,46,4],[46,5,46,18],[46,19,46,22],[47,1,47,4],[47,5,47,18],[47,19,47,22],[32,1,32,2],[32,3,32,4],[33,1,33,2],[33,3,33,4],[48,1,48,4],[48,5,48,18],[48,19,48,22],[49,1,49,4],[49,5,49,18],[49,19,49,22],[50,1,50,4],[50,5,50,18],[50,19,50,22],[51,1,51,4],[51,5,51,18],[51,19,51,22],[48,24,48,27],[48,28,48,41],[34,1,34,2],[34,3,34,4],[35,1,35,2],[35,3,35,4],[52,1,52,4],[52,5,52,18],[52,19,52,22],[53,1,53,4],[53,5,53,18],[53,19,53,22],[52,24,52,27],[52,28,52,41],[39,1,39,4],[39,5,39,18],[39,19,39,22],[58,24,58,27],[58,28,58,41],[58,42,58,45],[36,1,36,2],[36,3,36,4],[38,1,38,22],[54,1,54,4],[54,5,54,18],[54,19,54,22],[55,1,55,4],[55,5,55,18],[55,19,55,22],[56,1,56,4],[56,5,56,18],[56,19,56,22],[61,1,61,4],[61,5,61,18],[61,19,61,22],[61,24,61,27],[61,28,61,41],[61,42,61,45],[59,1,59,4],[59,5,59,18],[59,19,59,22],[59,24,59,27],[59,28,59,41],[59,42,59,45],[62,1,62,4],[62,5,62,18],[62,19,62,22],[62,24,62,27],[62,28,62,41],[62,42,62,45]]}
[]
[]
[null,{"$f":"DAY(E3)","v":4},null,null,{"$f":"'Days3-4'!AB3+1","v":"2024-05-04"},null,null,null,{"$f":"DATE(YEAR($E$3),MONTH($E$3),1)","v":"2024-05-01"},null,null,null,null,null,null,null,{"$f":"DATE(YEAR(I3+35),MONTH(I3+35),1)","v":"2024-06-01"},null,null,null,null,null,null,null,{"$f":"DAY(AB3)","v":5},null,null,{"$f":"E3+1","v":"2024-05-05"},null,null,null,{"$f":"DATE(YEAR(AB3),MONTH(AB3),1)","v":"2024-05-01"},null,null,null,null,null,null,null,{"$f":"DATE(YEAR(AF3+35),MONTH(AF3+35),1)","v":"2024-06-01"}]
[null,null,null,null,null,null,null,null,{"$f":"CHOOSE(1+MOD('Days1-2'!J1+1-2,7),\"Su\",\"M\",\"Tu\",\"W\",\"Th\",\"F\",\"Sa\")","v":"Su"},{"$f":"CHOOSE(1+MOD('Days1-2'!$J$1+2-2,7),\"Su\",\"M\",\"Tu\",\"W\",\"Th\",\"F\",\"Sa\")","v":"M"},{"$f":"CHOOSE(1+MOD('Days1-2'!$J$1+3-2,7),\"Su\",\"M\",\"Tu\",\"W\",\"Th\",\"F\",\"Sa\")","v":"Tu"},{"$f":"CHOOSE(1+MOD('Days1-2'!$J$1+4-2,7),\"Su\",\"M\",\"Tu\",\"W\",\"Th\",\"F\",\"Sa\")","v":"W"},{"$f":"CHOOSE(1+MOD('Days1-2'!$J$1+5-2,7),\"Su\",\"M\",\"Tu\",\"W\",\"Th\",\"F\",\"Sa\")","v":"Th"},{"$f":"CHOOSE(1+MOD('Days1-2'!$J$1+6-2,7),\"Su\",\"M\",\"Tu\",\"W\",\"Th\",\"F\",\"Sa\")","v":"F"},{"$f":"CHOOSE(1+MOD('Days1-2'!$J$1+7-2,7),\"Su\",\"M\",\"Tu\",\"W\",\"Th\",\"F\",\"Sa\")","v":"Sa"},null,{"$f":"CHOOSE(1+MOD('Days1-2'!J1+1-2,7),\"Su\",\"M\",\"Tu\",\"W\",\"Th\",\"F\",\"Sa\")","v":"Su"},{"$f":"CHOOSE(1+MOD('Days1-2'!J1+2-2,7),\"Su\",\"M\",\"Tu\",\"W\",\"Th\",\"F\",\"Sa\")","v":"M"},{"$f":"CHOOSE(1+MOD('Days1-2'!J1+3-2,7),\"Su\",\"M\",\"Tu\",\"W\",\"Th\",\"F\",\"Sa\")","v":"Tu"},{"$f":"CHOOSE(1+MOD('Days1-2'!J1+4-2,7),\"Su\",\"M\",\"Tu\",\"W\",\"Th\",\"F\",\"Sa\")","v":"W"},{"$f":"CHOOSE(1+MOD('Days1-2'!J1+5-2,7),\"Su\",\"M\",\"Tu\",\"W\",\"Th\",\"F\",\"Sa\")","v":"Th"},{"$f":"CHOOSE(1+MOD('Days1-2'!J1+6-2,7),\"Su\",\"M\",\"Tu\",\"W\",\"Th\",\"F\",\"Sa\")","v":"F"},{"$f":"CHOOSE(1+MOD('Days1-2'!J1+7-2,7),\"Su\",\"M\",\"Tu\",\"W\",\"Th\",\"F\",\"Sa\")","v":"Sa"},null,null,null,null,null,null,null,null,{"$f":"CHOOSE(1+MOD('Days1-2'!$J$1+1-2,7),\"Su\",\"M\",\"Tu\",\"W\",\"Th\",\"F\",\"Sa\")","v":"Su"},{"$f":"CHOOSE(1+MOD('Days1-2'!$J$1+2-2,7),\"Su\",\"M\",\"Tu\",\"W\",\"Th\",\"F\",\"Sa\")","v":"M"},{"$f":"CHOOSE(1+MOD('Days1-2'!$J$1+3-2,7),\"Su\",\"M\",\"Tu\",\"W\",\"Th\",\"F\",\"Sa\")","v":"Tu"},{"$f":"CHOOSE(1+MOD('Days1-2'!$J$1+4-2,7),\"Su\",\"M\",\"Tu\",\"W\",\"Th\",\"F\",\"Sa\")","v":"W"},{"$f":"CHOOSE(1+MOD('Days1-2'!$J$1+5-2,7),\"Su\",\"M\",\"Tu\",\"W\",\"Th\",\"F\",\"Sa\")","v":"Th"},{"$f":"CHOOSE(1+MOD('Days1-2'!$J$1+6-2,7),\"Su\",\"M\",\"Tu\",\"W\",\"Th\",\"F\",\"Sa\")","v":"F"},{"$f":"CHOOSE(1+MOD('Days1-2'!$J$1+7-2,7),\"Su\",\"M\",\"Tu\",\"W\",\"Th\",\"F\",\"Sa\")","v":"Sa"},null,{"$f":"CHOOSE(1+MOD('Days1-2'!$J$1+1-2,7),\"Su\",\"M\",\"Tu\",\"W\",\"Th\",\"F\",\"Sa\")","v":"Su"},{"$f":"CHOOSE(1+MOD('Days1-2'!$J$1+2-2,7),\"Su\",\"M\",\"Tu\",\"W\",\"Th\",\"F\",\"Sa\")","v":"M"},{"$f":"CHOOSE(1+MOD('Days1-2'!$J$1+3-2,7),\"Su\",\"M\",\"Tu\",\"W\",\"Th\",\"F\",\"Sa\")","v":"Tu"},{"$f":"CHOOSE(1+MOD('Days1-2'!$J$1+4-2,7),\"Su\",\"M\",\"Tu\",\"W\",\"Th\",\"F\",\"Sa\")","v":"W"},{"$f":"CHOOSE(1+MOD('Days1-2'!$J$1+5-2,7),\"Su\",\"M\",\"Tu\",\"W\",\"Th\",\"F\",\"Sa\")","v":"Th"},{"$f":"CHOOSE(1+MOD('Days1-2'!$J$1+6-2,7),\"Su\",\"M\",\"Tu\",\"W\",\"Th\",\"F\",\"Sa\")","v":"F"},{"$f":"CHOOSE(1+MOD('Days1-2'!$J$1+7-2,7),\"Su\",\"M\",\"Tu\",\"W\",\"Th\",\"F\",\"Sa\")","v":"Sa"}]
[null,null,null,null,{"$f":"INDEX({\"Sunday\",\"Monday\",\"Tuesday\",\"Wednesday\",\"Thursday\",\"Friday\",\"Saturday\"},WEEKDAY(E3))","v":"Saturday"},null,null,null,{"$f":"IF(WEEKDAY(I3,1)='Days1-2'!$J$1,I3,\"\")","v":""},{"$f":"IF(I5=\"\",IF(WEEKDAY(I3,1)=MOD('Days1-2'!$J$1,7)+1,I3,\"\"),I5+1)","v":""},{"$f":"IF(J5=\"\",IF(WEEKDAY(I3,1)=MOD('Days1-2'!$J$1+1,7)+1,I3,\"\"),J5+1)","v":""},{"$f":"IF(K5=\"\",IF(WEEKDAY(I3,1)=MOD('Days1-2'!$J$1+2,7)+1,I3,\"\"),K5+1)","v":"2024-05-01"},{"$f":"IF(L5=\"\",IF(WEEKDAY(I3,1)=MOD('Days1-2'!$J$1+3,7)+1,I3,\"\"),L5+1)","v":"2024-05-02"},{"$f":"IF(M5=\"\",IF(WEEKDAY(I3,1)=MOD('Days1-2'!$J$1+4,7)+1,I3,\"\"),M5+1)","v":"2024-05-03"},{"$f":"IF(N5=\"\",IF(WEEKDAY(I3,1)=MOD('Days1-2'!$J$1+5,7)+1,I3,\"\"),N5+1)","v":"2024-05-04"},null,{"$f":"IF(WEEKDAY(Q3,1)='Days1-2'!$J$1,Q3,\"\")","v":""},{"$f":"IF(Q5=\"\",IF(WEEKDAY(Q3,1)=MOD('Days1-2'!$J$1,7)+1,Q3,\"\"),Q5+1)","v":""},{"$f":"IF(R5=\"\",IF(WEEKDAY(Q3,1)=MOD('Days1-2'!$J$1+1,7)+1,Q3,\"\"),R5+1)","v":""},{"$f":"IF(S5=\"\",IF(WEEKDAY(Q3,1)=MOD('Days1-2'!$J$1+2,7)+1,Q3,\"\"),S5+1)","v":""},{"$f":"IF(T5=\"\",IF(WEEKDAY(Q3,1)=MOD('Days1-2'!$J$1+3,7)+1,Q3,\"\"),T5+1)","v":""},{"$f":"IF(U5=\"\",IF(WEEKDAY(Q3,1)=MOD('Days1-2'!$J$1+4,7)+1,Q3,\"\"),U5+1)","v":""},{"$f":"IF(V5=\"\",IF(WEEKDAY(Q3,1)=MOD('Days1-2'!$J$1+5,7)+1,Q3,\"\"),V5+1)","v":"2024-06-01"},null,null,null,null,{"$f":"INDEX({\"Sunday\",\"Monday\",\"Tuesday\",\"Wednesday\",\"Thursday\",\"Friday\",\"Saturday\"},WEEKDAY(AB3))","v":"Sunday"},null,null,null,{"$f":"IF(WEEKDAY(AF3,1)='Days1-2'!$J$1,AF3,\"\")","v":""},{"$f":"IF(AF5=\"\",IF(WEEKDAY(AF3,1)=MOD('Days1-2'!$J$1,7)+1,AF3,\"\"),AF5+1)","v":""},{"$f":"IF(AG5=\"\",IF(WEEKDAY(AF3,1)=MOD('Days1-2'!$J$1+1,7)+1,AF3,\"\"),AG5+1)","v":""},{"$f":"IF(AH5=\"\",IF(WEEKDAY(AF3,1)=MOD('Days1-2'!$J$1+2,7)+1,AF3,\"\"),AH5+1)","v":"2024-05-01"},{"$f":"IF(AI5=\"\",IF(WEEKDAY(AF3,1)=MOD('Days1-2'!$J$1+3,7)+1,AF3,\"\"),AI5+1)","v":"2024-05-02"},{"$f":"IF(AJ5=\"\",IF(WEEKDAY(AF3,1)=MOD('Days1-2'!$J$1+4,7)+1,AF3,\"\"),AJ5+1)","v":"2024-05-03"},{"$f":"IF(AK5=\"\",IF(WEEKDAY(AF3,1)=MOD('Days1-2'!$J$1+5,7)+1,AF3,\"\"),AK5+1)","v":"2024-05-04"},null,{"$f":"IF(WEEKDAY(AN3,1)='Days1-2'!$J$1,AN3,\"\")","v":""},{"$f":"IF(AN5=\"\",IF(WEEKDAY(AN3,1)=MOD('Days1-2'!$J$1,7)+1,AN3,\"\"),AN5+1)","v":""},{"$f":"IF(AO5=\"\",IF(WEEKDAY(AN3,1)=MOD('Days1-2'!$J$1+1,7)+1,AN3,\"\"),AO5+1)","v":""},{"$f":"IF(AP5=\"\",IF(WEEKDAY(AN3,1)=MOD('Days1-2'!$J$1+2,7)+1,AN3,\"\"),AP5+1)","v":""},{"$f":"IF(AQ5=\"\",IF(WEEKDAY(AN3,1)=MOD('Days1-2'!$J$1+3,7)+1,AN3,\"\"),AQ5+1)","v":""},{"$f":"IF(AR5=\"\",IF(WEEKDAY(AN3,1)=MOD('Days1-2'!$J$1+4,7)+1,AN3,\"\"),AR5+1)","v":""},{"$f":"IF(AS5=\"\",IF(WEEKDAY(AN3,1)=MOD('Days1-2'!$J$1+5,7)+1,AN3,\"\"),AS5+1)","v":"2024-06-01"}]
[null,null,null,null,null,null,null,null,{"$f":"IF(O5=\"\",\"\",IF(MONTH(O5+1)<>MONTH(O5),\"\",O5+1))","v":"2024-05-05"},{"$f":"IF(I6=\"\",\"\",IF(MONTH(I6+1)<>MONTH(I6),\"\",I6+1))","v":"2024-05-06"},{"$f":"IF(J6=\"\",\"\",IF(MONTH(J6+1)<>MONTH(J6),\"\",J6+1))","v":"2024-05-07"},{"$f":"IF(K6=\"\",\"\",IF(MONTH(K6+1)<>MONTH(K6),\"\",K6+1))","v":"2024-05-08"},"2024-05-09","2024-05-10","2024-05-11",null,{"$f":"IF(W5=\"\",\"\",IF(MONTH(W5+1)<>MONTH(W5),\"\",W5+1))","v":"2024-06-02"},{"$f":"IF(Q6=\"\",\"\",IF(MONTH(Q6+1)<>MONTH(Q6),\"\",Q6+1))","v":"2024-06-03"},{"$f":"IF(R6=\"\",\"\",IF(MONTH(R6+1)<>MONTH(R6),\"\",R6+1))","v":"2024-06-04"},{"$f":"IF(S6=\"\",\"\",IF(MONTH(S6+1)<>MONTH(S6),\"\",S6+1))","v":"2024-06-05"},{"$f":"IF(T6=\"\",\"\",IF(MONTH(T6+1)<>MONTH(T6),\"\",T6+1))","v":"2024-06-06"},"2024-06-07","2024-06-08",null,null,null,null,null,null,null,null,{"$f":"IF(AL5=\"\",\"\",IF(MONTH(AL5+1)<>MONTH(AL5),\"\",AL5+1))","v":"2024-05-05"},{"$f":"IF(AF6=\"\",\"\",IF(MONTH(AF6+1)<>MONTH(AF6),\"\",AF6+1))","v":"2024-05-06"},{"$f":"IF(AG6=\"\",\"\",IF(MONTH(AG6+1)<>MONTH(AG6),\"\",AG6+1))","v":"2024-05-07"},{"$f":"IF(AH6=\"\",\"\",IF(MONTH(AH6+1)<>MONTH(AH6),\"\",AH6+1))","v":"2024-05-08"},{"$f":"IF(AI6=\"\",\"\",IF(MONTH(AI6+1)<>MONTH(AI6),\"\",AI6+1))","v":"2024-05-09"},"2024-05-10","2024-05-11",null,{"$f":"IF(AT5=\"\",\"\",IF(MONTH(AT5+1)<>MONTH(AT5),\"\",AT5+1))","v":"2024-06-02"},{"$f":"IF(AN6=\"\",\"\",IF(MONTH(AN6+1)<>MONTH(AN6),\"\",AN6+1))","v":"2024-06-03"},{"$f":"IF(AO6=\"\",\"\",IF(MONTH(AO6+1)<>MONTH(AO6),\"\",AO6+1))","v":"2024-06-04"},{"$f":"IF(AP6=\"\",\"\",IF(MONTH(AP6+1)<>MONTH(AP6),\"\",AP6+1))","v":"2024-06-05"},{"$f":"IF(AQ6=\"\",\"\",IF(MONTH(AQ6+1)<>MONTH(AQ6),\"\",AQ6+1))","v":"2024-06-06"},"2024-06-07","2024-06-08"]
[null,{"$f":"IFERROR(INDEX(arr_holiday,SMALL(IF(arr_holidaydate=$E$3,ROW(arr_holidaydate)),ROW()-ROW($B$6))),\"\")","v":"Star Wars Day"},null,null,null,null,null,null,{"$f":"IF(O6=\"\",\"\",IF(MONTH(O6+1)<>MONTH(O6),\"\",O6+1))","v":"2024-05-12"},{"$f":"IF(I7=\"\",\"\",IF(MONTH(I7+1)<>MONTH(I7),\"\",I7+1))","v":"2024-05-13"},"2024-05-14","2024-05-15","2024-05-16","2024-05-17","2024-05-18",null,{"$f":"IF(W6=\"\",\"\",IF(MONTH(W6+1)<>MONTH(W6),\"\",W6+1))","v":"2024-06-09"},{"$f":"IF(Q7=\"\",\"\",IF(MONTH(Q7+1)<>MONTH(Q7),\"\",Q7+1))","v":"2024-06-10"},"2024-06-11","2024-06-12","2024-06-13","2024-06-14","2024-06-15",null,{"$f":"IFERROR(INDEX(arr_holiday,SMALL(IF(arr_holidaydate=$AB$3,ROW(arr_holidaydate)),ROW()-ROW($B$6))),\"\")","v":"Cinco de Mayo"},null,null,null,null,null,null,{"$f":"IF(AL6=\"\",\"\",IF(MONTH(AL6+1)<>MONTH(AL6),\"\",AL6+1))","v":"2024-05-12"},{"$f":"IF(AF7=\"\",\"\",IF(MONTH(AF7+1)<>MONTH(AF7),\"\",AF7+1))","v":"2024-05-13"},"2024-05-14","2024-05-15","2024-05-16","2024-05-17","2024-05-18",null,{"$f":"IF(AT6=\"\",\"\",IF(MONTH(AT6+1)<>MONTH(AT6),\"\",AT6+1))","v":"2024-06-09"},{"$f":"IF(AN7=\"\",\"\",IF(MONTH(AN7+1)<>MONTH(AN7),\"\",AN7+1))","v":"2024-06-10"},"2024-06-11","2024-06-12","2024-06-13","2024-06-14","2024-06-15"]
[null,{"$f":"IFERROR(INDEX(arr_holiday,SMALL(IF(arr_holidaydate=$E$3,ROW(arr_holidaydate)),ROW()-ROW($B$6))),\"\")","v":""},null,null,null,null,null,null,"2024-05-19","2024-05-20","2024-05-21","2024-05-22","2024-05-23","2024-05-24","2024-05-25",null,"2024-06-16","2024-06-17","2024-06-18","2024-06-19","2024-06-20","2024-06-21","2024-06-22",null,{"$f":"IFERROR(INDEX(arr_holiday,SMALL(IF(arr_holidaydate=$AB$3,ROW(arr_holidaydate)),ROW()-ROW($B$6))),\"\")","v":""},null,null,null,null,null,null,"2024-05-19","2024-05-20","2024-05-21","2024-05-22","2024-05-23","2024-05-24","2024-05-25",null,"2024-06-16","2024-06-17","2024-06-18","2024-06-19","2024-06-20","2024-06-21","2024-06-22"]
[null,{"$f":"IFERROR(INDEX(arr_holiday,SMALL(IF(arr_holidaydate=$E$3,ROW(arr_holidaydate)),ROW()-ROW($B$6))),\"\")","v":""},null,null,null,null,null,null,"2024-05-26","2024-05-27","2024-05-28","2024-05-29","2024-05-30","2024-05-31","",null,"2024-06-23","2024-06-24","2024-06-25","2024-06-26","2024-06-27","2024-06-28","2024-06-29",null,{"$f":"IFERROR(INDEX(arr_holiday,SMALL(IF(arr_holidaydate=$AB$3,ROW(arr_holidaydate)),ROW()-ROW($B$6))),\"\")","v":""},null,null,null,null,null,null,"2024-05-26","2024-05-27","2024-05-28","2024-05-29","2024-05-30","2024-05-31","",null,"2024-06-23","2024-06-24","2024-06-25","2024-06-26","2024-06-27","2024-06-28","2024-06-29"]
[null,{"$f":"IFERROR(INDEX(arr_event,SMALL(IF(arr_eventdate=$E$3,ROW(arr_eventdate)),ROW()-ROW($B$9))),\"\")","v":""},null,null,null,null,null,null,"","","","","","","",null,"2024-06-30","","","","","","",null,{"$f":"IFERROR(INDEX(arr_event,SMALL(IF(arr_eventdate=$AB$3,ROW(arr_eventdate)),ROW()-ROW($B$9))),\"\")","v":""},null,null,null,null,null,null,"","","","","","","",null,"2024-06-30","","","","","",""]
[null,{"$f":"IFERROR(INDEX(arr_event,SMALL(IF(arr_eventdate=$E$3,ROW(arr_eventdate)),ROW()-ROW($B$9))),\"\")","v":""},null,null,null,null,null,null,null,null,null,null,null,null,null,null,null,null,null,null,null,null,null,null,{"$f":"IFERROR(INDEX(arr_event,SMALL(IF(arr_eventdate=$AB$3,ROW(arr_eventdate)),ROW()-ROW($B$9))),\"\")","v":""}]
[null,{"$f":"IFERROR(INDEX(arr_event,SMALL(IF(arr_eventdate=$E$3,ROW(arr_eventdate)),ROW()-ROW($B$9))),\"\")","v":""},null,null,null,null,null,null,null,null,null,null,null,null,null,null,null,null,null,null,null,null,null,null,{"$f":"IFERROR(INDEX(arr_event,SMALL(IF(arr_eventdate=$AB$3,ROW(arr_eventdate)),ROW()-ROW($B$9))),\"\")","v":""}]
[null,"Reminders",null,null,null,null,null,null,"Appointments",null,null,null,null,null,null,null,"Notes",null,null,null,null,null,null,null,"Reminders",null,null,null,null,null,null,"Appointments",null,null,null,null,null,null,null,"Notes"]
[null,{"$f":"IFERROR(INDEX(arr_event,SMALL(IF(arr_eventdate=$E$3,ROW(arr_eventdate)),ROW()-ROW($B$13))),\"\")","v":""},null,null,null,null,7,":00",null,null,null,null,null,null,null,null,null,null,null,null,null,null,null,null,{"$f":"IFERROR(INDEX(arr_event,SMALL(IF(arr_eventdate=$E$3,ROW(arr_eventdate)),ROW()-ROW($B$13))),\"\")","v":""},null,null,null,null,7,":00"]
[null,"",null,null,null,null,null,":30",null,null,null,null,null,null,null,null,null,null,null,null,null,null,null,null,"",null,null,null,null,null,":30"]
[null,"",null,null,null,null,8,":00",null,null,null,null,null,null,null,null,null,null,null,null,null,null,null,null,"",null,null,null,null,8,":00"]
[null,"",null,null,null,null,null,":30",null,null,null,null,null,null,null,null,null,null,null,null,null,null,null,null,"",null,null,null,null,null,":30"]
[null,"",null,null,null,null,9,":00",null,null,null,null,null,null,null,null,null,null,null,null,null,null,null,null,"",null,null,null,null,9,":00"]
[null,"",null,null,null,null,null,":30",null,null,null,null,null,null,null,null,null,null,null,null,null,null,null,null,"",null,null,null,null,null,":30"]
[null,"",null,null,null,null,10,":00",null,null,null,null,null,null,null,null,null,null,null,null,null,null,null,null,"",null,null,null,null,10,":00"]
[null,"",null,null,null,null,null,":30",null,null,null,null,null,null,null,null,null,null,null,null,null,null,null,null,"",null,null,null,null,null,":30"]
[null,"From",null,"Actions Carried Forward",null,null,11,":00",null,null,null,null,null,null,null,null,null,null,null,null,null,null,null,null,"From",null,"Actions Carried Forward",null,null,11,":00"]
[null,{"$f":"IFERROR(INDEX(arr_event,SMALL(IF(arr_eventdate=$E$3,ROW(arr_eventdate)),ROW()-ROW($B$13))),\"\")","v":""},null,null,null,null,null,":30",null,null,null,null,null,null,null,null,null,null,null,null,null,null,null,null,{"$f":"IFERROR(INDEX(arr_event,SMALL(IF(arr_eventdate=$E$3,ROW(arr_eventdate)),ROW()-ROW($B$13))),\"\")","v":""},null,null,null,null,null,":30"]
[null,{"$f":"IFERROR(INDEX(arr_event,SMALL(IF(arr_eventdate=$E$3,ROW(arr_eventdate)),ROW()-ROW($B$13))),\"\")","v":""},null,null,null,null,12,":00",null,null,null,null,null,null,null,null,null,null,null,null,null,null,null,null,{"$f":"IFERROR(INDEX(arr_event,SMALL(IF(arr_eventdate=$E$3,ROW(arr_eventdate)),ROW()-ROW($B$13))),\"\")","v":""},null,null,null,null,12,":00"]
[null,{"$f":"IFERROR(INDEX(arr_event,SMALL(IF(arr_eventdate=$E$3,ROW(arr_eventdate)),ROW()-ROW($B$13))),\"\")","v":""},null,null,null,null,null,":30",null,null,null,null,null,null,null,null,null,null,null,null,null,null,null,null,{"$f":"IFERROR(INDEX(arr_event,SMALL(IF(arr_eventdate=$E$3,ROW(arr_eventdate)),ROW()-ROW($B$13))),\"\")","v":""},null,null,null,null,null,":30"]
[null,{"$f":"IFERROR(INDEX(arr_event,SMALL(IF(arr_eventdate=$E$3,ROW(arr_eventdate)),ROW()-ROW($B$13))),\"\")","v":""},null,null,null,null,1,":00",null,null,null,null,null,null,null,null,null,null,null,null,null,null,null,null,{"$f":"IFERROR(INDEX(arr_event,SMALL(IF(arr_eventdate=$E$3,ROW(arr_eventdate)),ROW()-ROW($B$13))),\"\")","v":""},null,null,null,null,1,":00"]
[null,{"$f":"IFERROR(INDEX(arr_event,SMALL(IF(arr_eventdate=$E$3,ROW(arr_eventdate)),ROW()-ROW($B$13))),\"\")","v":""},null,null,null,null,null,":30",null,null,null,null,null,null,null,null,null,null,null,null,null,null,null,null,{"$f":"IFERROR(INDEX(arr_event,SMALL(IF(arr_eventdate=$E$3,ROW(arr_eventdate)),ROW()-ROW($B$13))),\"\")","v":""},null,null,null,null,null,":30"]
[null,{"$f":"IFERROR(INDEX(arr_event,SMALL(IF(arr_eventdate=$E$3,ROW(arr_eventdate)),ROW()-ROW($B$13))),\"\")","v":""},null,null,null,null,2,":00",null,null,null,null,null,null,null,null,null,null,null,null,null,null,null,null,{"$f":"IFERROR(INDEX(arr_event,SMALL(IF(arr_eventdate=$E$3,ROW(arr_eventdate)),ROW()-ROW($B$13))),\"\")","v":""},null,null,null,null,2,":00"]
[null,{"$f":"IFERROR(INDEX(arr_event,SMALL(IF(arr_eventdate=$E$3,ROW(arr_eventdate)),ROW()-ROW($B$13))),\"\")","v":""},null,null,null,null,null,":30",null,null,null,null,null,null,null,null,null,null,null,null,null,null,null,null,{"$f":"IFERROR(INDEX(arr_event,SMALL(IF(arr_eventdate=$E$3,ROW(arr_eventdate)),ROW()-ROW($B$13))),\"\")","v":""},null,null,null,null,null,":30"]
[null,{"$f":"IFERROR(INDEX(arr_event,SMALL(IF(arr_eventdate=$E$3,ROW(arr_eventdate)),ROW()-ROW($B$13))),\"\")","v":""},null,null,null,null,3,":00",null,null,null,null,null,null,null,null,null,null,null,null,null,null,null,null,{"$f":"IFERROR(INDEX(arr_event,SMALL(IF(arr_eventdate=$E$3,ROW(arr_eventdate)),ROW()-ROW($B$13))),\"\")","v":""},null,null,null,null,3,":00"]
[null,null,null,null,null,null,null,":30",null,null,null,null,null,null,null,null,null,null,null,null,null,null,null,null,null,null,null,null,null,null,":30"]
[null,"$Amt",null,"Expenses",null,null,4,":00",null,null,null,null,null,null,null,null,null,null,null,null,null,null,null,null,"$Amt",null,"Expenses",null,null,4,":00"]
[null,null,null,null,null,null,null,":30",null,null,null,null,null,null,null,null,null,null,null,null,null,null,null,null,null,null,null,null,null,null,":30"]
[null,null,null,null,null,null,5,":00",null,null,null,null,null,null,null,null,null,null,null,null,null,null,null,null,null,null,null,null,null,5,":00"]
[null,null,null,null,null,null,null,":30",null,null,null,null,null,null,null,null,null,null,null,null,null,null,null,null,null,null,null,null,null,null,":30"]
[null,null,null,null,null,null,6,":00",null,null,null,null,null,null,null,null,null,null,null,null,null,null,null,null,null,null,null,null,null,6,":00"]
[null,null,null,null,null,null,null,":30",null,null,null,null,null,null,null,null,null,null,null,null,null,null,null,null,null,null,null,null,null,null,":30"]
[]
[null,"Planned cases for today",null,null,null,null,null,":30",null,null,null,null,null,null,null,null,null,null,null,null,null,null,null,null,"Planned cases for today",null,null,null,null,null,":30"]
[null,"Case",null,null,null,"Action",null,null,null,null,null,null,null,null,null,null,null,null,null,"Follow-up",null,null,null,null,"Case",null,null,null,"Action",null,null,null,null,null,null,null,null,null,null,null,null,null,"Follow-up"]

{"sheet":"Days7-8","index":5,"n_rows":40,"n_cols":46,"rows_kept":40,"cut":false,"hidden":false,"merged":[[56,24,56,27],[56,28,56,41],[56,42,56,45],[57,24,57,27],[57,28,57,41],[57,42,57,45],[52,42,52,45],[53,24,53,27],[53,28,53,41],[53,42,53,45],[54,24,54,27],[54,28,54,41],[54,42,54,45],[55,24,55,27],[55,28,55,41],[55,42,55,45],[48,42,48,45],[49,24,49,27],[49,28,49,41],[49,42,49,45],[50,24,50,27],[50,28,50,41],[50,42,50,45],[51,24,51,27],[51,28,51,41],[51,42,51,45],[44,42,44,45],[45,24,45,27],[45,28,45,41],[45,42,45,45],[46,24,46,27],[46,28,46,41],[46,42,46,45],[47,24,47,27],[47,28,47,41],[47,42,47,45],[40,42,40,45],[41,24,41,27],[41,28,41,41],[41,42,41,45],[42,24,42,27],[42,28,42,41],[42,42,42,45],[43,24,43,27],[43,28,43,41],[43,42,43,45],[57,1,57,4],[57,5,57,18],[57,19,57,22],[58,1,58,4],[58,5,58,18],[58,19,58,22],[29,24,29,25],[31,24,31,25],[31,26,31,27],[32,24,32,25],[32,26,32,27],[33,24,33,25],[33,26,33,27],[34,24,34,25],[34,26,34,27],[35,24,35,25],[35,26,35,27],[36,24,36,25],[36,26,36,27],[38,24,38,45],[39,24,39,27],[39,28,39,41],[39,42,39,45],[40,24,40,27],[0,32,0,33],[2,1,5,3],[2,4,3,7],[2,8,2,14],[2,16,2,22],[2,24,5,26],[2,27,3,30],[2,31,2,37],[29,1,29,2],[13,6,14,6],[13,29,14,29],[15,6,16,6],[15,29,16,29],[17,6,18,6],[17,29,18,29],[2,39,2,45],[4,4,5,6],[4,27,5,29],[6,5,6,6],[6,28,6,29],[12,1,12,4],[12,16,12,22],[12,24,12,27],[12,39,12,45],[22,24,22,25],[22,26,22,27],[23,1,23,2],[23,3,23,4],[23,6,24,6],[23,24,23,25],[23,26,23,27],[19,6,20,6],[19,29,20,29],[21,1,21,2],[21,3,21,4],[21,6,22,6],[21,24,21,25],[21,26,21,27],[21,29,22,29],[22,1,22,2],[22,3,22,4],[23,29,24,29],[24,1,24,2],[24,3,24,4],[24,24,24,25],[24,26,24,27],[25,1,25,2],[25,3,25,4],[25,6,26,6],[25,24,25,25],[25,26,25,27],[25,29,26,29],[26,1,26,2],[26,3,26,4],[26,24,26,25],[26,26,26,27],[27,1,27,2],[27,3,27,4],[27,6,28,6],[27,24,27,25],[27,26,27,27],[27,29,28,29],[28,1,28,2],[28,3,28,4],[28,24,28,25],[28,26,28,27],[29,3,29,4],[29,6,30,6],[29,26,29,27],[29,29,30,29],[31,6,32,6],[31,29,32,29],[33,6,34,6],[33,29,34,29],[35,6,36,6],[35,29,36,29],[40,5,40,18],[40,19,40,22],[41,5,41,18],[41,19,41,22],[42,5,42,18],[42,19,42,22],[40,28,40,41],[42,1,42,4],[43,1,43,4],[43,5,43,18],[43,19,43,22],[44,24,44,27],[44,28,44,41],[31,1,31,2],[31,3,31,4],[40,1,40,4],[41,1,41,4],[44,1,44,4],[44,5,44,18],[44,19,44,22],[45,1,45,4],[45,5,45,18],[45,19,45,22],[46,1,46,4],[46,5,46,18],[46,19,46,22],[47,1,47,4],[47,5,47,18],[47,19,47,22],[32,1,32,2],[32,3,32,4],[33,1,33,2],[33,3,33,4],[48,1,48,4],[48,5,48,18],[48,19,48,22],[49,1,49,4],[49,5,49,18],[49,19,49,22],[50,1,50,4],[50,5,50,18],[50,19,50,22],[51,1,51,4],[51,5,51,18],[51,19,51,22],[48,24,48,27],[48,28,48,41],[34,1,34,2],[34,3,34,4],[35,1,35,2],[35,3,35,4],[52,1,52,4],[52,5,52,18],[52,19,52,22],[53,1,53,4],[53,5,53,18],[53,19,53,22],[52,24,52,27],[52,28,52,41],[39,1,39,4],[39,5,39,18],[39,19,39,22],[58,24,58,27],[58,28,58,41],[58,42,58,45],[36,1,36,2],[36,3,36,4],[38,1,38,22],[54,1,54,4],[54,5,54,18],[54,19,54,22],[55,1,55,4],[55,5,55,18],[55,19,55,22],[56,1,56,4],[56,5,56,18],[56,19,56,22],[61,1,61,4],[61,5,61,18],[61,19,61,22],[61,24,61,27],[61,28,61,41],[61,42,61,45],[59,1,59,4],[59,5,59,18],[59,19,59,22],[59,24,59,27],[59,28,59,41],[59,42,59,45],[62,1,62,4],[62,5,62,18],[62,19,62,22],[62,24,62,27],[62,28,62,41],[62,42,62,45]]}
[]
[]
[null,{"$f":"DAY(E3)","v":6},null,null,{"$f":"'Days5-6'!AB3+1","v":"2024-05-06"},null,null,null,{"$f":"DATE(YEAR($E$3),MONTH($E$3),1)","v":"2024-05-01"},null,null,null,null,null,null,null,{"$f":"DATE(YEAR(I3+35),MONTH(I3+35),1)","v":"2024-06-01"},null,null,null,null,null,null,null,{"$f":"DAY(AB3)","v":7},null,null,{"$f":"E3+1","v":"2024-05-07"},null,null,null,{"$f":"DATE(YEAR(AB3),MONTH(AB3),1)","v":"2024-05-01"},null,null,null,null,null,null,null,{"$f":"DATE(YEAR(AF3+35),MONTH(AF3+35),1)","v":"2024-06-01"}]
[null,null,null,null,null,null,null,null,{"$f":"CHOOSE(1+MOD('Days1-2'!J1+1-2,7),\"Su\",\"M\",\"Tu\",\"W\",\"Th\",\"F\",\"Sa\")","v":"Su"},{"$f":"CHOOSE(1+MOD('Days1-2'!$J$1+2-2,7),\"Su\",\"M\",\"Tu\",\"W\",\"Th\",\"F\",\"Sa\")","v":"M"},{"$f":"CHOOSE(1+MOD('Days1-2'!$J$1+3-2,7),\"Su\",\"M\",\"Tu\",\"W\",\"Th\",\"F\",\"Sa\")","v":"Tu"},{"$f":"CHOOSE(1+MOD('Days1-2'!$J$1+4-2,7),\"Su\",\"M\",\"Tu\",\"W\",\"Th\",\"F\",\"Sa\")","v":"W"},{"$f":"CHOOSE(1+MOD('Days1-2'!$J$1+5-2,7),\"Su\",\"M\",\"Tu\",\"W\",\"Th\",\"F\",\"Sa\")","v":"Th"},{"$f":"CHOOSE(1+MOD('Days1-2'!$J$1+6-2,7),\"Su\",\"M\",\"Tu\",\"W\",\"Th\",\"F\",\"Sa\")","v":"F"},{"$f":"CHOOSE(1+MOD('Days1-2'!$J$1+7-2,7),\"Su\",\"M\",\"Tu\",\"W\",\"Th\",\"F\",\"Sa\")","v":"Sa"},null,{"$f":"CHOOSE(1+MOD('Days1-2'!J1+1-2,7),\"Su\",\"M\",\"Tu\",\"W\",\"Th\",\"F\",\"Sa\")","v":"Su"},{"$f":"CHOOSE(1+MOD('Days1-2'!J1+2-2,7),\"Su\",\"M\",\"Tu\",\"W\",\"Th\",\"F\",\"Sa\")","v":"M"},{"$f":"CHOOSE(1+MOD('Days1-2'!J1+3-2,7),\"Su\",\"M\",\"Tu\",\"W\",\"Th\",\"F\",\"Sa\")","v":"Tu"},{"$f":"CHOOSE(1+MOD('Days1-2'!J1+4-2,7),\"Su\",\"M\",\"Tu\",\"W\",\"Th\",\"F\",\"Sa\")","v":"W"},{"$f":"CHOOSE(1+MOD('Days1-2'!J1+5-2,7),\"Su\",\"M\",\"Tu\",\"W\",\"Th\",\"F\",\"Sa\")","v":"Th"},{"$f":"CHOOSE(1+MOD('Days1-2'!J1+6-2,7),\"Su\",\"M\",\"Tu\",\"W\",\"Th\",\"F\",\"Sa\")","v":"F"},{"$f":"CHOOSE(1+MOD('Days1-2'!J1+7-2,7),\"Su\",\"M\",\"Tu\",\"W\",\"Th\",\"F\",\"Sa\")","v":"Sa"},null,null,null,null,null,null,null,null,{"$f":"CHOOSE(1+MOD('Days1-2'!$J$1+1-2,7),\"Su\",\"M\",\"Tu\",\"W\",\"Th\",\"F\",\"Sa\")","v":"Su"},{"$f":"CHOOSE(1+MOD('Days1-2'!$J$1+2-2,7),\"Su\",\"M\",\"Tu\",\"W\",\"Th\",\"F\",\"Sa\")","v":"M"},{"$f":"CHOOSE(1+MOD('Days1-2'!$J$1+3-2,7),\"Su\",\"M\",\"Tu\",\"W\",\"Th\",\"F\",\"Sa\")","v":"Tu"},{"$f":"CHOOSE(1+MOD('Days1-2'!$J$1+4-2,7),\"Su\",\"M\",\"Tu\",\"W\",\"Th\",\"F\",\"Sa\")","v":"W"},{"$f":"CHOOSE(1+MOD('Days1-2'!$J$1+5-2,7),\"Su\",\"M\",\"Tu\",\"W\",\"Th\",\"F\",\"Sa\")","v":"Th"},{"$f":"CHOOSE(1+MOD('Days1-2'!$J$1+6-2,7),\"Su\",\"M\",\"Tu\",\"W\",\"Th\",\"F\",\"Sa\")","v":"F"},{"$f":"CHOOSE(1+MOD('Days1-2'!$J$1+7-2,7),\"Su\",\"M\",\"Tu\",\"W\",\"Th\",\"F\",\"Sa\")","v":"Sa"},null,{"$f":"CHOOSE(1+MOD('Days1-2'!$J$1+1-2,7),\"Su\",\"M\",\"Tu\",\"W\",\"Th\",\"F\",\"Sa\")","v":"Su"},{"$f":"CHOOSE(1+MOD('Days1-2'!$J$1+2-2,7),\"Su\",\"M\",\"Tu\",\"W\",\"Th\",\"F\",\"Sa\")","v":"M"},{"$f":"CHOOSE(1+MOD('Days1-2'!$J$1+3-2,7),\"Su\",\"M\",\"Tu\",\"W\",\"Th\",\"F\",\"Sa\")","v":"Tu"},{"$f":"CHOOSE(1+MOD('Days1-2'!$J$1+4-2,7),\"Su\",\"M\",\"Tu\",\"W\",\"Th\",\"F\",\"Sa\")","v":"W"},{"$f":"CHOOSE(1+MOD('Days1-2'!$J$1+5-2,7),\"Su\",\"M\",\"Tu\",\"W\",\"Th\",\"F\",\"Sa\")","v":"Th"},{"$f":"CHOOSE(1+MOD('Days1-2'!$J$1+6-2,7),\"Su\",\"M\",\"Tu\",\"W\",\"Th\",\"F\",\"Sa\")","v":"F"},{"$f":"CHOOSE(1+MOD('Days1-2'!$J$1+7-2,7),\"Su\",\"M\",\"Tu\",\"W\",\"Th\",\"F\",\"Sa\")","v":"Sa"}]
[null,null,null,null,{"$f":"INDEX({\"Sunday\",\"Monday\",\"Tuesday\",\"Wednesday\",\"Thursday\",\"Friday\",\"Saturday\"},WEEKDAY(E3))","v":"Monday"},null,null,null,{"$f":"IF(WEEKDAY(I3,1)='Days1-2'!$J$1,I3,\"\")","v":""},{"$f":"IF(I5=\"\",IF(WEEKDAY(I3,1)=MOD('Days1-2'!$J$1,7)+1,I3,\"\"),I5+1)","v":""},{"$f":"IF(J5=\"\",IF(WEEKDAY(I3,1)=MOD('Days1-2'!$J$1+1,7)+1,I3,\"\"),J5+1)","v":""},{"$f":"IF(K5=\"\",IF(WEEKDAY(I3,1)=MOD('Days1-2'!$J$1+2,7)+1,I3,\"\"),K5+1)","v":"2024-05-01"},{"$f":"IF(L5=\"\",IF(WEEKDAY(I3,1)=MOD('Days1-2'!$J$1+3,7)+1,I3,\"\"),L5+1)","v":"2024-05-02"},{"$f":"IF(M5=\"\",IF(WEEKDAY(I3,1)=MOD('Days1-2'!$J$1+4,7)+1,I3,\"\"),M5+1)","v":"2024-05-03"},{"$f":"IF(N5=\"\",IF(WEEKDAY(I3,1)=MOD('Days1-2'!$J$1+5,7)+1,I3,\"\"),N5+1)","v":"2024-05-04"},null,{"$f":"IF(WEEKDAY(Q3,1)='Days1-2'!$J$1,Q3,\"\")","v":""},{"$f":"IF(Q5=\"\",IF(WEEKDAY(Q3,1)=MOD('Days1-2'!$J$1,7)+1,Q3,\"\"),Q5+1)","v":""},{"$f":"IF(R5=\"\",IF(WEEKDAY(Q3,1)=MOD('Days1-2'!$J$1+1,7)+1,Q3,\"\"),R5+1)","v":""},{"$f":"IF(S5=\"\",IF(WEEKDAY(Q3,1)=MOD('Days1-2'!$J$1+2,7)+1,Q3,\"\"),S5+1)","v":""},{"$f":"IF(T5=\"\",IF(WEEKDAY(Q3,1)=MOD('Days1-2'!$J$1+3,7)+1,Q3,\"\"),T5+1)","v":""},{"$f":"IF(U5=\"\",IF(WEEKDAY(Q3,1)=MOD('Days1-2'!$J$1+4,7)+1,Q3,\"\"),U5+1)","v":""},{"$f":"IF(V5=\"\",IF(WEEKDAY(Q3,1)=MOD('Days1-2'!$J$1+5,7)+1,Q3,\"\"),V5+1)","v":"2024-06-01"},null,null,null,null,{"$f":"INDEX({\"Sunday\",\"Monday\",\"Tuesday\",\"Wednesday\",\"Thursday\",\"Friday\",\"Saturday\"},WEEKDAY(AB3))","v":"Tuesday"},null,null,null,{"$f":"IF(WEEKDAY(AF3,1)='Days1-2'!$J$1,AF3,\"\")","v":""},{"$f":"IF(AF5=\"\",IF(WEEKDAY(AF3,1)=MOD('Days1-2'!$J$1,7)+1,AF3,\"\"),AF5+1)","v":""},{"$f":"IF(AG5=\"\",IF(WEEKDAY(AF3,1)=MOD('Days1-2'!$J$1+1,7)+1,AF3,\"\"),AG5+1)","v":""},{"$f":"IF(AH5=\"\",IF(WEEKDAY(AF3,1)=MOD('Days1-2'!$J$1+2,7)+1,AF3,\"\"),AH5+1)","v":"2024-05-01"},{"$f":"IF(AI5=\"\",IF(WEEKDAY(AF3,1)=MOD('Days1-2'!$J$1+3,7)+1,AF3,\"\"),AI5+1)","v":"2024-05-02"},{"$f":"IF(AJ5=\"\",IF(WEEKDAY(AF3,1)=MOD('Days1-2'!$J$1+4,7)+1,AF3,\"\"),AJ5+1)","v":"2024-05-03"},{"$f":"IF(AK5=\"\",IF(WEEKDAY(AF3,1)=MOD('Days1-2'!$J$1+5,7)+1,AF3,\"\"),AK5+1)","v":"2024-05-04"},null,{"$f":"IF(WEEKDAY(AN3,1)='Days1-2'!$J$1,AN3,\"\")","v":""},{"$f":"IF(AN5=\"\",IF(WEEKDAY(AN3,1)=MOD('Days1-2'!$J$1,7)+1,AN3,\"\"),AN5+1)","v":""},{"$f":"IF(AO5=\"\",IF(WEEKDAY(AN3,1)=MOD('Days1-2'!$J$1+1,7)+1,AN3,\"\"),AO5+1)","v":""},{"$f":"IF(AP5=\"\",IF(WEEKDAY(AN3,1)=MOD('Days1-2'!$J$1+2,7)+1,AN3,\"\"),AP5+1)","v":""},{"$f":"IF(AQ5=\"\",IF(WEEKDAY(AN3,1)=MOD('Days1-2'!$J$1+3,7)+1,AN3,\"\"),AQ5+1)","v":""},{"$f":"IF(AR5=\"\",IF(WEEKDAY(AN3,1)=MOD('Days1-2'!$J$1+4,7)+1,AN3,\"\"),AR5+1)","v":""},{"$f":"IF(AS5=\"\",IF(WEEKDAY(AN3,1)=MOD('Days1-2'!$J$1+5,7)+1,AN3,\"\"),AS5+1)","v":"2024-06-01"}]
[null,null,null,null,null,null,null,null,{"$f":"IF(O5=\"\",\"\",IF(MONTH(O5+1)<>MONTH(O5),\"\",O5+1))","v":"2024-05-05"},{"$f":"IF(I6=\"\",\"\",IF(MONTH(I6+1)<>MONTH(I6),\"\",I6+1))","v":"2024-05-06"},{"$f":"IF(J6=\"\",\"\",IF(MONTH(J6+1)<>MONTH(J6),\"\",J6+1))","v":"2024-05-07"},{"$f":"IF(K6=\"\",\"\",IF(MONTH(K6+1)<>MONTH(K6),\"\",K6+1))","v":"2024-05-08"},"2024-05-09","2024-05-10","2024-05-11",null,{"$f":"IF(W5=\"\",\"\",IF(MONTH(W5+1)<>MONTH(W5),\"\",W5+1))","v":"2024-06-02"},{"$f":"IF(Q6=\"\",\"\",IF(MONTH(Q6+1)<>MONTH(Q6),\"\",Q6+1))","v":"2024-06-03"},{"$f":"IF(R6=\"\",\"\",IF(MONTH(R6+1)<>MONTH(R6),\"\",R6+1))","v":"2024-06-04"},{"$f":"IF(S6=\"\",\"\",IF(MONTH(S6+1)<>MONTH(S6),\"\",S6+1))","v":"2024-06-05"},{"$f":"IF(T6=\"\",\"\",IF(MONTH(T6+1)<>MONTH(T6),\"\",T6+1))","v":"2024-06-06"},"2024-06-07","2024-06-08",null,null,null,null,null,null,null,null,{"$f":"IF(AL5=\"\",\"\",IF(MONTH(AL5+1)<>MONTH(AL5),\"\",AL5+1))","v":"2024-05-05"},{"$f":"IF(AF6=\"\",\"\",IF(MONTH(AF6+1)<>MONTH(AF6),\"\",AF6+1))","v":"2024-05-06"},{"$f":"IF(AG6=\"\",\"\",IF(MONTH(AG6+1)<>MONTH(AG6),\"\",AG6+1))","v":"2024-05-07"},{"$f":"IF(AH6=\"\",\"\",IF(MONTH(AH6+1)<>MONTH(AH6),\"\",AH6+1))","v":"2024-05-08"},{"$f":"IF(AI6=\"\",\"\",IF(MONTH(AI6+1)<>MONTH(AI6),\"\",AI6+1))","v":"2024-05-09"},"2024-05-10","2024-05-11",null,{"$f":"IF(AT5=\"\",\"\",IF(MONTH(AT5+1)<>MONTH(AT5),\"\",AT5+1))","v":"2024-06-02"},{"$f":"IF(AN6=\"\",\"\",IF(MONTH(AN6+1)<>MONTH(AN6),\"\",AN6+1))","v":"2024-06-03"},{"$f":"IF(AO6=\"\",\"\",IF(MONTH(AO6+1)<>MONTH(AO6),\"\",AO6+1))","v":"2024-06-04"},{"$f":"IF(AP6=\"\",\"\",IF(MONTH(AP6+1)<>MONTH(AP6),\"\",AP6+1))","v":"2024-06-05"},{"$f":"IF(AQ6=\"\",\"\",IF(MONTH(AQ6+1)<>MONTH(AQ6),\"\",AQ6+1))","v":"2024-06-06"},"2024-06-07","2024-06-08"]
[null,{"$f":"IFERROR(INDEX(arr_holiday,SMALL(IF(arr_holidaydate=$E$3,ROW(arr_holidaydate)),ROW()-ROW($B$6))),\"\")","v":"May Day (UK)"},null,null,null,null,null,null,{"$f":"IF(O6=\"\",\"\",IF(MONTH(O6+1)<>MONTH(O6),\"\",O6+1))","v":"2024-05-12"},{"$f":"IF(I7=\"\",\"\",IF(MONTH(I7+1)<>MONTH(I7),\"\",I7+1))","v":"2024-05-13"},"2024-05-14","2024-05-15","2024-05-16","2024-05-17","2024-05-18",null,{"$f":"IF(W6=\"\",\"\",IF(MONTH(W6+1)<>MONTH(W6),\"\",W6+1))","v":"2024-06-09"},{"$f":"IF(Q7=\"\",\"\",IF(MONTH(Q7+1)<>MONTH(Q7),\"\",Q7+1))","v":"2024-06-10"},"2024-06-11","2024-06-12","2024-06-13","2024-06-14","2024-06-15",null,{"$f":"IFERROR(INDEX(arr_holiday,SMALL(IF(arr_holidaydate=$AB$3,ROW(arr_holidaydate)),ROW()-ROW($B$6))),\"\")","v":""},null,null,null,null,null,null,{"$f":"IF(AL6=\"\",\"\",IF(MONTH(AL6+1)<>MONTH(AL6),\"\",AL6+1))","v":"2024-05-12"},{"$f":"IF(AF7=\"\",\"\",IF(MONTH(AF7+1)<>MONTH(AF7),\"\",AF7+1))","v":"2024-05-13"},"2024-05-14","2024-05-15","2024-05-16","2024-05-17","2024-05-18",null,{"$f":"IF(AT6=\"\",\"\",IF(MONTH(AT6+1)<>MONTH(AT6),\"\",AT6+1))","v":"2024-06-09"},{"$f":"IF(AN7=\"\",\"\",IF(MONTH(AN7+1)<>MONTH(AN7),\"\",AN7+1))","v":"2024-06-10"},"2024-06-11","2024-06-12","2024-06-13","2024-06-14","2024-06-15"]
[null,{"$f":"IFERROR(INDEX(arr_holiday,SMALL(IF(arr_holidaydate=$E$3,ROW(arr_holidaydate)),ROW()-ROW($B$6))),\"\")","v":""},null,null,null,null,null,null,"2024-05-19","2024-05-20","2024-05-21","2024-05-22","2024-05-23","2024-05-24","2024-05-25",null,"2024-06-16","2024-06-17","2024-06-18","2024-06-19","2024-06-20","2024-06-21","2024-06-22",null,{"$f":"IFERROR(INDEX(arr_holiday,SMALL(IF(arr_holidaydate=$AB$3,ROW(arr_holidaydate)),ROW()-ROW($B$6))),\"\")","v":""},null,null,null,null,null,null,"2024-05-19","2024-05-20","2024-05-21","2024-05-22","2024-05-23","2024-05-24","2024-05-25",null,"2024-06-16","2024-06-17","2024-06-18","2024-06-19","2024-06-20","2024-06-21","2024-06-22"]
[null,{"$f":"IFERROR(INDEX(arr_holiday,SMALL(IF(arr_holidaydate=$E$3,ROW(arr_holidaydate)),ROW()-ROW($B$6))),\"\")","v":""},null,null,null,null,null,null,"2024-05-26","2024-05-27","2024-05-28","2024-05-29","2024-05-30","2024-05-31","",null,"2024-06-23","2024-06-24","2024-06-25","2024-06-26","2024-06-27","2024-06-28","2024-06-29",null,{"$f":"IFERROR(INDEX(arr_holiday,SMALL(IF(arr_holidaydate=$AB$3,ROW(arr_holidaydate)),ROW()-ROW($B$6))),\"\")","v":""},null,null,null,null,null,null,"2024-05-26","2024-05-27","2024-05-28","2024-05-29","2024-05-30","2024-05-31","",null,"2024-06-23","2024-06-24","2024-06-25","2024-06-26","2024-06-27","2024-06-28","2024-06-29"]
[null,{"$f":"IFERROR(INDEX(arr_event,SMALL(IF(arr_eventdate=$E$3,ROW(arr_eventdate)),ROW()-ROW($B$9))),\"\")","v":""},null,null,null,null,null,null,"","","","","","","",null,"2024-06-30","","","","","","",null,{"$f":"IFERROR(INDEX(arr_event,SMALL(IF(arr_eventdate=$AB$3,ROW(arr_eventdate)),ROW()-ROW($B$9))),\"\")","v":""},null,null,null,null,null,null,"","","","","","","",null,"2024-06-30","","","","","",""]
[null,{"$f":"IFERROR(INDEX(arr_event,SMALL(IF(arr_eventdate=$E$3,ROW(arr_eventdate)),ROW()-ROW($B$9))),\"\")","v":""},null,null,null,null,null,null,null,null,null,null,null,null,null,null,null,null,null,null,null,null,null,null,{"$f":"IFERROR(INDEX(arr_event,SMALL(IF(arr_eventdate=$AB$3,ROW(arr_eventdate)),ROW()-ROW($B$9))),\"\")","v":""}]
[null,{"$f":"IFERROR(INDEX(arr_event,SMALL(IF(arr_eventdate=$E$3,ROW(arr_eventdate)),ROW()-ROW($B$9))),\"\")","v":""},null,null,null,null,null,null,null,null,null,null,null,null,null,null,null,null,null,null,null,null,null,null,{"$f":"IFERROR(INDEX(arr_event,SMALL(IF(arr_eventdate=$AB$3,ROW(arr_eventdate)),ROW()-ROW($B$9))),\"\")","v":""}]
[null,"Reminders",null,null,null,null,null,null,"Appointments",null,null,null,null,null,null,null,"Notes",null,null,null,null,null,null,null,"Reminders",null,null,null,null,null,null,"Appointments",null,null,null,null,null,null,null,"Notes"]
[null,{"$f":"IFERROR(INDEX(arr_event,SMALL(IF(arr_eventdate=$E$3,ROW(arr_eventdate)),ROW()-ROW($B$13))),\"\")","v":""},null,null,null,null,7,":00",null,null,null,null,null,null,null,null,null,null,null,null,null,null,null,null,{"$f":"IFERROR(INDEX(arr_event,SMALL(IF(arr_eventdate=$E$3,ROW(arr_eventdate)),ROW()-ROW($B$13))),\"\")","v":""},null,null,null,null,7,":00"]
[null,"",null,null,null,null,null,":30",null,null,null,null,null,null,null,null,null,null,null,null,null,null,null,null,"",null,null,null,null,null,":30"]
[null,"",null,null,null,null,8,":00",null,null,null,null,null,null,null,null,null,null,null,null,null,null,null,null,"",null,null,null,null,8,":00"]
[null,"",null,null,null,null,null,":30",null,null,null,null,null,null,null,null,null,null,null,null,null,null,null,null,"",null,null,null,null,null,":30"]
[null,"",null,null,null,null,9,":00",null,null,null,null,null,null,null,null,null,null,null,null,null,null,null,null,"",null,null,null,null,9,":00"]
[null,"",null,null,null,null,null,":30",null,null,null,null,null,null,null,null,null,null,null,null,null,null,null,null,"",null,null,null,null,null,":30"]
[null,"",null,null,null,null,10,":00",null,null,null,null,null,null,null,null,null,null,null,null,null,null,null,null,"",null,null,null,null,10,":00"]
[null,"",null,null,null,null,null,":30",null,null,null,null,null,null,null,null,null,null,null,null,null,null,null,null,"",null,null,null,null,null,":30"]
[null,"From",null,"Actions Carried Forward",null,null,11,":00",null,null,null,null,null,null,null,null,null,null,null,null,null,null,null,null,"From",null,"Actions Carried Forward",null,null,11,":00"]
[null,{"$f":"IFERROR(INDEX(arr_event,SMALL(IF(arr_eventdate=$E$3,ROW(arr_eventdate)),ROW()-ROW($B$13))),\"\")","v":""},null,null,null,null,null,":30",null,null,null,null,null,null,null,null,null,null,null,null,null,null,null,null,{"$f":"IFERROR(INDEX(arr_event,SMALL(IF(arr_eventdate=$E$3,ROW(arr_eventdate)),ROW()-ROW($B$13))),\"\")","v":""},null,null,null,null,null,":30"]
[null,{"$f":"IFERROR(INDEX(arr_event,SMALL(IF(arr_eventdate=$E$3,ROW(arr_eventdate)),ROW()-ROW($B$13))),\"\")","v":""},null,null,null,null,12,":00",null,null,null,null,null,null,null,null,null,null,null,null,null,null,null,null,{"$f":"IFERROR(INDEX(arr_event,SMALL(IF(arr_eventdate=$E$3,ROW(arr_eventdate)),ROW()-ROW($B$13))),\"\")","v":""},null,null,null,null,12,":00"]
[null,{"$f":"IFERROR(INDEX(arr_event,SMALL(IF(arr_eventdate=$E$3,ROW(arr_eventdate)),ROW()-ROW($B$13))),\"\")","v":""},null,null,null,null,null,":30",null,null,null,null,null,null,null,null,null,null,null,null,null,null,null,null,{"$f":"IFERROR(INDEX(arr_event,SMALL(IF(arr_eventdate=$E$3,ROW(arr_eventdate)),ROW()-ROW($B$13))),\"\")","v":""},null,null,null,null,null,":30"]
[null,{"$f":"IFERROR(INDEX(arr_event,SMALL(IF(arr_eventdate=$E$3,ROW(arr_eventdate)),ROW()-ROW($B$13))),\"\")","v":""},null,null,null,null,1,":00",null,null,null,null,null,null,null,null,null,null,null,null,null,null,null,null,{"$f":"IFERROR(INDEX(arr_event,SMALL(IF(arr_eventdate=$E$3,ROW(arr_eventdate)),ROW()-ROW($B$13))),\"\")","v":""},null,null,null,null,1,":00"]
[null,{"$f":"IFERROR(INDEX(arr_event,SMALL(IF(arr_eventdate=$E$3,ROW(arr_eventdate)),ROW()-ROW($B$13))),\"\")","v":""},null,null,null,null,null,":30",null,null,null,null,null,null,null,null,null,null,null,null,null,null,null,null,{"$f":"IFERROR(INDEX(arr_event,SMALL(IF(arr_eventdate=$E$3,ROW(arr_eventdate)),ROW()-ROW($B$13))),\"\")","v":""},null,null,null,null,null,":30"]
[null,{"$f":"IFERROR(INDEX(arr_event,SMALL(IF(arr_eventdate=$E$3,ROW(arr_eventdate)),ROW()-ROW($B$13))),\"\")","v":""},null,null,null,null,2,":00",null,null,null,null,null,null,null,null,null,null,null,null,null,null,null,null,{"$f":"IFERROR(INDEX(arr_event,SMALL(IF(arr_eventdate=$E$3,ROW(arr_eventdate)),ROW()-ROW($B$13))),\"\")","v":""},null,null,null,null,2,":00"]
[null,{"$f":"IFERROR(INDEX(arr_event,SMALL(IF(arr_eventdate=$E$3,ROW(arr_eventdate)),ROW()-ROW($B$13))),\"\")","v":""},null,null,null,null,null,":30",null,null,null,null,null,null,null,null,null,null,null,null,null,null,null,null,{"$f":"IFERROR(INDEX(arr_event,SMALL(IF(arr_eventdate=$E$3,ROW(arr_eventdate)),ROW()-ROW($B$13))),\"\")","v":""},null,null,null,null,null,":30"]
[null,{"$f":"IFERROR(INDEX(arr_event,SMALL(IF(arr_eventdate=$E$3,ROW(arr_eventdate)),ROW()-ROW($B$13))),\"\")","v":""},null,null,null,null,3,":00",null,null,null,null,null,null,null,null,null,null,null,null,null,null,null,null,{"$f":"IFERROR(INDEX(arr_event,SMALL(IF(arr_eventdate=$E$3,ROW(arr_eventdate)),ROW()-ROW($B$13))),\"\")","v":""},null,null,null,null,3,":00"]
[null,null,null,null,null,null,null,":30",null,null,null,null,null,null,null,null,null,null,null,null,null,null,null,null,null,null,null,null,null,null,":30"]
[null,"$Amt",null,"Expenses",null,null,4,":00",null,null,null,null,null,null,null,null,null,null,null,null,null,null,null,null,"$Amt",null,"Expenses",null,null,4,":00"]
[null,null,null,null,null,null,null,":30",null,null,null,null,null,null,null,null,null,null,null,null,null,null,null,null,null,null,null,null,null,null,":30"]
[null,null,null,null,null,null,5,":00",null,null,null,null,null,null,null,null,null,null,null,null,null,null,null,null,null,null,null,null,null,5,":00"]
[null,null,null,null,null,null,null,":30",null,null,null,null,null,null,null,null,null,null,null,null,null,null,null,null,null,null,null,null,null,null,":30"]
[null,null,null,null,null,null,6,":00",null,null,null,null,null,null,null,null,null,null,null,null,null,null,null,null,null,null,null,null,null,6,":00"]
[null,null,null,null,null,null,null,":30",null,null,null,null,null,null,null,null,null,null,null,null,null,null,null,null,null,null,null,null,null,null,":30"]
[]
[null,"Planned cases for today",null,null,null,null,null,":30",null,null,null,null,null,null,null,null,null,null,null,null,null,null,null,null,"Planned cases for today",null,null,null,null,null,":30"]
[null,"Case",null,null,null,"Action",null,null,null,null,null,null,null,null,null,null,null,null,null,"Follow-up",null,null,null,null,"Case",null,null,null,"Action",null,null,null,null,null,null,null,null,null,null,null,null,null,"Follow-up"]

{"sheet":"Days9-10","index":6,"n_rows":40,"n_cols":46,"rows_kept":40,"cut":false,"hidden":false,"merged":[[56,24,56,27],[56,28,56,41],[56,42,56,45],[57,24,57,27],[57,28,57,41],[57,42,57,45],[52,42,52,45],[53,24,53,27],[53,28,53,41],[53,42,53,45],[54,24,54,27],[54,28,54,41],[54,42,54,45],[55,24,55,27],[55,28,55,41],[55,42,55,45],[48,42,48,45],[49,24,49,27],[49,28,49,41],[49,42,49,45],[50,24,50,27],[50,28,50,41],[50,42,50,45],[51,24,51,27],[51,28,51,41],[51,42,51,45],[44,42,44,45],[45,24,45,27],[45,28,45,41],[45,42,45,45],[46,24,46,27],[46,28,46,41],[46,42,46,45],[47,24,47,27],[47,28,47,41],[47,42,47,45],[40,42,40,45],[41,24,41,27],[41,28,41,41],[41,42,41,45],[42,24,42,27],[42,28,42,41],[42,42,42,45],[43,24,43,27],[43,28,43,41],[43,42,43,45],[57,1,57,4],[57,5,57,18],[57,19,57,22],[58,1,58,4],[58,5,58,18],[58,19,58,22],[29,24,29,25],[31,24,31,25],[31,26,31,27],[32,24,32,25],[32,26,32,27],[33,24,33,25],[33,26,33,27],[34,24,34,25],[34,26,34,27],[35,24,35,25],[35,26,35,27],[36,24,36,25],[36,26,36,27],[38,24,38,45],[39,24,39,27],[39,28,39,41],[39,42,39,45],[40,24,40,27],[0,32,0,33],[2,1,5,3],[2,4,3,7],[2,8,2,14],[2,16,2,22],[2,24,5,26],[2,27,3,30],[2,31,2,37],[29,1,29,2],[13,6,14,6],[13,29,14,29],[15,6,16,6],[15,29,16,29],[17,6,18,6],[17,29,18,29],[2,39,2,45],[4,4,5,6],[4,27,5,29],[6,5,6,6],[6,28,6,29],[12,1,12,4],[12,16,12,22],[12,24,12,27],[12,39,12,45],[22,24,22,25],[22,26,22,27],[23,1,23,2],[23,3,23,4],[23,6,24,6],[23,24,23,25],[23,26,23,27],[19,6,20,6],[19,29,20,29],[21,1,21,2],[21,3,21,4],[21,6,22,6],[21,24,21,25],[21,26,21,27],[21,29,22,29],[22,1,22,2],[22,3,22,4],[23,29,24,29],[24,1,24,2],[24,3,24,4],[24,24,24,25],[24,26,24,27],[25,1,25,2],[25,3,25,4],[25,6,26,6],[25,24,25,25],[25,26,25,27],[25,29,26,29],[26,1,26,2],[26,3,26,4],[26,24,26,25],[26,26,26,27],[27,1,27,2],[27,3,27,4],[27,6,28,6],[27,24,27,25],[27,26,27,27],[27,29,28,29],[28,1,28,2],[28,3,28,4],[28,24,28,25],[28,26,28,27],[29,3,29,4],[29,6,30,6],[29,26,29,27],[29,29,30,29],[31,6,32,6],[31,29,32,29],[33,6,34,6],[33,29,34,29],[35,6,36,6],[35,29,36,29],[40,5,40,18],[40,19,40,22],[41,5,41,18],[41,19,41,22],[42,5,42,18],[42,19,42,22],[40,28,40,41],[42,1,42,4],[43,1,43,4],[43,5,43,18],[43,19,43,22],[44,24,44,27],[44,28,44,41],[31,1,31,2],[31,3,31,4],[40,1,40,4],[41,1,41,4],[44,1,44,4],[44,5,44,18],[44,19,44,22],[45,1,45,4],[45,5,45,18],[45,19,45,22],[46,1,46,4],[46,5,46,18],[46,19,46,22],[47,1,47,4],[47,5,47,18],[47,19,47,22],[32,1,32,2],[32,3,32,4],[33,1,33,2],[33,3,33,4],[48,1,48,4],[48,5,48,18],[48,19,48,22],[49,1,49,4],[49,5,49,18],[49,19,49,22],[50,1,50,4],[50,5,50,18],[50,19,50,22],[51,1,51,4],[51,5,51,18],[51,19,51,22],[48,24,48,27],[48,28,48,41],[34,1,34,2],[34,3,34,4],[35,1,35,2],[35,3,35,4],[52,1,52,4],[52,5,52,18],[52,19,52,22],[53,1,53,4],[53,5,53,18],[53,19,53,22],[52,24,52,27],[52,28,52,41],[39,1,39,4],[39,5,39,18],[39,19,39,22],[58,24,58,27],[58,28,58,41],[58,42,58,45],[36,1,36,2],[36,3,36,4],[38,1,38,22],[54,1,54,4],[54,5,54,18],[54,19,54,22],[55,1,55,4],[55,5,55,18],[55,19,55,22],[56,1,56,4],[56,5,56,18],[56,19,56,22],[61,1,61,4],[61,5,61,18],[61,19,61,22],[61,24,61,27],[61,28,61,41],[61,42,61,45],[59,1,59,4],[59,5,59,18],[59,19,59,22],[59,24,59,27],[59,28,59,41],[59,42,59,45],[62,1,62,4],[62,5,62,18],[62,19,62,22],[62,24,62,27],[62,28,62,41],[62,42,62,45]]}
[]
[]
[null,{"$f":"DAY(E3)","v":8},null,null,{"$f":"'Days7-8'!AB3+1","v":"2024-05-08"},null,null,null,{"$f":"DATE(YEAR($E$3),MONTH($E$3),1)","v":"2024-05-01"},null,null,null,null,null,null,null,{"$f":"DATE(YEAR(I3+35),MONTH(I3+35),1)","v":"2024-06-01"},null,null,null,null,null,null,null,{"$f":"DAY(AB3)","v":9},null,null,{"$f":"E3+1","v":"2024-05-09"},null,null,null,{"$f":"DATE(YEAR(AB3),MONTH(AB3),1)","v":"2024-05-01"},null,null,null,null,null,null,null,{"$f":"DATE(YEAR(AF3+35),MONTH(AF3+35),1)","v":"2024-06-01"}]
[null,null,null,null,null,null,null,null,{"$f":"CHOOSE(1+MOD('Days1-2'!J1+1-2,7),\"Su\",\"M\",\"Tu\",\"W\",\"Th\",\"F\",\"Sa\")","v":"Su"},{"$f":"CHOOSE(1+MOD('Days1-2'!$J$1+2-2,7),\"Su\",\"M\",\"Tu\",\"W\",\"Th\",\"F\",\"Sa\")","v":"M"},{"$f":"CHOOSE(1+MOD('Days1-2'!$J$1+3-2,7),\"Su\",\"M\",\"Tu\",\"W\",\"Th\",\"F\",\"Sa\")","v":"Tu"},{"$f":"CHOOSE(1+MOD('Days1-2'!$J$1+4-2,7),\"Su\",\"M\",\"Tu\",\"W\",\"Th\",\"F\",\"Sa\")","v":"W"},{"$f":"CHOOSE(1+MOD('Days1-2'!$J$1+5-2,7),\"Su\",\"M\",\"Tu\",\"W\",\"Th\",\"F\",\"Sa\")","v":"Th"},{"$f":"CHOOSE(1+MOD('Days1-2'!$J$1+6-2,7),\"Su\",\"M\",\"Tu\",\"W\",\"Th\",\"F\",\"Sa\")","v":"F"},{"$f":"CHOOSE(1+MOD('Days1-2'!$J$1+7-2,7),\"Su\",\"M\",\"Tu\",\"W\",\"Th\",\"F\",\"Sa\")","v":"Sa"},null,{"$f":"CHOOSE(1+MOD('Days1-2'!J1+1-2,7),\"Su\",\"M\",\"Tu\",\"W\",\"Th\",\"F\",\"Sa\")","v":"Su"},{"$f":"CHOOSE(1+MOD('Days1-2'!J1+2-2,7),\"Su\",\"M\",\"Tu\",\"W\",\"Th\",\"F\",\"Sa\")","v":"M"},{"$f":"CHOOSE(1+MOD('Days1-2'!J1+3-2,7),\"Su\",\"M\",\"Tu\",\"W\",\"Th\",\"F\",\"Sa\")","v":"Tu"},{"$f":"CHOOSE(1+MOD('Days1-2'!J1+4-2,7),\"Su\",\"M\",\"Tu\",\"W\",\"Th\",\"F\",\"Sa\")","v":"W"},{"$f":"CHOOSE(1+MOD('Days1-2'!J1+5-2,7),\"Su\",\"M\",\"Tu\",\"W\",\"Th\",\"F\",\"Sa\")","v":"Th"},{"$f":"CHOOSE(1+MOD('Days1-2'!J1+6-2,7),\"Su\",\"M\",\"Tu\",\"W\",\"Th\",\"F\",\"Sa\")","v":"F"},{"$f":"CHOOSE(1+MOD('Days1-2'!J1+7-2,7),\"Su\",\"M\",\"Tu\",\"W\",\"Th\",\"F\",\"Sa\")","v":"Sa"},null,null,null,null,null,null,null,null,{"$f":"CHOOSE(1+MOD('Days1-2'!$J$1+1-2,7),\"Su\",\"M\",\"Tu\",\"W\",\"Th\",\"F\",\"Sa\")","v":"Su"},{"$f":"CHOOSE(1+MOD('Days1-2'!$J$1+2-2,7),\"Su\",\"M\",\"Tu\",\"W\",\"Th\",\"F\",\"Sa\")","v":"M"},{"$f":"CHOOSE(1+MOD('Days1-2'!$J$1+3-2,7),\"Su\",\"M\",\"Tu\",\"W\",\"Th\",\"F\",\"Sa\")","v":"Tu"},{"$f":"CHOOSE(1+MOD('Days1-2'!$J$1+4-2,7),\"Su\",\"M\",\"Tu\",\"W\",\"Th\",\"F\",\"Sa\")","v":"W"},{"$f":"CHOOSE(1+MOD('Days1-2'!$J$1+5-2,7),\"Su\",\"M\",\"Tu\",\"W\",\"Th\",\"F\",\"Sa\")","v":"Th"},{"$f":"CHOOSE(1+MOD('Days1-2'!$J$1+6-2,7),\"Su\",\"M\",\"Tu\",\"W\",\"Th\",\"F\",\"Sa\")","v":"F"},{"$f":"CHOOSE(1+MOD('Days1-2'!$J$1+7-2,7),\"Su\",\"M\",\"Tu\",\"W\",\"Th\",\"F\",\"Sa\")","v":"Sa"},null,{"$f":"CHOOSE(1+MOD('Days1-2'!$J$1+1-2,7),\"Su\",\"M\",\"Tu\",\"W\",\"Th\",\"F\",\"Sa\")","v":"Su"},{"$f":"CHOOSE(1+MOD('Days1-2'!$J$1+2-2,7),\"Su\",\"M\",\"Tu\",\"W\",\"Th\",\"F\",\"Sa\")","v":"M"},{"$f":"CHOOSE(1+MOD('Days1-2'!$J$1+3-2,7),\"Su\",\"M\",\"Tu\",\"W\",\"Th\",\"F\",\"Sa\")","v":"Tu"},{"$f":"CHOOSE(1+MOD('Days1-2'!$J$1+4-2,7),\"Su\",\"M\",\"Tu\",\"W\",\"Th\",\"F\",\"Sa\")","v":"W"},{"$f":"CHOOSE(1+MOD('Days1-2'!$J$1+5-2,7),\"Su\",\"M\",\"Tu\",\"W\",\"Th\",\"F\",\"Sa\")","v":"Th"},{"$f":"CHOOSE(1+MOD('Days1-2'!$J$1+6-2,7),\"Su\",\"M\",\"Tu\",\"W\",\"Th\",\"F\",\"Sa\")","v":"F"},{"$f":"CHOOSE(1+MOD('Days1-2'!$J$1+7-2,7),\"Su\",\"M\",\"Tu\",\"W\",\"Th\",\"F\",\"Sa\")","v":"Sa"}]
[null,null,null,null,{"$f":"INDEX({\"Sunday\",\"Monday\",\"Tuesday\",\"Wednesday\",\"Thursday\",\"Friday\",\"Saturday\"},WEEKDAY(E3))","v":"Wednesday"},null,null,null,{"$f":"IF(WEEKDAY(I3,1)='Days1-2'!$J$1,I3,\"\")","v":""},{"$f":"IF(I5=\"\",IF(WEEKDAY(I3,1)=MOD('Days1-2'!$J$1,7)+1,I3,\"\"),I5+1)","v":""},{"$f":"IF(J5=\"\",IF(WEEKDAY(I3,1)=MOD('Days1-2'!$J$1+1,7)+1,I3,\"\"),J5+1)","v":""},{"$f":"IF(K5=\"\",IF(WEEKDAY(I3,1)=MOD('Days1-2'!$J$1+2,7)+1,I3,\"\"),K5+1)","v":"2024-05-01"},{"$f":"IF(L5=\"\",IF(WEEKDAY(I3,1)=MOD('Days1-2'!$J$1+3,7)+1,I3,\"\"),L5+1)","v":"2024-05-02"},{"$f":"IF(M5=\"\",IF(WEEKDAY(I3,1)=MOD('Days1-2'!$J$1+4,7)+1,I3,\"\"),M5+1)","v":"2024-05-03"},{"$f":"IF(N5=\"\",IF(WEEKDAY(I3,1)=MOD('Days1-2'!$J$1+5,7)+1,I3,\"\"),N5+1)","v":"2024-05-04"},null,{"$f":"IF(WEEKDAY(Q3,1)='Days1-2'!$J$1,Q3,\"\")","v":""},{"$f":"IF(Q5=\"\",IF(WEEKDAY(Q3,1)=MOD('Days1-2'!$J$1,7)+1,Q3,\"\"),Q5+1)","v":""},{"$f":"IF(R5=\"\",IF(WEEKDAY(Q3,1)=MOD('Days1-2'!$J$1+1,7)+1,Q3,\"\"),R5+1)","v":""},{"$f":"IF(S5=\"\",IF(WEEKDAY(Q3,1)=MOD('Days1-2'!$J$1+2,7)+1,Q3,\"\"),S5+1)","v":""},{"$f":"IF(T5=\"\",IF(WEEKDAY(Q3,1)=MOD('Days1-2'!$J$1+3,7)+1,Q3,\"\"),T5+1)","v":""},{"$f":"IF(U5=\"\",IF(WEEKDAY(Q3,1)=MOD('Days1-2'!$J$1+4,7)+1,Q3,\"\"),U5+1)","v":""},{"$f":"IF(V5=\"\",IF(WEEKDAY(Q3,1)=MOD('Days1-2'!$J$1+5,7)+1,Q3,\"\"),V5+1)","v":"2024-06-01"},null,null,null,null,{"$f":"INDEX({\"Sunday\",\"Monday\",\"Tuesday\",\"Wednesday\",\"Thursday\",\"Friday\",\"Saturday\"},WEEKDAY(AB3))","v":"Thursday"},null,null,null,{"$f":"IF(WEEKDAY(AF3,1)='Days1-2'!$J$1,AF3,\"\")","v":""},{"$f":"IF(AF5=\"\",IF(WEEKDAY(AF3,1)=MOD('Days1-2'!$J$1,7)+1,AF3,\"\"),AF5+1)","v":""},{"$f":"IF(AG5=\"\",IF(WEEKDAY(AF3,1)=MOD('Days1-2'!$J$1+1,7)+1,AF3,\"\"),AG5+1)","v":""},{"$f":"IF(AH5=\"\",IF(WEEKDAY(AF3,1)=MOD('Days1-2'!$J$1+2,7)+1,AF3,\"\"),AH5+1)","v":"2024-05-01"},{"$f":"IF(AI5=\"\",IF(WEEKDAY(AF3,1)=MOD('Days1-2'!$J$1+3,7)+1,AF3,\"\"),AI5+1)","v":"2024-05-02"},{"$f":"IF(AJ5=\"\",IF(WEEKDAY(AF3,1)=MOD('Days1-2'!$J$1+4,7)+1,AF3,\"\"),AJ5+1)","v":"2024-05-03"},{"$f":"IF(AK5=\"\",IF(WEEKDAY(AF3,1)=MOD('Days1-2'!$J$1+5,7)+1,AF3,\"\"),AK5+1)","v":"2024-05-04"},null,{"$f":"IF(WEEKDAY(AN3,1)='Days1-2'!$J$1,AN3,\"\")","v":""},{"$f":"IF(AN5=\"\",IF(WEEKDAY(AN3,1)=MOD('Days1-2'!$J$1,7)+1,AN3,\"\"),AN5+1)","v":""},{"$f":"IF(AO5=\"\",IF(WEEKDAY(AN3,1)=MOD('Days1-2'!$J$1+1,7)+1,AN3,\"\"),AO5+1)","v":""},{"$f":"IF(AP5=\"\",IF(WEEKDAY(AN3,1)=MOD('Days1-2'!$J$1+2,7)+1,AN3,\"\"),AP5+1)","v":""},{"$f":"IF(AQ5=\"\",IF(WEEKDAY(AN3,1)=MOD('Days1-2'!$J$1+3,7)+1,AN3,\"\"),AQ5+1)","v":""},{"$f":"IF(AR5=\"\",IF(WEEKDAY(AN3,1)=MOD('Days1-2'!$J$1+4,7)+1,AN3,\"\"),AR5+1)","v":""},{"$f":"IF(AS5=\"\",IF(WEEKDAY(AN3,1)=MOD('Days1-2'!$J$1+5,7)+1,AN3,\"\"),AS5+1)","v":"2024-06-01"}]
[null,null,null,null,null,null,null,null,{"$f":"IF(O5=\"\",\"\",IF(MONTH(O5+1)<>MONTH(O5),\"\",O5+1))","v":"2024-05-05"},{"$f":"IF(I6=\"\",\"\",IF(MONTH(I6+1)<>MONTH(I6),\"\",I6+1))","v":"2024-05-06"},{"$f":"IF(J6=\"\",\"\",IF(MONTH(J6+1)<>MONTH(J6),\"\",J6+1))","v":"2024-05-07"},{"$f":"IF(K6=\"\",\"\",IF(MONTH(K6+1)<>MONTH(K6),\"\",K6+1))","v":"2024-05-08"},"2024-05-09","2024-05-10","2024-05-11",null,{"$f":"IF(W5=\"\",\"\",IF(MONTH(W5+1)<>MONTH(W5),\"\",W5+1))","v":"2024-06-02"},{"$f":"IF(Q6=\"\",\"\",IF(MONTH(Q6+1)<>MONTH(Q6),\"\",Q6+1))","v":"2024-06-03"},{"$f":"IF(R6=\"\",\"\",IF(MONTH(R6+1)<>MONTH(R6),\"\",R6+1))","v":"2024-06-04"},{"$f":"IF(S6=\"\",\"\",IF(MONTH(S6+1)<>MONTH(S6),\"\",S6+1))","v":"2024-06-05"},{"$f":"IF(T6=\"\",\"\",IF(MONTH(T6+1)<>MONTH(T6),\"\",T6+1))","v":"2024-06-06"},"2024-06-07","2024-06-08",null,null,null,null,null,null,null,null,{"$f":"IF(AL5=\"\",\"\",IF(MONTH(AL5+1)<>MONTH(AL5),\"\",AL5+1))","v":"2024-05-05"},{"$f":"IF(AF6=\"\",\"\",IF(MONTH(AF6+1)<>MONTH(AF6),\"\",AF6+1))","v":"2024-05-06"},{"$f":"IF(AG6=\"\",\"\",IF(MONTH(AG6+1)<>MONTH(AG6),\"\",AG6+1))","v":"2024-05-07"},{"$f":"IF(AH6=\"\",\"\",IF(MONTH(AH6+1)<>MONTH(AH6),\"\",AH6+1))","v":"2024-05-08"},{"$f":"IF(AI6=\"\",\"\",IF(MONTH(AI6+1)<>MONTH(AI6),\"\",AI6+1))","v":"2024-05-09"},"2024-05-10","2024-05-11",null,{"$f":"IF(AT5=\"\",\"\",IF(MONTH(AT5+1)<>MONTH(AT5),\"\",AT5+1))","v":"2024-06-02"},{"$f":"IF(AN6=\"\",\"\",IF(MONTH(AN6+1)<>MONTH(AN6),\"\",AN6+1))","v":"2024-06-03"},{"$f":"IF(AO6=\"\",\"\",IF(MONTH(AO6+1)<>MONTH(AO6),\"\",AO6+1))","v":"2024-06-04"},{"$f":"IF(AP6=\"\",\"\",IF(MONTH(AP6+1)<>MONTH(AP6),\"\",AP6+1))","v":"2024-06-05"},{"$f":"IF(AQ6=\"\",\"\",IF(MONTH(AQ6+1)<>MONTH(AQ6),\"\",AQ6+1))","v":"2024-06-06"},"2024-06-07","2024-06-08"]
[null,{"$f":"IFERROR(INDEX(arr_holiday,SMALL(IF(arr_holidaydate=$E$3,ROW(arr_holidaydate)),ROW()-ROW($B$6))),\"\")","v":""},null,null,null,null,null,null,{"$f":"IF(O6=\"\",\"\",IF(MONTH(O6+1)<>MONTH(O6),\"\",O6+1))","v":"2024-05-12"},{"$f":"IF(I7=\"\",\"\",IF(MONTH(I7+1)<>MONTH(I7),\"\",I7+1))","v":"2024-05-13"},"2024-05-14","2024-05-15","2024-05-16","2024-05-17","2024-05-18",null,{"$f":"IF(W6=\"\",\"\",IF(MONTH(W6+1)<>MONTH(W6),\"\",W6+1))","v":"2024-06-09"},{"$f":"IF(Q7=\"\",\"\",IF(MONTH(Q7+1)<>MONTH(Q7),\"\",Q7+1))","v":"2024-06-10"},"2024-06-11","2024-06-12","2024-06-13","2024-06-14","2024-06-15",null,{"$f":"IFERROR(INDEX(arr_holiday,SMALL(IF(arr_holidaydate=$AB$3,ROW(arr_holidaydate)),ROW()-ROW($B$6))),\"\")","v":""},null,null,null,null,null,null,{"$f":"IF(AL6=\"\",\"\",IF(MONTH(AL6+1)<>MONTH(AL6),\"\",AL6+1))","v":"2024-05-12"},{"$f":"IF(AF7=\"\",\"\",IF(MONTH(AF7+1)<>MONTH(AF7),\"\",AF7+1))","v":"2024-05-13"},"2024-05-14","2024-05-15","2024-05-16","2024-05-17","2024-05-18",null,{"$f":"IF(AT6=\"\",\"\",IF(MONTH(AT6+1)<>MONTH(AT6),\"\",AT6+1))","v":"2024-06-09"},{"$f":"IF(AN7=\"\",\"\",IF(MONTH(AN7+1)<>MONTH(AN7),\"\",AN7+1))","v":"2024-06-10"},"2024-06-11","2024-06-12","2024-06-13","2024-06-14","2024-06-15"]
[null,{"$f":"IFERROR(INDEX(arr_holiday,SMALL(IF(arr_holidaydate=$E$3,ROW(arr_holidaydate)),ROW()-ROW($B$6))),\"\")","v":""},null,null,null,null,null,null,"2024-05-19","2024-05-20","2024-05-21","2024-05-22","2024-05-23","2024-05-24","2024-05-25",null,"2024-06-16","2024-06-17","2024-06-18","2024-06-19","2024-06-20","2024-06-21","2024-06-22",null,{"$f":"IFERROR(INDEX(arr_holiday,SMALL(IF(arr_holidaydate=$AB$3,ROW(arr_holidaydate)),ROW()-ROW($B$6))),\"\")","v":""},null,null,null,null,null,null,"2024-05-19","2024-05-20","2024-05-21","2024-05-22","2024-05-23","2024-05-24","2024-05-25",null,"2024-06-16","2024-06-17","2024-06-18","2024-06-19","2024-06-20","2024-06-21","2024-06-22"]
[null,{"$f":"IFERROR(INDEX(arr_holiday,SMALL(IF(arr_holidaydate=$E$3,ROW(arr_holidaydate)),ROW()-ROW($B$6))),\"\")","v":""},null,null,null,null,null,null,"2024-05-26","2024-05-27","2024-05-28","2024-05-29","2024-05-30","2024-05-31","",null,"2024-06-23","2024-06-24","2024-06-25","2024-06-26","2024-06-27","2024-06-28","2024-06-29",null,{"$f":"IFERROR(INDEX(arr_holiday,SMALL(IF(arr_holidaydate=$AB$3,ROW(arr_holidaydate)),ROW()-ROW($B$6))),\"\")","v":""},null,null,null,null,null,null,"2024-05-26","2024-05-27","2024-05-28","2024-05-29","2024-05-30","2024-05-31","",null,"2024-06-23","2024-06-24","2024-06-25","2024-06-26","2024-06-27","2024-06-28","2024-06-29"]
[null,{"$f":"IFERROR(INDEX(arr_event,SMALL(IF(arr_eventdate=$E$3,ROW(arr_eventdate)),ROW()-ROW($B$9))),\"\")","v":""},null,null,null,null,null,null,"","","","","","","",null,"2024-06-30","","","","","","",null,{"$f":"IFERROR(INDEX(arr_event,SMALL(IF(arr_eventdate=$AB$3,ROW(arr_eventdate)),ROW()-ROW($B$9))),\"\")","v":""},null,null,null,null,null,null,"","","","","","","",null,"2024-06-30","","","","","",""]
[null,{"$f":"IFERROR(INDEX(arr_event,SMALL(IF(arr_eventdate=$E$3,ROW(arr_eventdate)),ROW()-ROW($B$9))),\"\")","v":""},null,null,null,null,null,null,null,null,null,null,null,null,null,null,null,null,null,null,null,null,null,null,{"$f":"IFERROR(INDEX(arr_event,SMALL(IF(arr_eventdate=$AB$3,ROW(arr_eventdate)),ROW()-ROW($B$9))),\"\")","v":""}]
[null,{"$f":"IFERROR(INDEX(arr_event,SMALL(IF(arr_eventdate=$E$3,ROW(arr_eventdate)),ROW()-ROW($B$9))),\"\")","v":""},null,null,null,null,null,null,null,null,null,null,null,null,null,null,null,null,null,null,null,null,null,null,{"$f":"IFERROR(INDEX(arr_event,SMALL(IF(arr_eventdate=$AB$3,ROW(arr_eventdate)),ROW()-ROW($B$9))),\"\")","v":""}]
[null,"Reminders",null,null,null,null,null,null,"Appointments",null,null,null,null,null,null,null,"Notes",null,null,null,null,null,null,null,"Reminders",null,null,null,null,null,null,"Appointments",null,null,null,null,null,null,null,"Notes"]
[null,{"$f":"IFERROR(INDEX(arr_event,SMALL(IF(arr_eventdate=$E$3,ROW(arr_eventdate)),ROW()-ROW($B$13))),\"\")","v":""},null,null,null,null,7,":00",null,null,null,null,null,null,null,null,null,null,null,null,null,null,null,null,{"$f":"IFERROR(INDEX(arr_event,SMALL(IF(arr_eventdate=$E$3,ROW(arr_eventdate)),ROW()-ROW($B$13))),\"\")","v":""},null,null,null,null,7,":00"]
[null,"",null,null,null,null,null,":30",null,null,null,null,null,null,null,null,null,null,null,null,null,null,null,null,"",null,null,null,null,null,":30"]
[null,"",null,null,null,null,8,":00",null,null,null,null,null,null,null,null,null,null,null,null,null,null,null,null,"",null,null,null,null,8,":00"]
[null,"",null,null,null,null,null,":30",null,null,null,null,null,null,null,null,null,null,null,null,null,null,null,null,"",null,null,null,null,null,":30"]
[null,"",null,null,null,null,9,":00",null,null,null,null,null,null,null,null,null,null,null,null,null,null,null,null,"",null,null,null,null,9,":00"]
[null,"",null,null,null,null,null,":30",null,null,null,null,null,null,null,null,null,null,null,null,null,null,null,null,"",null,null,null,null,null,":30"]
[null,"",null,null,null,null,10,":00",null,null,null,null,null,null,null,null,null,null,null,null,null,null,null,null,"",null,null,null,null,10,":00"]
[null,"",null,null,null,null,null,":30",null,null,null,null,null,null,null,null,null,null,null,null,null,null,null,null,"",null,null,null,null,null,":30"]
[null,"From",null,"Actions Carried Forward",null,null,11,":00",null,null,null,null,null,null,null,null,null,null,null,null,null,null,null,null,"From",null,"Actions Carried Forward",null,null,11,":00"]
[null,{"$f":"IFERROR(INDEX(arr_event,SMALL(IF(arr_eventdate=$E$3,ROW(arr_eventdate)),ROW()-ROW($B$13))),\"\")","v":""},null,null,null,null,null,":30",null,null,null,null,null,null,null,null,null,null,null,null,null,null,null,null,{"$f":"IFERROR(INDEX(arr_event,SMALL(IF(arr_eventdate=$E$3,ROW(arr_eventdate)),ROW()-ROW($B$13))),\"\")","v":""},null,null,null,null,null,":30"]
[null,{"$f":"IFERROR(INDEX(arr_event,SMALL(IF(arr_eventdate=$E$3,ROW(arr_eventdate)),ROW()-ROW($B$13))),\"\")","v":""},null,null,null,null,12,":00",null,null,null,null,null,null,null,null,null,null,null,null,null,null,null,null,{"$f":"IFERROR(INDEX(arr_event,SMALL(IF(arr_eventdate=$E$3,ROW(arr_eventdate)),ROW()-ROW($B$13))),\"\")","v":""},null,null,null,null,12,":00"]
[null,{"$f":"IFERROR(INDEX(arr_event,SMALL(IF(arr_eventdate=$E$3,ROW(arr_eventdate)),ROW()-ROW($B$13))),\"\")","v":""},null,null,null,null,null,":30",null,null,null,null,null,null,null,null,null,null,null,null,null,null,null,null,{"$f":"IFERROR(INDEX(arr_event,SMALL(IF(arr_eventdate=$E$3,ROW(arr_eventdate)),ROW()-ROW($B$13))),\"\")","v":""},null,null,null,null,null,":30"]
[null,{"$f":"IFERROR(INDEX(arr_event,SMALL(IF(arr_eventdate=$E$3,ROW(arr_eventdate)),ROW()-ROW($B$13))),\"\")","v":""},null,null,null,null,1,":00",null,null,null,null,null,null,null,null,null,null,null,null,null,null,null,null,{"$f":"IFERROR(INDEX(arr_event,SMALL(IF(arr_eventdate=$E$3,ROW(arr_eventdate)),ROW()-ROW($B$13))),\"\")","v":""},null,null,null,null,1,":00"]
[null,{"$f":"IFERROR(INDEX(arr_event,SMALL(IF(arr_eventdate=$E$3,ROW(arr_eventdate)),ROW()-ROW($B$13))),\"\")","v":""},null,null,null,null,null,":30",null,null,null,null,null,null,null,null,null,null,null,null,null,null,null,null,{"$f":"IFERROR(INDEX(arr_event,SMALL(IF(arr_eventdate=$E$3,ROW(arr_eventdate)),ROW()-ROW($B$13))),\"\")","v":""},null,null,null,null,null,":30"]
[null,{"$f":"IFERROR(INDEX(arr_event,SMALL(IF(arr_eventdate=$E$3,ROW(arr_eventdate)),ROW()-ROW($B$13))),\"\")","v":""},null,null,null,null,2,":00",null,null,null,null,null,null,null,null,null,null,null,null,null,null,null,null,{"$f":"IFERROR(INDEX(arr_event,SMALL(IF(arr_eventdate=$E$3,ROW(arr_eventdate)),ROW()-ROW($B$13))),\"\")","v":""},null,null,null,null,2,":00"]
[null,{"$f":"IFERROR(INDEX(arr_event,SMALL(IF(arr_eventdate=$E$3,ROW(arr_eventdate)),ROW()-ROW($B$13))),\"\")","v":""},null,null,null,null,null,":30",null,null,null,null,null,null,null,null,null,null,null,null,null,null,null,null,{"$f":"IFERROR(INDEX(arr_event,SMALL(IF(arr_eventdate=$E$3,ROW(arr_eventdate)),ROW()-ROW($B$13))),\"\")","v":""},null,null,null,null,null,":30"]
[null,{"$f":"IFERROR(INDEX(arr_event,SMALL(IF(arr_eventdate=$E$3,ROW(arr_eventdate)),ROW()-ROW($B$13))),\"\")","v":""},null,null,null,null,3,":00",null,null,null,null,null,null,null,null,null,null,null,null,null,null,null,null,{"$f":"IFERROR(INDEX(arr_event,SMALL(IF(arr_eventdate=$E$3,ROW(arr_eventdate)),ROW()-ROW($B$13))),\"\")","v":""},null,null,null,null,3,":00"]
[null,null,null,null,null,null,null,":30",null,null,null,null,null,null,null,null,null,null,null,null,null,null,null,null,null,null,null,null,null,null,":30"]
[null,"$Amt",null,"Expenses",null,null,4,":00",null,null,null,null,null,null,null,null,null,null,null,null,null,null,null,null,"$Amt",null,"Expenses",null,null,4,":00"]
[null,null,null,null,null,null,null,":30",null,null,null,null,null,null,null,null,null,null,null,null,null,null,null,null,null,null,null,null,null,null,":30"]
[null,null,null,null,null,null,5,":00",null,null,null,null,null,null,null,null,null,null,null,null,null,null,null,null,null,null,null,null,null,5,":00"]
[null,null,null,null,null,null,null,":30",null,null,null,null,null,null,null,null,null,null,null,null,null,null,null,null,null,null,null,null,null,null,":30"]
[null,null,null,null,null,null,6,":00",null,null,null,null,null,null,null,null,null,null,null,null,null,null,null,null,null,null,null,null,null,6,":00"]
[null,null,null,null,null,null,null,":30",null,null,null,null,null,null,null,null,null,null,null,null,null,null,null,null,null,null,null,null,null,null,":30"]
[]
[null,"Planned cases for today",null,null,null,null,null,":30",null,null,null,null,null,null,null,null,null,null,null,null,null,null,null,null,"Planned cases for today",null,null,null,null,null,":30"]
[null,"Case",null,null,null,"Action",null,null,null,null,null,null,null,null,null,null,null,null,null,"Follow-up",null,null,null,null,"Case",null,null,null,"Action",null,null,null,null,null,null,null,null,null,null,null,null,null,"Follow-up"]

{"sheet":"Days11-12","index":7,"n_rows":40,"n_cols":46,"rows_kept":40,"cut":false,"hidden":false,"merged":[[56,24,56,27],[56,28,56,41],[56,42,56,45],[57,24,57,27],[57,28,57,41],[57,42,57,45],[52,42,52,45],[53,24,53,27],[53,28,53,41],[53,42,53,45],[54,24,54,27],[54,28,54,41],[54,42,54,45],[55,24,55,27],[55,28,55,41],[55,42,55,45],[48,42,48,45],[49,24,49,27],[49,28,49,41],[49,42,49,45],[50,24,50,27],[50,28,50,41],[50,42,50,45],[51,24,51,27],[51,28,51,41],[51,42,51,45],[44,42,44,45],[45,24,45,27],[45,28,45,41],[45,42,45,45],[46,24,46,27],[46,28,46,41],[46,42,46,45],[47,24,47,27],[47,28,47,41],[47,42,47,45],[40,42,40,45],[41,24,41,27],[41,28,41,41],[41,42,41,45],[42,24,42,27],[42,28,42,41],[42,42,42,45],[43,24,43,27],[43,28,43,41],[43,42,43,45],[57,1,57,4],[57,5,57,18],[57,19,57,22],[58,1,58,4],[58,5,58,18],[58,19,58,22],[29,24,29,25],[31,24,31,25],[31,26,31,27],[32,24,32,25],[32,26,32,27],[33,24,33,25],[33,26,33,27],[34,24,34,25],[34,26,34,27],[35,24,35,25],[35,26,35,27],[36,24,36,25],[36,26,36,27],[38,24,38,45],[39,24,39,27],[39,28,39,41],[39,42,39,45],[40,24,40,27],[0,32,0,33],[2,1,5,3],[2,4,3,7],[2,8,2,14],[2,16,2,22],[2,24,5,26],[2,27,3,30],[2,31,2,37],[29,1,29,2],[13,6,14,6],[13,29,14,29],[15,6,16,6],[15,29,16,29],[17,6,18,6],[17,29,18,29],[2,39,2,45],[4,4,5,6],[4,27,5,29],[6,5,6,6],[6,28,6,29],[12,1,12,4],[12,16,12,22],[12,24,12,27],[12,39,12,45],[22,24,22,25],[22,26,22,27],[23,1,23,2],[23,3,23,4],[23,6,24,6],[23,24,23,25],[23,26,23,27],[19,6,20,6],[19,29,20,29],[21,1,21,2],[21,3,21,4],[21,6,22,6],[21,24,21,25],[21,26,21,27],[21,29,22,29],[22,1,22,2],[22,3,22,4],[23,29,24,29],[24,1,24,2],[24,3,24,4],[24,24,24,25],[24,26,24,27],[25,1,25,2],[25,3,25,4],[25,6,26,6],[25,24,25,25],[25,26,25,27],[25,29,26,29],[26,1,26,2],[26,3,26,4],[26,24,26,25],[26,26,26,27],[27,1,27,2],[27,3,27,4],[27,6,28,6],[27,24,27,25],[27,26,27,27],[27,29,28,29],[28,1,28,2],[28,3,28,4],[28,24,28,25],[28,26,28,27],[29,3,29,4],[29,6,30,6],[29,26,29,27],[29,29,30,29],[31,6,32,6],[31,29,32,29],[33,6,34,6],[33,29,34,29],[35,6,36,6],[35,29,36,29],[40,5,40,18],[40,19,40,22],[41,5,41,18],[41,19,41,22],[42,5,42,18],[42,19,42,22],[40,28,40,41],[42,1,42,4],[43,1,43,4],[43,5,43,18],[43,19,43,22],[44,24,44,27],[44,28,44,41],[31,1,31,2],[31,3,31,4],[40,1,40,4],[41,1,41,4],[44,1,44,4],[44,5,44,18],[44,19,44,22],[45,1,45,4],[45,5,45,18],[45,19,45,22],[46,1,46,4],[46,5,46,18],[46,19,46,22],[47,1,47,4],[47,5,47,18],[47,19,47,22],[32,1,32,2],[32,3,32,4],[33,1,33,2],[33,3,33,4],[48,1,48,4],[48,5,48,18],[48,19,48,22],[49,1,49,4],[49,5,49,18],[49,19,49,22],[50,1,50,4],[50,5,50,18],[50,19,50,22],[51,1,51,4],[51,5,51,18],[51,19,51,22],[48,24,48,27],[48,28,48,41],[34,1,34,2],[34,3,34,4],[35,1,35,2],[35,3,35,4],[52,1,52,4],[52,5,52,18],[52,19,52,22],[53,1,53,4],[53,5,53,18],[53,19,53,22],[52,24,52,27],[52,28,52,41],[39,1,39,4],[39,5,39,18],[39,19,39,22],[58,24,58,27],[58,28,58,41],[58,42,58,45],[36,1,36,2],[36,3,36,4],[38,1,38,22],[54,1,54,4],[54,5,54,18],[54,19,54,22],[55,1,55,4],[55,5,55,18],[55,19,55,22],[56,1,56,4],[56,5,56,18],[56,19,56,22],[61,1,61,4],[61,5,61,18],[61,19,61,22],[61,24,61,27],[61,28,61,41],[61,42,61,45],[59,1,59,4],[59,5,59,18],[59,19,59,22],[59,24,59,27],[59,28,59,41],[59,42,59,45],[62,1,62,4],[62,5,62,18],[62,19,62,22],[62,24,62,27],[62,28,62,41],[62,42,62,45]]}
[]
[null,null,null,null,"P"]
[null,{"$f":"DAY(E3)","v":10},null,null,{"$f":"'Days9-10'!AB3+1","v":"2024-05-10"},null,null,null,{"$f":"DATE(YEAR($E$3),MONTH($E$3),1)","v":"2024-05-01"},null,null,null,null,null,null,null,{"$f":"DATE(YEAR(I3+35),MONTH(I3+35),1)","v":"2024-06-01"},null,null,null,null,null,null,null,{"$f":"DAY(AB3)","v":11},null,null,{"$f":"E3+1","v":"2024-05-11"},null,null,null,{"$f":"DATE(YEAR(AB3),MONTH(AB3),1)","v":"2024-05-01"},null,null,null,null,null,null,null,{"$f":"DATE(YEAR(AF3+35),MONTH(AF3+35),1)","v":"2024-06-01"}]
[null,null,null,null,null,null,null,null,{"$f":"CHOOSE(1+MOD('Days1-2'!J1+1-2,7),\"Su\",\"M\",\"Tu\",\"W\",\"Th\",\"F\",\"Sa\")","v":"Su"},{"$f":"CHOOSE(1+MOD('Days1-2'!$J$1+2-2,7),\"Su\",\"M\",\"Tu\",\"W\",\"Th\",\"F\",\"Sa\")","v":"M"},{"$f":"CHOOSE(1+MOD('Days1-2'!$J$1+3-2,7),\"Su\",\"M\",\"Tu\",\"W\",\"Th\",\"F\",\"Sa\")","v":"Tu"},{"$f":"CHOOSE(1+MOD('Days1-2'!$J$1+4-2,7),\"Su\",\"M\",\"Tu\",\"W\",\"Th\",\"F\",\"Sa\")","v":"W"},{"$f":"CHOOSE(1+MOD('Days1-2'!$J$1+5-2,7),\"Su\",\"M\",\"Tu\",\"W\",\"Th\",\"F\",\"Sa\")","v":"Th"},{"$f":"CHOOSE(1+MOD('Days1-2'!$J$1+6-2,7),\"Su\",\"M\",\"Tu\",\"W\",\"Th\",\"F\",\"Sa\")","v":"F"},{"$f":"CHOOSE(1+MOD('Days1-2'!$J$1+7-2,7),\"Su\",\"M\",\"Tu\",\"W\",\"Th\",\"F\",\"Sa\")","v":"Sa"},null,{"$f":"CHOOSE(1+MOD('Days1-2'!J1+1-2,7),\"Su\",\"M\",\"Tu\",\"W\",\"Th\",\"F\",\"Sa\")","v":"Su"},{"$f":"CHOOSE(1+MOD('Days1-2'!J1+2-2,7),\"Su\",\"M\",\"Tu\",\"W\",\"Th\",\"F\",\"Sa\")","v":"M"},{"$f":"CHOOSE(1+MOD('Days1-2'!J1+3-2,7),\"Su\",\"M\",\"Tu\",\"W\",\"Th\",\"F\",\"Sa\")","v":"Tu"},{"$f":"CHOOSE(1+MOD('Days1-2'!J1+4-2,7),\"Su\",\"M\",\"Tu\",\"W\",\"Th\",\"F\",\"Sa\")","v":"W"},{"$f":"CHOOSE(1+MOD('Days1-2'!J1+5-2,7),\"Su\",\"M\",\"Tu\",\"W\",\"Th\",\"F\",\"Sa\")","v":"Th"},{"$f":"CHOOSE(1+MOD('Days1-2'!J1+6-2,7),\"Su\",\"M\",\"Tu\",\"W\",\"Th\",\"F\",\"Sa\")","v":"F"},{"$f":"CHOOSE(1+MOD('Days1-2'!J1+7-2,7),\"Su\",\"M\",\"Tu\",\"W\",\"Th\",\"F\",\"Sa\")","v":"Sa"},null,null,null,null,null,null,null,null,{"$f":"CHOOSE(1+MOD('Days1-2'!$J$1+1-2,7),\"Su\",\"M\",\"Tu\",\"W\",\"Th\",\"F\",\"Sa\")","v":"Su"},{"$f":"CHOOSE(1+MOD('Days1-2'!$J$1+2-2,7),\"Su\",\"M\",\"Tu\",\"W\",\"Th\",\"F\",\"Sa\")","v":"M"},{"$f":"CHOOSE(1+MOD('Days1-2'!$J$1+3-2,7),\"Su\",\"M\",\"Tu\",\"W\",\"Th\",\"F\",\"Sa\")","v":"Tu"},{"$f":"CHOOSE(1+MOD('Days1-2'!$J$1+4-2,7),\"Su\",\"M\",\"Tu\",\"W\",\"Th\",\"F\",\"Sa\")","v":"W"},{"$f":"CHOOSE(1+MOD('Days1-2'!$J$1+5-2,7),\"Su\",\"M\",\"Tu\",\"W\",\"Th\",\"F\",\"Sa\")","v":"Th"},{"$f":"CHOOSE(1+MOD('Days1-2'!$J$1+6-2,7),\"Su\",\"M\",\"Tu\",\"W\",\"Th\",\"F\",\"Sa\")","v":"F"},{"$f":"CHOOSE(1+MOD('Days1-2'!$J$1+7-2,7),\"Su\",\"M\",\"Tu\",\"W\",\"Th\",\"F\",\"Sa\")","v":"Sa"},null,{"$f":"CHOOSE(1+MOD('Days1-2'!$J$1+1-2,7),\"Su\",\"M\",\"Tu\",\"W\",\"Th\",\"F\",\"Sa\")","v":"Su"},{"$f":"CHOOSE(1+MOD('Days1-2'!$J$1+2-2,7),\"Su\",\"M\",\"Tu\",\"W\",\"Th\",\"F\",\"Sa\")","v":"M"},{"$f":"CHOOSE(1+MOD('Days1-2'!$J$1+3-2,7),\"Su\",\"M\",\"Tu\",\"W\",\"Th\",\"F\",\"Sa\")","v":"Tu"},{"$f":"CHOOSE(1+MOD('Days1-2'!$J$1+4-2,7),\"Su\",\"M\",\"Tu\",\"W\",\"Th\",\"F\",\"Sa\")","v":"W"},{"$f":"CHOOSE(1+MOD('Days1-2'!$J$1+5-2,7),\"Su\",\"M\",\"Tu\",\"W\",\"Th\",\"F\",\"Sa\")","v":"Th"},{"$f":"CHOOSE(1+MOD('Days1-2'!$J$1+6-2,7),\"Su\",\"M\",\"Tu\",\"W\",\"Th\",\"F\",\"Sa\")","v":"F"},{"$f":"CHOOSE(1+MOD('Days1-2'!$J$1+7-2,7),\"Su\",\"M\",\"Tu\",\"W\",\"Th\",\"F\",\"Sa\")","v":"Sa"}]
[null,null,null,null,{"$f":"INDEX({\"Sunday\",\"Monday\",\"Tuesday\",\"Wednesday\",\"Thursday\",\"Friday\",\"Saturday\"},WEEKDAY(E3))","v":"Friday"},null,null,null,{"$f":"IF(WEEKDAY(I3,1)='Days1-2'!$J$1,I3,\"\")","v":""},{"$f":"IF(I5=\"\",IF(WEEKDAY(I3,1)=MOD('Days1-2'!$J$1,7)+1,I3,\"\"),I5+1)","v":""},{"$f":"IF(J5=\"\",IF(WEEKDAY(I3,1)=MOD('Days1-2'!$J$1+1,7)+1,I3,\"\"),J5+1)","v":""},{"$f":"IF(K5=\"\",IF(WEEKDAY(I3,1)=MOD('Days1-2'!$J$1+2,7)+1,I3,\"\"),K5+1)","v":"2024-05-01"},{"$f":"IF(L5=\"\",IF(WEEKDAY(I3,1)=MOD('Days1-2'!$J$1+3,7)+1,I3,\"\"),L5+1)","v":"2024-05-02"},{"$f":"IF(M5=\"\",IF(WEEKDAY(I3,1)=MOD('Days1-2'!$J$1+4,7)+1,I3,\"\"),M5+1)","v":"2024-05-03"},{"$f":"IF(N5=\"\",IF(WEEKDAY(I3,1)=MOD('Days1-2'!$J$1+5,7)+1,I3,\"\"),N5+1)","v":"2024-05-04"},null,{"$f":"IF(WEEKDAY(Q3,1)='Days1-2'!$J$1,Q3,\"\")","v":""},{"$f":"IF(Q5=\"\",IF(WEEKDAY(Q3,1)=MOD('Days1-2'!$J$1,7)+1,Q3,\"\"),Q5+1)","v":""},{"$f":"IF(R5=\"\",IF(WEEKDAY(Q3,1)=MOD('Days1-2'!$J$1+1,7)+1,Q3,\"\"),R5+1)","v":""},{"$f":"IF(S5=\"\",IF(WEEKDAY(Q3,1)=MOD('Days1-2'!$J$1+2,7)+1,Q3,\"\"),S5+1)","v":""},{"$f":"IF(T5=\"\",IF(WEEKDAY(Q3,1)=MOD('Days1-2'!$J$1+3,7)+1,Q3,\"\"),T5+1)","v":""},{"$f":"IF(U5=\"\",IF(WEEKDAY(Q3,1)=MOD('Days1-2'!$J$1+4,7)+1,Q3,\"\"),U5+1)","v":""},{"$f":"IF(V5=\"\",IF(WEEKDAY(Q3,1)=MOD('Days1-2'!$J$1+5,7)+1,Q3,\"\"),V5+1)","v":"2024-06-01"},null,null,null,null,{"$f":"INDEX({\"Sunday\",\"Monday\",\"Tuesday\",\"Wednesday\",\"Thursday\",\"Friday\",\"Saturday\"},WEEKDAY(AB3))","v":"Saturday"},null,null,null,{"$f":"IF(WEEKDAY(AF3,1)='Days1-2'!$J$1,AF3,\"\")","v":""},{"$f":"IF(AF5=\"\",IF(WEEKDAY(AF3,1)=MOD('Days1-2'!$J$1,7)+1,AF3,\"\"),AF5+1)","v":""},{"$f":"IF(AG5=\"\",IF(WEEKDAY(AF3,1)=MOD('Days1-2'!$J$1+1,7)+1,AF3,\"\"),AG5+1)","v":""},{"$f":"IF(AH5=\"\",IF(WEEKDAY(AF3,1)=MOD('Days1-2'!$J$1+2,7)+1,AF3,\"\"),AH5+1)","v":"2024-05-01"},{"$f":"IF(AI5=\"\",IF(WEEKDAY(AF3,1)=MOD('Days1-2'!$J$1+3,7)+1,AF3,\"\"),AI5+1)","v":"2024-05-02"},{"$f":"IF(AJ5=\"\",IF(WEEKDAY(AF3,1)=MOD('Days1-2'!$J$1+4,7)+1,AF3,\"\"),AJ5+1)","v":"2024-05-03"},{"$f":"IF(AK5=\"\",IF(WEEKDAY(AF3,1)=MOD('Days1-2'!$J$1+5,7)+1,AF3,\"\"),AK5+1)","v":"2024-05-04"},null,{"$f":"IF(WEEKDAY(AN3,1)='Days1-2'!$J$1,AN3,\"\")","v":""},{"$f":"IF(AN5=\"\",IF(WEEKDAY(AN3,1)=MOD('Days1-2'!$J$1,7)+1,AN3,\"\"),AN5+1)","v":""},{"$f":"IF(AO5=\"\",IF(WEEKDAY(AN3,1)=MOD('Days1-2'!$J$1+1,7)+1,AN3,\"\"),AO5+1)","v":""},{"$f":"IF(AP5=\"\",IF(WEEKDAY(AN3,1)=MOD('Days1-2'!$J$1+2,7)+1,AN3,\"\"),AP5+1)","v":""},{"$f":"IF(AQ5=\"\",IF(WEEKDAY(AN3,1)=MOD('Days1-2'!$J$1+3,7)+1,AN3,\"\"),AQ5+1)","v":""},{"$f":"IF(AR5=\"\",IF(WEEKDAY(AN3,1)=MOD('Days1-2'!$J$1+4,7)+1,AN3,\"\"),AR5+1)","v":""},{"$f":"IF(AS5=\"\",IF(WEEKDAY(AN3,1)=MOD('Days1-2'!$J$1+5,7)+1,AN3,\"\"),AS5+1)","v":"2024-06-01"}]
[null,null,null,null,null,null,null,null,{"$f":"IF(O5=\"\",\"\",IF(MONTH(O5+1)<>MONTH(O5),\"\",O5+1))","v":"2024-05-05"},{"$f":"IF(I6=\"\",\"\",IF(MONTH(I6+1)<>MONTH(I6),\"\",I6+1))","v":"2024-05-06"},{"$f":"IF(J6=\"\",\"\",IF(MONTH(J6+1)<>MONTH(J6),\"\",J6+1))","v":"2024-05-07"},{"$f":"IF(K6=\"\",\"\",IF(MONTH(K6+1)<>MONTH(K6),\"\",K6+1))","v":"2024-05-08"},"2024-05-09","2024-05-10","2024-05-11",null,{"$f":"IF(W5=\"\",\"\",IF(MONTH(W5+1)<>MONTH(W5),\"\",W5+1))","v":"2024-06-02"},{"$f":"IF(Q6=\"\",\"\",IF(MONTH(Q6+1)<>MONTH(Q6),\"\",Q6+1))","v":"2024-06-03"},{"$f":"IF(R6=\"\",\"\",IF(MONTH(R6+1)<>MONTH(R6),\"\",R6+1))","v":"2024-06-04"},{"$f":"IF(S6=\"\",\"\",IF(MONTH(S6+1)<>MONTH(S6),\"\",S6+1))","v":"2024-06-05"},{"$f":"IF(T6=\"\",\"\",IF(MONTH(T6+1)<>MONTH(T6),\"\",T6+1))","v":"2024-06-06"},"2024-06-07","2024-06-08",null,null,null,null,null,null,null,null,{"$f":"IF(AL5=\"\",\"\",IF(MONTH(AL5+1)<>MONTH(AL5),\"\",AL5+1))","v":"2024-05-05"},{"$f":"IF(AF6=\"\",\"\",IF(MONTH(AF6+1)<>MONTH(AF6),\"\",AF6+1))","v":"2024-05-06"},{"$f":"IF(AG6=\"\",\"\",IF(MONTH(AG6+1)<>MONTH(AG6),\"\",AG6+1))","v":"2024-05-07"},{"$f":"IF(AH6=\"\",\"\",IF(MONTH(AH6+1)<>MONTH(AH6),\"\",AH6+1))","v":"2024-05-08"},{"$f":"IF(AI6=\"\",\"\",IF(MONTH(AI6+1)<>MONTH(AI6),\"\",AI6+1))","v":"2024-05-09"},"2024-05-10","2024-05-11",null,{"$f":"IF(AT5=\"\",\"\",IF(MONTH(AT5+1)<>MONTH(AT5),\"\",AT5+1))","v":"2024-06-02"},{"$f":"IF(AN6=\"\",\"\",IF(MONTH(AN6+1)<>MONTH(AN6),\"\",AN6+1))","v":"2024-06-03"},{"$f":"IF(AO6=\"\",\"\",IF(MONTH(AO6+1)<>MONTH(AO6),\"\",AO6+1))","v":"2024-06-04"},{"$f":"IF(AP6=\"\",\"\",IF(MONTH(AP6+1)<>MONTH(AP6),\"\",AP6+1))","v":"2024-06-05"},{"$f":"IF(AQ6=\"\",\"\",IF(MONTH(AQ6+1)<>MONTH(AQ6),\"\",AQ6+1))","v":"2024-06-06"},"2024-06-07","2024-06-08"]
[null,{"$f":"IFERROR(INDEX(arr_holiday,SMALL(IF(arr_holidaydate=$E$3,ROW(arr_holidaydate)),ROW()-ROW($B$6))),\"\")","v":""},null,null,null,null,null,null,{"$f":"IF(O6=\"\",\"\",IF(MONTH(O6+1)<>MONTH(O6),\"\",O6+1))","v":"2024-05-12"},{"$f":"IF(I7=\"\",\"\",IF(MONTH(I7+1)<>MONTH(I7),\"\",I7+1))","v":"2024-05-13"},"2024-05-14","2024-05-15","2024-05-16","2024-05-17","2024-05-18",null,{"$f":"IF(W6=\"\",\"\",IF(MONTH(W6+1)<>MONTH(W6),\"\",W6+1))","v":"2024-06-09"},{"$f":"IF(Q7=\"\",\"\",IF(MONTH(Q7+1)<>MONTH(Q7),\"\",Q7+1))","v":"2024-06-10"},"2024-06-11","2024-06-12","2024-06-13","2024-06-14","2024-06-15",null,{"$f":"IFERROR(INDEX(arr_holiday,SMALL(IF(arr_holidaydate=$AB$3,ROW(arr_holidaydate)),ROW()-ROW($B$6))),\"\")","v":""},null,null,null,null,null,null,{"$f":"IF(AL6=\"\",\"\",IF(MONTH(AL6+1)<>MONTH(AL6),\"\",AL6+1))","v":"2024-05-12"},{"$f":"IF(AF7=\"\",\"\",IF(MONTH(AF7+1)<>MONTH(AF7),\"\",AF7+1))","v":"2024-05-13"},"2024-05-14","2024-05-15","2024-05-16","2024-05-17","2024-05-18",null,{"$f":"IF(AT6=\"\",\"\",IF(MONTH(AT6+1)<>MONTH(AT6),\"\",AT6+1))","v":"2024-06-09"},{"$f":"IF(AN7=\"\",\"\",IF(MONTH(AN7+1)<>MONTH(AN7),\"\",AN7+1))","v":"2024-06-10"},"2024-06-11","2024-06-12","2024-06-13","2024-06-14","2024-06-15"]
[null,{"$f":"IFERROR(INDEX(arr_holiday,SMALL(IF(arr_holidaydate=$E$3,ROW(arr_holidaydate)),ROW()-ROW($B$6))),\"\")","v":""},null,null,null,null,null,null,"2024-05-19","2024-05-20","2024-05-21","2024-05-22","2024-05-23","2024-05-24","2024-05-25",null,"2024-06-16","2024-06-17","2024-06-18","2024-06-19","2024-06-20","2024-06-21","2024-06-22",null,{"$f":"IFERROR(INDEX(arr_holiday,SMALL(IF(arr_holidaydate=$AB$3,ROW(arr_holidaydate)),ROW()-ROW($B$6))),\"\")","v":""},null,null,null,null,null,null,"2024-05-19","2024-05-20","2024-05-21","2024-05-22","2024-05-23","2024-05-24","2024-05-25",null,"2024-06-16","2024-06-17","2024-06-18","2024-06-19","2024-06-20","2024-06-21","2024-06-22"]
[null,{"$f":"IFERROR(INDEX(arr_holiday,SMALL(IF(arr_holidaydate=$E$3,ROW(arr_holidaydate)),ROW()-ROW($B$6))),\"\")","v":""},null,null,null,null,null,null,"2024-05-26","2024-05-27","2024-05-28","2024-05-29","2024-05-30","2024-05-31","",null,"2024-06-23","2024-06-24","2024-06-25","2024-06-26","2024-06-27","2024-06-28","2024-06-29",null,{"$f":"IFERROR(INDEX(arr_holiday,SMALL(IF(arr_holidaydate=$AB$3,ROW(arr_holidaydate)),ROW()-ROW($B$6))),\"\")","v":""},null,null,null,null,null,null,"2024-05-26","2024-05-27","2024-05-28","2024-05-29","2024-05-30","2024-05-31","",null,"2024-06-23","2024-06-24","2024-06-25","2024-06-26","2024-06-27","2024-06-28","2024-06-29"]
[null,{"$f":"IFERROR(INDEX(arr_event,SMALL(IF(arr_eventdate=$E$3,ROW(arr_eventdate)),ROW()-ROW($B$9))),\"\")","v":""},null,null,null,null,null,null,"","","","","","","",null,"2024-06-30","","","","","","",null,{"$f":"IFERROR(INDEX(arr_event,SMALL(IF(arr_eventdate=$AB$3,ROW(arr_eventdate)),ROW()-ROW($B$9))),\"\")","v":""},null,null,null,null,null,null,"","","","","","","",null,"2024-06-30","","","","","",""]
[null,{"$f":"IFERROR(INDEX(arr_event,SMALL(IF(arr_eventdate=$E$3,ROW(arr_eventdate)),ROW()-ROW($B$9))),\"\")","v":""},null,null,null,null,null,null,null,null,null,null,null,null,null,null,null,null,null,null,null,null,null,null,{"$f":"IFERROR(INDEX(arr_event,SMALL(IF(arr_eventdate=$AB$3,ROW(arr_eventdate)),ROW()-ROW($B$9))),\"\")","v":""}]
[null,{"$f":"IFERROR(INDEX(arr_event,SMALL(IF(arr_eventdate=$E$3,ROW(arr_eventdate)),ROW()-ROW($B$9))),\"\")","v":""},null,null,null,null,null,null,null,null,null,null,null,null,null,null,null,null,null,null,null,null,null,null,{"$f":"IFERROR(INDEX(arr_event,SMALL(IF(arr_eventdate=$AB$3,ROW(arr_eventdate)),ROW()-ROW($B$9))),\"\")","v":""}]
[null,"Reminders",null,null,null,null,null,null,"Appointments",null,null,null,null,null,null,null,"Notes",null,null,null,null,null,null,null,"Reminders",null,null,null,null,null,null,"Appointments",null,null,null,null,null,null,null,"Notes"]
[null,{"$f":"IFERROR(INDEX(arr_event,SMALL(IF(arr_eventdate=$E$3,ROW(arr_eventdate)),ROW()-ROW($B$13))),\"\")","v":""},null,null,null,null,7,":00",null,null,null,null,null,null,null,null,null,null,null,null,null,null,null,null,{"$f":"IFERROR(INDEX(arr_event,SMALL(IF(arr_eventdate=$E$3,ROW(arr_eventdate)),ROW()-ROW($B$13))),\"\")","v":""},null,null,null,null,7,":00"]
[null,"",null,null,null,null,null,":30",null,null,null,null,null,null,null,null,null,null,null,null,null,null,null,null,"",null,null,null,null,null,":30"]
[null,"",null,null,null,null,8,":00",null,null,null,null,null,null,null,null,null,null,null,null,null,null,null,null,"",null,null,null,null,8,":00"]
[null,"",null,null,null,null,null,":30",null,null,null,null,null,null,null,null,null,null,null,null,null,null,null,null,"",null,null,null,null,null,":30"]
[null,"",null,null,null,null,9,":00",null,null,null,null,null,null,null,null,null,null,null,null,null,null,null,null,"",null,null,null,null,9,":00"]
[null,"",null,null,null,null,null,":30",null,null,null,null,null,null,null,null,null,null,null,null,null,null,null,null,"",null,null,null,null,null,":30"]
[null,"",null,null,null,null,10,":00",null,null,null,null,null,null,null,null,null,null,null,null,null,null,null,null,"",null,null,null,null,10,":00"]
[null,"",null,null,null,null,null,":30",null,null,null,null,null,null,null,null,null,null,null,null,null,null,null,null,"",null,null,null,null,null,":30"]
[null,"From",null,"Actions Carried Forward",null,null,11,":00",null,null,null,null,null,null,null,null,null,null,null,null,null,null,null,null,"From",null,"Actions Carried Forward",null,null,11,":00"]
[null,{"$f":"IFERROR(INDEX(arr_event,SMALL(IF(arr_eventdate=$E$3,ROW(arr_eventdate)),ROW()-ROW($B$13))),\"\")","v":""},null,null,null,null,null,":30",null,null,null,null,null,null,null,null,null,null,null,null,null,null,null,null,{"$f":"IFERROR(INDEX(arr_event,SMALL(IF(arr_eventdate=$E$3,ROW(arr_eventdate)),ROW()-ROW($B$13))),\"\")","v":""},null,null,null,null,null,":30"]
[null,{"$f":"IFERROR(INDEX(arr_event,SMALL(IF(arr_eventdate=$E$3,ROW(arr_eventdate)),ROW()-ROW($B$13))),\"\")","v":""},null,null,null,null,12,":00",null,null,null,null,null,null,null,null,null,null,null,null,null,null,null,null,{"$f":"IFERROR(INDEX(arr_event,SMALL(IF(arr_eventdate=$E$3,ROW(arr_eventdate)),ROW()-ROW($B$13))),\"\")","v":""},null,null,null,null,12,":00"]
[null,{"$f":"IFERROR(INDEX(arr_event,SMALL(IF(arr_eventdate=$E$3,ROW(arr_eventdate)),ROW()-ROW($B$13))),\"\")","v":""},null,null,null,null,null,":30",null,null,null,null,null,null,null,null,null,null,null,null,null,null,null,null,{"$f":"IFERROR(INDEX(arr_event,SMALL(IF(arr_eventdate=$E$3,ROW(arr_eventdate)),ROW()-ROW($B$13))),\"\")","v":""},null,null,null,null,null,":30"]
[null,{"$f":"IFERROR(INDEX(arr_event,SMALL(IF(arr_eventdate=$E$3,ROW(arr_eventdate)),ROW()-ROW($B$13))),\"\")","v":""},null,null,null,null,1,":00",null,null,null,null,null,null,null,null,null,null,null,null,null,null,null,null,{"$f":"IFERROR(INDEX(arr_event,SMALL(IF(arr_eventdate=$E$3,ROW(arr_eventdate)),ROW()-ROW($B$13))),\"\")","v":""},null,null,null,null,1,":00"]
[null,{"$f":"IFERROR(INDEX(arr_event,SMALL(IF(arr_eventdate=$E$3,ROW(arr_eventdate)),ROW()-ROW($B$13))),\"\")","v":""},null,null,null,null,null,":30",null,null,null,null,null,null,null,null,null,null,null,null,null,null,null,null,{"$f":"IFERROR(INDEX(arr_event,SMALL(IF(arr_eventdate=$E$3,ROW(arr_eventdate)),ROW()-ROW($B$13))),\"\")","v":""},null,null,null,null,null,":30"]
[null,{"$f":"IFERROR(INDEX(arr_event,SMALL(IF(arr_eventdate=$E$3,ROW(arr_eventdate)),ROW()-ROW($B$13))),\"\")","v":""},null,null,null,null,2,":00",null,null,null,null,null,null,null,null,null,null,null,null,null,null,null,null,{"$f":"IFERROR(INDEX(arr_event,SMALL(IF(arr_eventdate=$E$3,ROW(arr_eventdate)),ROW()-ROW($B$13))),\"\")","v":""},null,null,null,null,2,":00"]
[null,{"$f":"IFERROR(INDEX(arr_event,SMALL(IF(arr_eventdate=$E$3,ROW(arr_eventdate)),ROW()-ROW($B$13))),\"\")","v":""},null,null,null,null,null,":30",null,null,null,null,null,null,null,null,null,null,null,null,null,null,null,null,{"$f":"IFERROR(INDEX(arr_event,SMALL(IF(arr_eventdate=$E$3,ROW(arr_eventdate)),ROW()-ROW($B$13))),\"\")","v":""},null,null,null,null,null,":30"]
[null,{"$f":"IFERROR(INDEX(arr_event,SMALL(IF(arr_eventdate=$E$3,ROW(arr_eventdate)),ROW()-ROW($B$13))),\"\")","v":""},null,null,null,null,3,":00",null,null,null,null,null,null,null,null,null,null,null,null,null,null,null,null,{"$f":"IFERROR(INDEX(arr_event,SMALL(IF(arr_eventdate=$E$3,ROW(arr_eventdate)),ROW()-ROW($B$13))),\"\")","v":""},null,null,null,null,3,":00"]
[null,null,null,null,null,null,null,":30",null,null,null,null,null,null,null,null,null,null,null,null,null,null,null,null,null,null,null,null,null,null,":30"]
[null,"$Amt",null,"Expenses",null,null,4,":00",null,null,null,null,null,null,null,null,null,null,null,null,null,null,null,null,"$Amt",null,"Expenses",null,null,4,":00"]
[null,null,null,null,null,null,null,":30",null,null,null,null,null,null,null,null,null,null,null,null,null,null,null,null,null,null,null,null,null,null,":30"]
[null,null,null,null,null,null,5,":00",null,null,null,null,null,null,null,null,null,null,null,null,null,null,null,null,null,null,null,null,null,5,":00"]
[null,null,null,null,null,null,null,":30",null,null,null,null,null,null,null,null,null,null,null,null,null,null,null,null,null,null,null,null,null,null,":30"]
[null,null,null,null,null,null,6,":00",null,null,null,null,null,null,null,null,null,null,null,null,null,null,null,null,null,null,null,null,null,6,":00"]
[null,null,null,null,null,null,null,":30",null,null,null,null,null,null,null,null,null,null,null,null,null,null,null,null,null,null,null,null,null,null,":30"]
[]
[null,"Planned cases for today",null,null,null,null,null,":30",null,null,null,null,null,null,null,null,null,null,null,null,null,null,null,null,"Planned cases for today",null,null,null,null,null,":30"]
[null,"Case",null,null,null,"Action",null,null,null,null,null,null,null,null,null,null,null,null,null,"Follow-up",null,null,null,null,"Case",null,null,null,"Action",null,null,null,null,null,null,null,null,null,null,null,null,null,"Follow-up"]

{"sheet":"Days13-14","index":8,"n_rows":40,"n_cols":46,"rows_kept":40,"cut":false,"hidden":false,"merged":[[56,24,56,27],[56,28,56,41],[56,42,56,45],[57,24,57,27],[57,28,57,41],[57,42,57,45],[52,42,52,45],[53,24,53,27],[53,28,53,41],[53,42,53,45],[54,24,54,27],[54,28,54,41],[54,42,54,45],[55,24,55,27],[55,28,55,41],[55,42,55,45],[48,42,48,45],[49,24,49,27],[49,28,49,41],[49,42,49,45],[50,24,50,27],[50,28,50,41],[50,42,50,45],[51,24,51,27],[51,28,51,41],[51,42,51,45],[44,42,44,45],[45,24,45,27],[45,28,45,41],[45,42,45,45],[46,24,46,27],[46,28,46,41],[46,42,46,45],[47,24,47,27],[47,28,47,41],[47,42,47,45],[40,42,40,45],[41,24,41,27],[41,28,41,41],[41,42,41,45],[42,24,42,27],[42,28,42,41],[42,42,42,45],[43,24,43,27],[43,28,43,41],[43,42,43,45],[57,1,57,4],[57,5,57,18],[57,19,57,22],[58,1,58,4],[58,5,58,18],[58,19,58,22],[29,24,29,25],[31,24,31,25],[31,26,31,27],[32,24,32,25],[32,26,32,27],[33,24,33,25],[33,26,33,27],[34,24,34,25],[34,26,34,27],[35,24,35,25],[35,26,35,27],[36,24,36,25],[36,26,36,27],[38,24,38,45],[39,24,39,27],[39,28,39,41],[39,42,39,45],[40,24,40,27],[0,32,0,33],[2,1,5,3],[2,4,3,7],[2,8,2,14],[2,16,2,22],[2,24,5,26],[2,27,3,30],[2,31,2,37],[29,1,29,2],[13,6,14,6],[13,29,14,29],[15,6,16,6],[15,29,16,29],[17,6,18,6],[17,29,18,29],[2,39,2,45],[4,4,5,6],[4,27,5,29],[6,5,6,6],[6,28,6,29],[12,1,12,4],[12,16,12,22],[12,24,12,27],[12,39,12,45],[22,24,22,25],[22,26,22,27],[23,1,23,2],[23,3,23,4],[23,6,24,6],[23,24,23,25],[23,26,23,27],[19,6,20,6],[19,29,20,29],[21,1,21,2],[21,3,21,4],[21,6,22,6],[21,24,21,25],[21,26,21,27],[21,29,22,29],[22,1,22,2],[22,3,22,4],[23,29,24,29],[24,1,24,2],[24,3,24,4],[24,24,24,25],[24,26,24,27],[25,1,25,2],[25,3,25,4],[25,6,26,6],[25,24,25,25],[25,26,25,27],[25,29,26,29],[26,1,26,2],[26,3,26,4],[26,24,26,25],[26,26,26,27],[27,1,27,2],[27,3,27,4],[27,6,28,6],[27,24,27,25],[27,26,27,27],[27,29,28,29],[28,1,28,2],[28,3,28,4],[28,24,28,25],[28,26,28,27],[29,3,29,4],[29,6,30,6],[29,26,29,27],[29,29,30,29],[31,6,32,6],[31,29,32,29],[33,6,34,6],[33,29,34,29],[35,6,36,6],[35,29,36,29],[40,5,40,18],[40,19,40,22],[41,5,41,18],[41,19,41,22],[42,5,42,18],[42,19,42,22],[40,28,40,41],[42,1,42,4],[43,1,43,4],[43,5,43,18],[43,19,43,22],[44,24,44,27],[44,28,44,41],[31,1,31,2],[31,3,31,4],[40,1,40,4],[41,1,41,4],[44,1,44,4],[44,5,44,18],[44,19,44,22],[45,1,45,4],[45,5,45,18],[45,19,45,22],[46,1,46,4],[46,5,46,18],[46,19,46,22],[47,1,47,4],[47,5,47,18],[47,19,47,22],[32,1,32,2],[32,3,32,4],[33,1,33,2],[33,3,33,4],[48,1,48,4],[48,5,48,18],[48,19,48,22],[49,1,49,4],[49,5,49,18],[49,19,49,22],[50,1,50,4],[50,5,50,18],[50,19,50,22],[51,1,51,4],[51,5,51,18],[51,19,51,22],[48,24,48,27],[48,28,48,41],[34,1,34,2],[34,3,34,4],[35,1,35,2],[35,3,35,4],[52,1,52,4],[52,5,52,18],[52,19,52,22],[53,1,53,4],[53,5,53,18],[53,19,53,22],[52,24,52,27],[52,28,52,41],[39,1,39,4],[39,5,39,18],[39,19,39,22],[58,24,58,27],[58,28,58,41],[58,42,58,45],[36,1,36,2],[36,3,36,4],[38,1,38,22],[54,1,54,4],[54,5,54,18],[54,19,54,22],[55,1,55,4],[55,5,55,18],[55,19,55,22],[56,1,56,4],[56,5,56,18],[56,19,56,22],[61,1,61,4],[61,5,61,18],[61,19,61,22],[61,24,61,27],[61,28,61,41],[61,42,61,45],[59,1,59,4],[59,5,59,18],[59,19,59,22],[59,24,59,27],[59,28,59,41],[59,42,59,45],[62,1,62,4],[62,5,62,18],[62,19,62,22],[62,24,62,27],[62,28,62,41],[62,42,62,45]]}
[]
[]
[null,{"$f":"DAY(E3)","v":12},null,null,{"$f":"'Days11-12'!AB3+1","v":"2024-05-12"},null,null,null,{"$f":"DATE(YEAR($E$3),MONTH($E$3),1)","v":"2024-05-01"},null,null,null,null,null,null,null,{"$f":"DATE(YEAR(I3+35),MONTH(I3+35),1)","v":"2024-06-01"},null,null,null,null,null,null,null,{"$f":"DAY(AB3)","v":13},null,null,{"$f":"E3+1","v":"2024-05-13"},null,null,null,{"$f":"DATE(YEAR(AB3),MONTH(AB3),1)","v":"2024-05-01"},null,null,null,null,null,null,null,{"$f":"DATE(YEAR(AF3+35),MONTH(AF3+35),1)","v":"2024-06-01"}]
[null,null,null,null,null,null,null,null,{"$f":"CHOOSE(1+MOD('Days1-2'!J1+1-2,7),\"Su\",\"M\",\"Tu\",\"W\",\"Th\",\"F\",\"Sa\")","v":"Su"},{"$f":"CHOOSE(1+MOD('Days1-2'!$J$1+2-2,7),\"Su\",\"M\",\"Tu\",\"W\",\"Th\",\"F\",\"Sa\")","v":"M"},{"$f":"CHOOSE(1+MOD('Days1-2'!$J$1+3-2,7),\"Su\",\"M\",\"Tu\",\"W\",\"Th\",\"F\",\"Sa\")","v":"Tu"},{"$f":"CHOOSE(1+MOD('Days1-2'!$J$1+4-2,7),\"Su\",\"M\",\"Tu\",\"W\",\"Th\",\"F\",\"Sa\")","v":"W"},{"$f":"CHOOSE(1+MOD('Days1-2'!$J$1+5-2,7),\"Su\",\"M\",\"Tu\",\"W\",\"Th\",\"F\",\"Sa\")","v":"Th"},{"$f":"CHOOSE(1+MOD('Days1-2'!$J$1+6-2,7),\"Su\",\"M\",\"Tu\",\"W\",\"Th\",\"F\",\"Sa\")","v":"F"},{"$f":"CHOOSE(1+MOD('Days1-2'!$J$1+7-2,7),\"Su\",\"M\",\"Tu\",\"W\",\"Th\",\"F\",\"Sa\")","v":"Sa"},null,{"$f":"CHOOSE(1+MOD('Days1-2'!J1+1-2,7),\"Su\",\"M\",\"Tu\",\"W\",\"Th\",\"F\",\"Sa\")","v":"Su"},{"$f":"CHOOSE(1+MOD('Days1-2'!J1+2-2,7),\"Su\",\"M\",\"Tu\",\"W\",\"Th\",\"F\",\"Sa\")","v":"M"},{"$f":"CHOOSE(1+MOD('Days1-2'!J1+3-2,7),\"Su\",\"M\",\"Tu\",\"W\",\"Th\",\"F\",\"Sa\")","v":"Tu"},{"$f":"CHOOSE(1+MOD('Days1-2'!J1+4-2,7),\"Su\",\"M\",\"Tu\",\"W\",\"Th\",\"F\",\"Sa\")","v":"W"},{"$f":"CHOOSE(1+MOD('Days1-2'!J1+5-2,7),\"Su\",\"M\",\"Tu\",\"W\",\"Th\",\"F\",\"Sa\")","v":"Th"},{"$f":"CHOOSE(1+MOD('Days1-2'!J1+6-2,7),\"Su\",\"M\",\"Tu\",\"W\",\"Th\",\"F\",\"Sa\")","v":"F"},{"$f":"CHOOSE(1+MOD('Days1-2'!J1+7-2,7),\"Su\",\"M\",\"Tu\",\"W\",\"Th\",\"F\",\"Sa\")","v":"Sa"},null,null,null,null,null,null,null,null,{"$f":"CHOOSE(1+MOD('Days1-2'!$J$1+1-2,7),\"Su\",\"M\",\"Tu\",\"W\",\"Th\",\"F\",\"Sa\")","v":"Su"},{"$f":"CHOOSE(1+MOD('Days1-2'!$J$1+2-2,7),\"Su\",\"M\",\"Tu\",\"W\",\"Th\",\"F\",\"Sa\")","v":"M"},{"$f":"CHOOSE(1+MOD('Days1-2'!$J$1+3-2,7),\"Su\",\"M\",\"Tu\",\"W\",\"Th\",\"F\",\"Sa\")","v":"Tu"},{"$f":"CHOOSE(1+MOD('Days1-2'!$J$1+4-2,7),\"Su\",\"M\",\"Tu\",\"W\",\"Th\",\"F\",\"Sa\")","v":"W"},{"$f":"CHOOSE(1+MOD('Days1-2'!$J$1+5-2,7),\"Su\",\"M\",\"Tu\",\"W\",\"Th\",\"F\",\"Sa\")","v":"Th"},{"$f":"CHOOSE(1+MOD('Days1-2'!$J$1+6-2,7),\"Su\",\"M\",\"Tu\",\"W\",\"Th\",\"F\",\"Sa\")","v":"F"},{"$f":"CHOOSE(1+MOD('Days1-2'!$J$1+7-2,7),\"Su\",\"M\",\"Tu\",\"W\",\"Th\",\"F\",\"Sa\")","v":"Sa"},null,{"$f":"CHOOSE(1+MOD('Days1-2'!$J$1+1-2,7),\"Su\",\"M\",\"Tu\",\"W\",\"Th\",\"F\",\"Sa\")","v":"Su"},{"$f":"CHOOSE(1+MOD('Days1-2'!$J$1+2-2,7),\"Su\",\"M\",\"Tu\",\"W\",\"Th\",\"F\",\"Sa\")","v":"M"},{"$f":"CHOOSE(1+MOD('Days1-2'!$J$1+3-2,7),\"Su\",\"M\",\"Tu\",\"W\",\"Th\",\"F\",\"Sa\")","v":"Tu"},{"$f":"CHOOSE(1+MOD('Days1-2'!$J$1+4-2,7),\"Su\",\"M\",\"Tu\",\"W\",\"Th\",\"F\",\"Sa\")","v":"W"},{"$f":"CHOOSE(1+MOD('Days1-2'!$J$1+5-2,7),\"Su\",\"M\",\"Tu\",\"W\",\"Th\",\"F\",\"Sa\")","v":"Th"},{"$f":"CHOOSE(1+MOD('Days1-2'!$J$1+6-2,7),\"Su\",\"M\",\"Tu\",\"W\",\"Th\",\"F\",\"Sa\")","v":"F"},{"$f":"CHOOSE(1+MOD('Days1-2'!$J$1+7-2,7),\"Su\",\"M\",\"Tu\",\"W\",\"Th\",\"F\",\"Sa\")","v":"Sa"}]
[null,null,null,null,{"$f":"INDEX({\"Sunday\",\"Monday\",\"Tuesday\",\"Wednesday\",\"Thursday\",\"Friday\",\"Saturday\"},WEEKDAY(E3))","v":"Sunday"},null,null,null,{"$f":"IF(WEEKDAY(I3,1)='Days1-2'!$J$1,I3,\"\")","v":""},{"$f":"IF(I5=\"\",IF(WEEKDAY(I3,1)=MOD('Days1-2'!$J$1,7)+1,I3,\"\"),I5+1)","v":""},{"$f":"IF(J5=\"\",IF(WEEKDAY(I3,1)=MOD('Days1-2'!$J$1+1,7)+1,I3,\"\"),J5+1)","v":""},{"$f":"IF(K5=\"\",IF(WEEKDAY(I3,1)=MOD('Days1-2'!$J$1+2,7)+1,I3,\"\"),K5+1)","v":"2024-05-01"},{"$f":"IF(L5=\"\",IF(WEEKDAY(I3,1)=MOD('Days1-2'!$J$1+3,7)+1,I3,\"\"),L5+1)","v":"2024-05-02"},{"$f":"IF(M5=\"\",IF(WEEKDAY(I3,1)=MOD('Days1-2'!$J$1+4,7)+1,I3,\"\"),M5+1)","v":"2024-05-03"},{"$f":"IF(N5=\"\",IF(WEEKDAY(I3,1)=MOD('Days1-2'!$J$1+5,7)+1,I3,\"\"),N5+1)","v":"2024-05-04"},null,{"$f":"IF(WEEKDAY(Q3,1)='Days1-2'!$J$1,Q3,\"\")","v":""},{"$f":"IF(Q5=\"\",IF(WEEKDAY(Q3,1)=MOD('Days1-2'!$J$1,7)+1,Q3,\"\"),Q5+1)","v":""},{"$f":"IF(R5=\"\",IF(WEEKDAY(Q3,1)=MOD('Days1-2'!$J$1+1,7)+1,Q3,\"\"),R5+1)","v":""},{"$f":"IF(S5=\"\",IF(WEEKDAY(Q3,1)=MOD('Days1-2'!$J$1+2,7)+1,Q3,\"\"),S5+1)","v":""},{"$f":"IF(T5=\"\",IF(WEEKDAY(Q3,1)=MOD('Days1-2'!$J$1+3,7)+1,Q3,\"\"),T5+1)","v":""},{"$f":"IF(U5=\"\",IF(WEEKDAY(Q3,1)=MOD('Days1-2'!$J$1+4,7)+1,Q3,\"\"),U5+1)","v":""},{"$f":"IF(V5=\"\",IF(WEEKDAY(Q3,1)=MOD('Days1-2'!$J$1+5,7)+1,Q3,\"\"),V5+1)","v":"2024-06-01"},null,null,null,null,{"$f":"INDEX({\"Sunday\",\"Monday\",\"Tuesday\",\"Wednesday\",\"Thursday\",\"Friday\",\"Saturday\"},WEEKDAY(AB3))","v":"Monday"},null,null,null,{"$f":"IF(WEEKDAY(AF3,1)='Days1-2'!$J$1,AF3,\"\")","v":""},{"$f":"IF(AF5=\"\",IF(WEEKDAY(AF3,1)=MOD('Days1-2'!$J$1,7)+1,AF3,\"\"),AF5+1)","v":""},{"$f":"IF(AG5=\"\",IF(WEEKDAY(AF3,1)=MOD('Days1-2'!$J$1+1,7)+1,AF3,\"\"),AG5+1)","v":""},{"$f":"IF(AH5=\"\",IF(WEEKDAY(AF3,1)=MOD('Days1-2'!$J$1+2,7)+1,AF3,\"\"),AH5+1)","v":"2024-05-01"},{"$f":"IF(AI5=\"\",IF(WEEKDAY(AF3,1)=MOD('Days1-2'!$J$1+3,7)+1,AF3,\"\"),AI5+1)","v":"2024-05-02"},{"$f":"IF(AJ5=\"\",IF(WEEKDAY(AF3,1)=MOD('Days1-2'!$J$1+4,7)+1,AF3,\"\"),AJ5+1)","v":"2024-05-03"},{"$f":"IF(AK5=\"\",IF(WEEKDAY(AF3,1)=MOD('Days1-2'!$J$1+5,7)+1,AF3,\"\"),AK5+1)","v":"2024-05-04"},null,{"$f":"IF(WEEKDAY(AN3,1)='Days1-2'!$J$1,AN3,\"\")","v":""},{"$f":"IF(AN5=\"\",IF(WEEKDAY(AN3,1)=MOD('Days1-2'!$J$1,7)+1,AN3,\"\"),AN5+1)","v":""},{"$f":"IF(AO5=\"\",IF(WEEKDAY(AN3,1)=MOD('Days1-2'!$J$1+1,7)+1,AN3,\"\"),AO5+1)","v":""},{"$f":"IF(AP5=\"\",IF(WEEKDAY(AN3,1)=MOD('Days1-2'!$J$1+2,7)+1,AN3,\"\"),AP5+1)","v":""},{"$f":"IF(AQ5=\"\",IF(WEEKDAY(AN3,1)=MOD('Days1-2'!$J$1+3,7)+1,AN3,\"\"),AQ5+1)","v":""},{"$f":"IF(AR5=\"\",IF(WEEKDAY(AN3,1)=MOD('Days1-2'!$J$1+4,7)+1,AN3,\"\"),AR5+1)","v":""},{"$f":"IF(AS5=\"\",IF(WEEKDAY(AN3,1)=MOD('Days1-2'!$J$1+5,7)+1,AN3,\"\"),AS5+1)","v":"2024-06-01"}]
[null,null,null,null,null,null,null,null,{"$f":"IF(O5=\"\",\"\",IF(MONTH(O5+1)<>MONTH(O5),\"\",O5+1))","v":"2024-05-05"},{"$f":"IF(I6=\"\",\"\",IF(MONTH(I6+1)<>MONTH(I6),\"\",I6+1))","v":"2024-05-06"},{"$f":"IF(J6=\"\",\"\",IF(MONTH(J6+1)<>MONTH(J6),\"\",J6+1))","v":"2024-05-07"},{"$f":"IF(K6=\"\",\"\",IF(MONTH(K6+1)<>MONTH(K6),\"\",K6+1))","v":"2024-05-08"},"2024-05-09","2024-05-10","2024-05-11",null,{"$f":"IF(W5=\"\",\"\",IF(MONTH(W5+1)<>MONTH(W5),\"\",W5+1))","v":"2024-06-02"},{"$f":"IF(Q6=\"\",\"\",IF(MONTH(Q6+1)<>MONTH(Q6),\"\",Q6+1))","v":"2024-06-03"},{"$f":"IF(R6=\"\",\"\",IF(MONTH(R6+1)<>MONTH(R6),\"\",R6+1))","v":"2024-06-04"},{"$f":"IF(S6=\"\",\"\",IF(MONTH(S6+1)<>MONTH(S6),\"\",S6+1))","v":"2024-06-05"},{"$f":"IF(T6=\"\",\"\",IF(MONTH(T6+1)<>MONTH(T6),\"\",T6+1))","v":"2024-06-06"},"2024-06-07","2024-06-08",null,null,null,null,null,null,null,null,{"$f":"IF(AL5=\"\",\"\",IF(MONTH(AL5+1)<>MONTH(AL5),\"\",AL5+1))","v":"2024-05-05"},{"$f":"IF(AF6=\"\",\"\",IF(MONTH(AF6+1)<>MONTH(AF6),\"\",AF6+1))","v":"2024-05-06"},{"$f":"IF(AG6=\"\",\"\",IF(MONTH(AG6+1)<>MONTH(AG6),\"\",AG6+1))","v":"2024-05-07"},{"$f":"IF(AH6=\"\",\"\",IF(MONTH(AH6+1)<>MONTH(AH6),\"\",AH6+1))","v":"2024-05-08"},{"$f":"IF(AI6=\"\",\"\",IF(MONTH(AI6+1)<>MONTH(AI6),\"\",AI6+1))","v":"2024-05-09"},"2024-05-10","2024-05-11",null,{"$f":"IF(AT5=\"\",\"\",IF(MONTH(AT5+1)<>MONTH(AT5),\"\",AT5+1))","v":"2024-06-02"},{"$f":"IF(AN6=\"\",\"\",IF(MONTH(AN6+1)<>MONTH(AN6),\"\",AN6+1))","v":"2024-06-03"},{"$f":"IF(AO6=\"\",\"\",IF(MONTH(AO6+1)<>MONTH(AO6),\"\",AO6+1))","v":"2024-06-04"},{"$f":"IF(AP6=\"\",\"\",IF(MONTH(AP6+1)<>MONTH(AP6),\"\",AP6+1))","v":"2024-06-05"},{"$f":"IF(AQ6=\"\",\"\",IF(MONTH(AQ6+1)<>MONTH(AQ6),\"\",AQ6+1))","v":"2024-06-06"},"2024-06-07","2024-06-08"]
[null,{"$f":"IFERROR(INDEX(arr_holiday,SMALL(IF(arr_holidaydate=$E$3,ROW(arr_holidaydate)),ROW()-ROW($B$6))),\"\")","v":"Mother's Day"},null,null,null,null,null,null,{"$f":"IF(O6=\"\",\"\",IF(MONTH(O6+1)<>MONTH(O6),\"\",O6+1))","v":"2024-05-12"},{"$f":"IF(I7=\"\",\"\",IF(MONTH(I7+1)<>MONTH(I7),\"\",I7+1))","v":"2024-05-13"},"2024-05-14","2024-05-15","2024-05-16","2024-05-17","2024-05-18",null,{"$f":"IF(W6=\"\",\"\",IF(MONTH(W6+1)<>MONTH(W6),\"\",W6+1))","v":"2024-06-09"},{"$f":"IF(Q7=\"\",\"\",IF(MONTH(Q7+1)<>MONTH(Q7),\"\",Q7+1))","v":"2024-06-10"},"2024-06-11","2024-06-12","2024-06-13","2024-06-14","2024-06-15",null,{"$f":"IFERROR(INDEX(arr_holiday,SMALL(IF(arr_holidaydate=$AB$3,ROW(arr_holidaydate)),ROW()-ROW($B$6))),\"\")","v":""},null,null,null,null,null,null,{"$f":"IF(AL6=\"\",\"\",IF(MONTH(AL6+1)<>MONTH(AL6),\"\",AL6+1))","v":"2024-05-12"},{"$f":"IF(AF7=\"\",\"\",IF(MONTH(AF7+1)<>MONTH(AF7),\"\",AF7+1))","v":"2024-05-13"},"2024-05-14","2024-05-15","2024-05-16","2024-05-17","2024-05-18",null,{"$f":"IF(AT6=\"\",\"\",IF(MONTH(AT6+1)<>MONTH(AT6),\"\",AT6+1))","v":"2024-06-09"},{"$f":"IF(AN7=\"\",\"\",IF(MONTH(AN7+1)<>MONTH(AN7),\"\",AN7+1))","v":"2024-06-10"},"2024-06-11","2024-06-12","2024-06-13","2024-06-14","2024-06-15"]
[null,{"$f":"IFERROR(INDEX(arr_holiday,SMALL(IF(arr_holidaydate=$E$3,ROW(arr_holidaydate)),ROW()-ROW($B$6))),\"\")","v":""},null,null,null,null,null,null,"2024-05-19","2024-05-20","2024-05-21","2024-05-22","2024-05-23","2024-05-24","2024-05-25",null,"2024-06-16","2024-06-17","2024-06-18","2024-06-19","2024-06-20","2024-06-21","2024-06-22",null,{"$f":"IFERROR(INDEX(arr_holiday,SMALL(IF(arr_holidaydate=$AB$3,ROW(arr_holidaydate)),ROW()-ROW($B$6))),\"\")","v":""},null,null,null,null,null,null,"2024-05-19","2024-05-20","2024-05-21","2024-05-22","2024-05-23","2024-05-24","2024-05-25",null,"2024-06-16","2024-06-17","2024-06-18","2024-06-19","2024-06-20","2024-06-21","2024-06-22"]
[null,{"$f":"IFERROR(INDEX(arr_holiday,SMALL(IF(arr_holidaydate=$E$3,ROW(arr_holidaydate)),ROW()-ROW($B$6))),\"\")","v":""},null,null,null,null,null,null,"2024-05-26","2024-05-27","2024-05-28","2024-05-29","2024-05-30","2024-05-31","",null,"2024-06-23","2024-06-24","2024-06-25","2024-06-26","2024-06-27","2024-06-28","2024-06-29",null,{"$f":"IFERROR(INDEX(arr_holiday,SMALL(IF(arr_holidaydate=$AB$3,ROW(arr_holidaydate)),ROW()-ROW($B$6))),\"\")","v":""},null,null,null,null,null,null,"2024-05-26","2024-05-27","2024-05-28","2024-05-29","2024-05-30","2024-05-31","",null,"2024-06-23","2024-06-24","2024-06-25","2024-06-26","2024-06-27","2024-06-28","2024-06-29"]
[null,{"$f":"IFERROR(INDEX(arr_event,SMALL(IF(arr_eventdate=$E$3,ROW(arr_eventdate)),ROW()-ROW($B$9))),\"\")","v":""},null,null,null,null,null,null,"","","","","","","",null,"2024-06-30","","","","","","",null,{"$f":"IFERROR(INDEX(arr_event,SMALL(IF(arr_eventdate=$AB$3,ROW(arr_eventdate)),ROW()-ROW($B$9))),\"\")","v":""},null,null,null,null,null,null,"","","","","","","",null,"2024-06-30","","","","","",""]
[null,{"$f":"IFERROR(INDEX(arr_event,SMALL(IF(arr_eventdate=$E$3,ROW(arr_eventdate)),ROW()-ROW($B$9))),\"\")","v":""},null,null,null,null,null,null,null,null,null,null,null,null,null,null,null,null,null,null,null,null,null,null,{"$f":"IFERROR(INDEX(arr_event,SMALL(IF(arr_eventdate=$AB$3,ROW(arr_eventdate)),ROW()-ROW($B$9))),\"\")","v":""}]
[null,{"$f":"IFERROR(INDEX(arr_event,SMALL(IF(arr_eventdate=$E$3,ROW(arr_eventdate)),ROW()-ROW($B$9))),\"\")","v":""},null,null,null,null,null,null,null,null,null,null,null,null,null,null,null,null,null,null,null,null,null,null,{"$f":"IFERROR(INDEX(arr_event,SMALL(IF(arr_eventdate=$AB$3,ROW(arr_eventdate)),ROW()-ROW($B$9))),\"\")","v":""}]
[null,"Reminders",null,null,null,null,null,null,"Appointments",null,null,null,null,null,null,null,"Notes",null,null,null,null,null,null,null,"Reminders",null,null,null,null,null,null,"Appointments",null,null,null,null,null,null,null,"Notes"]
[null,{"$f":"IFERROR(INDEX(arr_event,SMALL(IF(arr_eventdate=$E$3,ROW(arr_eventdate)),ROW()-ROW($B$13))),\"\")","v":""},null,null,null,null,7,":00",null,null,null,null,null,null,null,null,null,null,null,null,null,null,null,null,{"$f":"IFERROR(INDEX(arr_event,SMALL(IF(arr_eventdate=$E$3,ROW(arr_eventdate)),ROW()-ROW($B$13))),\"\")","v":""},null,null,null,null,7,":00"]
[null,"",null,null,null,null,null,":30",null,null,null,null,null,null,null,null,null,null,null,null,null,null,null,null,"",null,null,null,null,null,":30"]
[null,"",null,null,null,null,8,":00",null,null,null,null,null,null,null,null,null,null,null,null,null,null,null,null,"",null,null,null,null,8,":00"]
[null,"",null,null,null,null,null,":30",null,null,null,null,null,null,null,null,null,null,null,null,null,null,null,null,"",null,null,null,null,null,":30"]
[null,"",null,null,null,null,9,":00",null,null,null,null,null,null,null,null,null,null,null,null,null,null,null,null,"",null,null,null,null,9,":00"]
[null,"",null,null,null,null,null,":30",null,null,null,null,null,null,null,null,null,null,null,null,null,null,null,null,"",null,null,null,null,null,":30"]
[null,"",null,null,null,null,10,":00",null,null,null,null,null,null,null,null,null,null,null,null,null,null,null,null,"",null,null,null,null,10,":00"]
[null,"",null,null,null,null,null,":30",null,null,null,null,null,null,null,null,null,null,null,null,null,null,null,null,"",null,null,null,null,null,":30"]
[null,"From",null,"Actions Carried Forward",null,null,11,":00",null,null,null,null,null,null,null,null,null,null,null,null,null,null,null,null,"From",null,"Actions Carried Forward",null,null,11,":00"]
[null,{"$f":"IFERROR(INDEX(arr_event,SMALL(IF(arr_eventdate=$E$3,ROW(arr_eventdate)),ROW()-ROW($B$13))),\"\")","v":""},null,null,null,null,null,":30",null,null,null,null,null,null,null,null,null,null,null,null,null,null,null,null,{"$f":"IFERROR(INDEX(arr_event,SMALL(IF(arr_eventdate=$E$3,ROW(arr_eventdate)),ROW()-ROW($B$13))),\"\")","v":""},null,null,null,null,null,":30"]
[null,{"$f":"IFERROR(INDEX(arr_event,SMALL(IF(arr_eventdate=$E$3,ROW(arr_eventdate)),ROW()-ROW($B$13))),\"\")","v":""},null,null,null,null,12,":00",null,null,null,null,null,null,null,null,null,null,null,null,null,null,null,null,{"$f":"IFERROR(INDEX(arr_event,SMALL(IF(arr_eventdate=$E$3,ROW(arr_eventdate)),ROW()-ROW($B$13))),\"\")","v":""},null,null,null,null,12,":00"]
[null,{"$f":"IFERROR(INDEX(arr_event,SMALL(IF(arr_eventdate=$E$3,ROW(arr_eventdate)),ROW()-ROW($B$13))),\"\")","v":""},null,null,null,null,null,":30",null,null,null,null,null,null,null,null,null,null,null,null,null,null,null,null,{"$f":"IFERROR(INDEX(arr_event,SMALL(IF(arr_eventdate=$E$3,ROW(arr_eventdate)),ROW()-ROW($B$13))),\"\")","v":""},null,null,null,null,null,":30"]
[null,{"$f":"IFERROR(INDEX(arr_event,SMALL(IF(arr_eventdate=$E$3,ROW(arr_eventdate)),ROW()-ROW($B$13))),\"\")","v":""},null,null,null,null,1,":00",null,null,null,null,null,null,null,null,null,null,null,null,null,null,null,null,{"$f":"IFERROR(INDEX(arr_event,SMALL(IF(arr_eventdate=$E$3,ROW(arr_eventdate)),ROW()-ROW($B$13))),\"\")","v":""},null,null,null,null,1,":00"]
[null,{"$f":"IFERROR(INDEX(arr_event,SMALL(IF(arr_eventdate=$E$3,ROW(arr_eventdate)),ROW()-ROW($B$13))),\"\")","v":""},null,null,null,null,null,":30",null,null,null,null,null,null,null,null,null,null,null,null,null,null,null,null,{"$f":"IFERROR(INDEX(arr_event,SMALL(IF(arr_eventdate=$E$3,ROW(arr_eventdate)),ROW()-ROW($B$13))),\"\")","v":""},null,null,null,null,null,":30"]
[null,{"$f":"IFERROR(INDEX(arr_event,SMALL(IF(arr_eventdate=$E$3,ROW(arr_eventdate)),ROW()-ROW($B$13))),\"\")","v":""},null,null,null,null,2,":00",null,null,null,null,null,null,null,null,null,null,null,null,null,null,null,null,{"$f":"IFERROR(INDEX(arr_event,SMALL(IF(arr_eventdate=$E$3,ROW(arr_eventdate)),ROW()-ROW($B$13))),\"\")","v":""},null,null,null,null,2,":00"]
[null,{"$f":"IFERROR(INDEX(arr_event,SMALL(IF(arr_eventdate=$E$3,ROW(arr_eventdate)),ROW()-ROW($B$13))),\"\")","v":""},null,null,null,null,null,":30",null,null,null,null,null,null,null,null,null,null,null,null,null,null,null,null,{"$f":"IFERROR(INDEX(arr_event,SMALL(IF(arr_eventdate=$E$3,ROW(arr_eventdate)),ROW()-ROW($B$13))),\"\")","v":""},null,null,null,null,null,":30"]
[null,{"$f":"IFERROR(INDEX(arr_event,SMALL(IF(arr_eventdate=$E$3,ROW(arr_eventdate)),ROW()-ROW($B$13))),\"\")","v":""},null,null,null,null,3,":00",null,null,null,null,null,null,null,null,null,null,null,null,null,null,null,null,{"$f":"IFERROR(INDEX(arr_event,SMALL(IF(arr_eventdate=$E$3,ROW(arr_eventdate)),ROW()-ROW($B$13))),\"\")","v":""},null,null,null,null,3,":00"]
[null,null,null,null,null,null,null,":30",null,null,null,null,null,null,null,null,null,null,null,null,null,null,null,null,null,null,null,null,null,null,":30"]
[null,"$Amt",null,"Expenses",null,null,4,":00",null,null,null,null,null,null,null,null,null,null,null,null,null,null,null,null,"$Amt",null,"Expenses",null,null,4,":00"]
[null,null,null,null,null,null,null,":30",null,null,null,null,null,null,null,null,null,null,null,null,null,null,null,null,null,null,null,null,null,null,":30"]
[null,null,null,null,null,null,5,":00",null,null,null,null,null,null,null,null,null,null,null,null,null,null,null,null,null,null,null,null,null,5,":00"]
[null,null,null,null,null,null,null,":30",null,null,null,null,null,null,null,null,null,null,null,null,null,null,null,null,null,null,null,null,null,null,":30"]
[null,null,null,null,null,null,6,":00",null,null,null,null,null,null,null,null,null,null,null,null,null,null,null,null,null,null,null,null,null,6,":00"]
[null,null,null,null,null,null,null,":30",null,null,null,null,null,null,null,null,null,null,null,null,null,null,null,null,null,null,null,null,null,null,":30"]
[]
[null,"Planned cases for today",null,null,null,null,null,":30",null,null,null,null,null,null,null,null,null,null,null,null,null,null,null,null,"Planned cases for today",null,null,null,null,null,":30"]
[null,"Case",null,null,null,"Action",null,null,null,null,null,null,null,null,null,null,null,null,null,"Follow-up",null,null,null,null,"Case",null,null,null,"Action",null,null,null,null,null,null,null,null,null,null,null,null,null,"Follow-up"]

{"sheet":"Days15-16","index":9,"n_rows":40,"n_cols":46,"rows_kept":40,"cut":false,"hidden":false,"merged":[[56,24,56,27],[56,28,56,41],[56,42,56,45],[57,24,57,27],[57,28,57,41],[57,42,57,45],[52,42,52,45],[53,24,53,27],[53,28,53,41],[53,42,53,45],[54,24,54,27],[54,28,54,41],[54,42,54,45],[55,24,55,27],[55,28,55,41],[55,42,55,45],[48,42,48,45],[49,24,49,27],[49,28,49,41],[49,42,49,45],[50,24,50,27],[50,28,50,41],[50,42,50,45],[51,24,51,27],[51,28,51,41],[51,42,51,45],[44,42,44,45],[45,24,45,27],[45,28,45,41],[45,42,45,45],[46,24,46,27],[46,28,46,41],[46,42,46,45],[47,24,47,27],[47,28,47,41],[47,42,47,45],[40,42,40,45],[41,24,41,27],[41,28,41,41],[41,42,41,45],[42,24,42,27],[42,28,42,41],[42,42,42,45],[43,24,43,27],[43,28,43,41],[43,42,43,45],[57,1,57,4],[57,5,57,18],[57,19,57,22],[58,1,58,4],[58,5,58,18],[58,19,58,22],[29,24,29,25],[31,24,31,25],[31,26,31,27],[32,24,32,25],[32,26,32,27],[33,24,33,25],[33,26,33,27],[34,24,34,25],[34,26,34,27],[35,24,35,25],[35,26,35,27],[36,24,36,25],[36,26,36,27],[38,24,38,45],[39,24,39,27],[39,28,39,41],[39,42,39,45],[40,24,40,27],[0,32,0,33],[2,1,5,3],[2,4,3,7],[2,8,2,14],[2,16,2,22],[2,24,5,26],[2,27,3,30],[2,31,2,37],[29,1,29,2],[13,6,14,6],[13,29,14,29],[15,6,16,6],[15,29,16,29],[17,6,18,6],[17,29,18,29],[2,39,2,45],[4,4,5,6],[4,27,5,29],[6,5,6,6],[6,28,6,29],[12,1,12,4],[12,16,12,22],[12,24,12,27],[12,39,12,45],[22,24,22,25],[22,26,22,27],[23,1,23,2],[23,3,23,4],[23,6,24,6],[23,24,23,25],[23,26,23,27],[19,6,20,6],[19,29,20,29],[21,1,21,2],[21,3,21,4],[21,6,22,6],[21,24,21,25],[21,26,21,27],[21,29,22,29],[22,1,22,2],[22,3,22,4],[23,29,24,29],[24,1,24,2],[24,3,24,4],[24,24,24,25],[24,26,24,27],[25,1,25,2],[25,3,25,4],[25,6,26,6],[25,24,25,25],[25,26,25,27],[25,29,26,29],[26,1,26,2],[26,3,26,4],[26,24,26,25],[26,26,26,27],[27,1,27,2],[27,3,27,4],[27,6,28,6],[27,24,27,25],[27,26,27,27],[27,29,28,29],[28,1,28,2],[28,3,28,4],[28,24,28,25],[28,26,28,27],[29,3,29,4],[29,6,30,6],[29,26,29,27],[29,29,30,29],[31,6,32,6],[31,29,32,29],[33,6,34,6],[33,29,34,29],[35,6,36,6],[35,29,36,29],[40,5,40,18],[40,19,40,22],[41,5,41,18],[41,19,41,22],[42,5,42,18],[42,19,42,22],[40,28,40,41],[42,1,42,4],[43,1,43,4],[43,5,43,18],[43,19,43,22],[44,24,44,27],[44,28,44,41],[31,1,31,2],[31,3,31,4],[40,1,40,4],[41,1,41,4],[44,1,44,4],[44,5,44,18],[44,19,44,22],[45,1,45,4],[45,5,45,18],[45,19,45,22],[46,1,46,4],[46,5,46,18],[46,19,46,22],[47,1,47,4],[47,5,47,18],[47,19,47,22],[32,1,32,2],[32,3,32,4],[33,1,33,2],[33,3,33,4],[48,1,48,4],[48,5,48,18],[48,19,48,22],[49,1,49,4],[49,5,49,18],[49,19,49,22],[50,1,50,4],[50,5,50,18],[50,19,50,22],[51,1,51,4],[51,5,51,18],[51,19,51,22],[48,24,48,27],[48,28,48,41],[34,1,34,2],[34,3,34,4],[35,1,35,2],[35,3,35,4],[52,1,52,4],[52,5,52,18],[52,19,52,22],[53,1,53,4],[53,5,53,18],[53,19,53,22],[52,24,52,27],[52,28,52,41],[39,1,39,4],[39,5,39,18],[39,19,39,22],[58,24,58,27],[58,28,58,41],[58,42,58,45],[36,1,36,2],[36,3,36,4],[38,1,38,22],[54,1,54,4],[54,5,54,18],[54,19,54,22],[55,1,55,4],[55,5,55,18],[55,19,55,22],[56,1,56,4],[56,5,56,18],[56,19,56,22],[61,1,61,4],[61,5,61,18],[61,19,61,22],[61,24,61,27],[61,28,61,41],[61,42,61,45],[59,1,59,4],[59,5,59,18],[59,19,59,22],[59,24,59,27],[59,28,59,41],[59,42,59,45],[62,1,62,4],[62,5,62,18],[62,19,62,22],[62,24,62,27],[62,28,62,41],[62,42,62,45]]}
[]
[]
[null,{"$f":"DAY(E3)","v":14},null,null,{"$f":"'Days13-14'!AB3+1","v":"2024-05-14"},null,null,null,{"$f":"DATE(YEAR($E$3),MONTH($E$3),1)","v":"2024-05-01"},null,null,null,null,null,null,null,{"$f":"DATE(YEAR(I3+35),MONTH(I3+35),1)","v":"2024-06-01"},null,null,null,null,null,null,null,{"$f":"DAY(AB3)","v":15},null,null,{"$f":"E3+1","v":"2024-05-15"},null,null,null,{"$f":"DATE(YEAR(AB3),MONTH(AB3),1)","v":"2024-05-01"},null,null,null,null,null,null,null,{"$f":"DATE(YEAR(AF3+35),MONTH(AF3+35),1)","v":"2024-06-01"}]
[null,null,null,null,null,null,null,null,{"$f":"CHOOSE(1+MOD('Days1-2'!J1+1-2,7),\"Su\",\"M\",\"Tu\",\"W\",\"Th\",\"F\",\"Sa\")","v":"Su"},{"$f":"CHOOSE(1+MOD('Days1-2'!$J$1+2-2,7),\"Su\",\"M\",\"Tu\",\"W\",\"Th\",\"F\",\"Sa\")","v":"M"},{"$f":"CHOOSE(1+MOD('Days1-2'!$J$1+3-2,7),\"Su\",\"M\",\"Tu\",\"W\",\"Th\",\"F\",\"Sa\")","v":"Tu"},{"$f":"CHOOSE(1+MOD('Days1-2'!$J$1+4-2,7),\"Su\",\"M\",\"Tu\",\"W\",\"Th\",\"F\",\"Sa\")","v":"W"},{"$f":"CHOOSE(1+MOD('Days1-2'!$J$1+5-2,7),\"Su\",\"M\",\"Tu\",\"W\",\"Th\",\"F\",\"Sa\")","v":"Th"},{"$f":"CHOOSE(1+MOD('Days1-2'!$J$1+6-2,7),\"Su\",\"M\",\"Tu\",\"W\",\"Th\",\"F\",\"Sa\")","v":"F"},{"$f":"CHOOSE(1+MOD('Days1-2'!$J$1+7-2,7),\"Su\",\"M\",\"Tu\",\"W\",\"Th\",\"F\",\"Sa\")","v":"Sa"},null,{"$f":"CHOOSE(1+MOD('Days1-2'!J1+1-2,7),\"Su\",\"M\",\"Tu\",\"W\",\"Th\",\"F\",\"Sa\")","v":"Su"},{"$f":"CHOOSE(1+MOD('Days1-2'!J1+2-2,7),\"Su\",\"M\",\"Tu\",\"W\",\"Th\",\"F\",\"Sa\")","v":"M"},{"$f":"CHOOSE(1+MOD('Days1-2'!J1+3-2,7),\"Su\",\"M\",\"Tu\",\"W\",\"Th\",\"F\",\"Sa\")","v":"Tu"},{"$f":"CHOOSE(1+MOD('Days1-2'!J1+4-2,7),\"Su\",\"M\",\"Tu\",\"W\",\"Th\",\"F\",\"Sa\")","v":"W"},{"$f":"CHOOSE(1+MOD('Days1-2'!J1+5-2,7),\"Su\",\"M\",\"Tu\",\"W\",\"Th\",\"F\",\"Sa\")","v":"Th"},{"$f":"CHOOSE(1+MOD('Days1-2'!J1+6-2,7),\"Su\",\"M\",\"Tu\",\"W\",\"Th\",\"F\",\"Sa\")","v":"F"},{"$f":"CHOOSE(1+MOD('Days1-2'!J1+7-2,7),\"Su\",\"M\",\"Tu\",\"W\",\"Th\",\"F\",\"Sa\")","v":"Sa"},null,null,null,null,null,null,null,null,{"$f":"CHOOSE(1+MOD('Days1-2'!$J$1+1-2,7),\"Su\",\"M\",\"Tu\",\"W\",\"Th\",\"F\",\"Sa\")","v":"Su"},{"$f":"CHOOSE(1+MOD('Days1-2'!$J$1+2-2,7),\"Su\",\"M\",\"Tu\",\"W\",\"Th\",\"F\",\"Sa\")","v":"M"},{"$f":"CHOOSE(1+MOD('Days1-2'!$J$1+3-2,7),\"Su\",\"M\",\"Tu\",\"W\",\"Th\",\"F\",\"Sa\")","v":"Tu"},{"$f":"CHOOSE(1+MOD('Days1-2'!$J$1+4-2,7),\"Su\",\"M\",\"Tu\",\"W\",\"Th\",\"F\",\"Sa\")","v":"W"},{"$f":"CHOOSE(1+MOD('Days1-2'!$J$1+5-2,7),\"Su\",\"M\",\"Tu\",\"W\",\"Th\",\"F\",\"Sa\")","v":"Th"},{"$f":"CHOOSE(1+MOD('Days1-2'!$J$1+6-2,7),\"Su\",\"M\",\"Tu\",\"W\",\"Th\",\"F\",\"Sa\")","v":"F"},{"$f":"CHOOSE(1+MOD('Days1-2'!$J$1+7-2,7),\"Su\",\"M\",\"Tu\",\"W\",\"Th\",\"F\",\"Sa\")","v":"Sa"},null,{"$f":"CHOOSE(1+MOD('Days1-2'!$J$1+1-2,7),\"Su\",\"M\",\"Tu\",\"W\",\"Th\",\"F\",\"Sa\")","v":"Su"},{"$f":"CHOOSE(1+MOD('Days1-2'!$J$1+2-2,7),\"Su\",\"M\",\"Tu\",\"W\",\"Th\",\"F\",\"Sa\")","v":"M"},{"$f":"CHOOSE(1+MOD('Days1-2'!$J$1+3-2,7),\"Su\",\"M\",\"Tu\",\"W\",\"Th\",\"F\",\"Sa\")","v":"Tu"},{"$f":"CHOOSE(1+MOD('Days1-2'!$J$1+4-2,7),\"Su\",\"M\",\"Tu\",\"W\",\"Th\",\"F\",\"Sa\")","v":"W"},{"$f":"CHOOSE(1+MOD('Days1-2'!$J$1+5-2,7),\"Su\",\"M\",\"Tu\",\"W\",\"Th\",\"F\",\"Sa\")","v":"Th"},{"$f":"CHOOSE(1+MOD('Days1-2'!$J$1+6-2,7),\"Su\",\"M\",\"Tu\",\"W\",\"Th\",\"F\",\"Sa\")","v":"F"},{"$f":"CHOOSE(1+MOD('Days1-2'!$J$1+7-2,7),\"Su\",\"M\",\"Tu\",\"W\",\"Th\",\"F\",\"Sa\")","v":"Sa"}]
[null,null,null,null,{"$f":"INDEX({\"Sunday\",\"Monday\",\"Tuesday\",\"Wednesday\",\"Thursday\",\"Friday\",\"Saturday\"},WEEKDAY(E3))","v":"Tuesday"},null,null,null,{"$f":"IF(WEEKDAY(I3,1)='Days1-2'!$J$1,I3,\"\")","v":""},{"$f":"IF(I5=\"\",IF(WEEKDAY(I3,1)=MOD('Days1-2'!$J$1,7)+1,I3,\"\"),I5+1)","v":""},{"$f":"IF(J5=\"\",IF(WEEKDAY(I3,1)=MOD('Days1-2'!$J$1+1,7)+1,I3,\"\"),J5+1)","v":""},{"$f":"IF(K5=\"\",IF(WEEKDAY(I3,1)=MOD('Days1-2'!$J$1+2,7)+1,I3,\"\"),K5+1)","v":"2024-05-01"},{"$f":"IF(L5=\"\",IF(WEEKDAY(I3,1)=MOD('Days1-2'!$J$1+3,7)+1,I3,\"\"),L5+1)","v":"2024-05-02"},{"$f":"IF(M5=\"\",IF(WEEKDAY(I3,1)=MOD('Days1-2'!$J$1+4,7)+1,I3,\"\"),M5+1)","v":"2024-05-03"},{"$f":"IF(N5=\"\",IF(WEEKDAY(I3,1)=MOD('Days1-2'!$J$1+5,7)+1,I3,\"\"),N5+1)","v":"2024-05-04"},null,{"$f":"IF(WEEKDAY(Q3,1)='Days1-2'!$J$1,Q3,\"\")","v":""},{"$f":"IF(Q5=\"\",IF(WEEKDAY(Q3,1)=MOD('Days1-2'!$J$1,7)+1,Q3,\"\"),Q5+1)","v":""},{"$f":"IF(R5=\"\",IF(WEEKDAY(Q3,1)=MOD('Days1-2'!$J$1+1,7)+1,Q3,\"\"),R5+1)","v":""},{"$f":"IF(S5=\"\",IF(WEEKDAY(Q3,1)=MOD('Days1-2'!$J$1+2,7)+1,Q3,\"\"),S5+1)","v":""},{"$f":"IF(T5=\"\",IF(WEEKDAY(Q3,1)=MOD('Days1-2'!$J$1+3,7)+1,Q3,\"\"),T5+1)","v":""},{"$f":"IF(U5=\"\",IF(WEEKDAY(Q3,1)=MOD('Days1-2'!$J$1+4,7)+1,Q3,\"\"),U5+1)","v":""},{"$f":"IF(V5=\"\",IF(WEEKDAY(Q3,1)=MOD('Days1-2'!$J$1+5,7)+1,Q3,\"\"),V5+1)","v":"2024-06-01"},null,null,null,null,{"$f":"INDEX({\"Sunday\",\"Monday\",\"Tuesday\",\"Wednesday\",\"Thursday\",\"Friday\",\"Saturday\"},WEEKDAY(AB3))","v":"Wednesday"},null,null,null,{"$f":"IF(WEEKDAY(AF3,1)='Days1-2'!$J$1,AF3,\"\")","v":""},{"$f":"IF(AF5=\"\",IF(WEEKDAY(AF3,1)=MOD('Days1-2'!$J$1,7)+1,AF3,\"\"),AF5+1)","v":""},{"$f":"IF(AG5=\"\",IF(WEEKDAY(AF3,1)=MOD('Days1-2'!$J$1+1,7)+1,AF3,\"\"),AG5+1)","v":""},{"$f":"IF(AH5=\"\",IF(WEEKDAY(AF3,1)=MOD('Days1-2'!$J$1+2,7)+1,AF3,\"\"),AH5+1)","v":"2024-05-01"},{"$f":"IF(AI5=\"\",IF(WEEKDAY(AF3,1)=MOD('Days1-2'!$J$1+3,7)+1,AF3,\"\"),AI5+1)","v":"2024-05-02"},{"$f":"IF(AJ5=\"\",IF(WEEKDAY(AF3,1)=MOD('Days1-2'!$J$1+4,7)+1,AF3,\"\"),AJ5+1)","v":"2024-05-03"},{"$f":"IF(AK5=\"\",IF(WEEKDAY(AF3,1)=MOD('Days1-2'!$J$1+5,7)+1,AF3,\"\"),AK5+1)","v":"2024-05-04"},null,{"$f":"IF(WEEKDAY(AN3,1)='Days1-2'!$J$1,AN3,\"\")","v":""},{"$f":"IF(AN5=\"\",IF(WEEKDAY(AN3,1)=MOD('Days1-2'!$J$1,7)+1,AN3,\"\"),AN5+1)","v":""},{"$f":"IF(AO5=\"\",IF(WEEKDAY(AN3,1)=MOD('Days1-2'!$J$1+1,7)+1,AN3,\"\"),AO5+1)","v":""},{"$f":"IF(AP5=\"\",IF(WEEKDAY(AN3,1)=MOD('Days1-2'!$J$1+2,7)+1,AN3,\"\"),AP5+1)","v":""},{"$f":"IF(AQ5=\"\",IF(WEEKDAY(AN3,1)=MOD('Days1-2'!$J$1+3,7)+1,AN3,\"\"),AQ5+1)","v":""},{"$f":"IF(AR5=\"\",IF(WEEKDAY(AN3,1)=MOD('Days1-2'!$J$1+4,7)+1,AN3,\"\"),AR5+1)","v":""},{"$f":"IF(AS5=\"\",IF(WEEKDAY(AN3,1)=MOD('Days1-2'!$J$1+5,7)+1,AN3,\"\"),AS5+1)","v":"2024-06-01"}]
[null,null,null,null,null,null,null,null,{"$f":"IF(O5=\"\",\"\",IF(MONTH(O5+1)<>MONTH(O5),\"\",O5+1))","v":"2024-05-05"},{"$f":"IF(I6=\"\",\"\",IF(MONTH(I6+1)<>MONTH(I6),\"\",I6+1))","v":"2024-05-06"},{"$f":"IF(J6=\"\",\"\",IF(MONTH(J6+1)<>MONTH(J6),\"\",J6+1))","v":"2024-05-07"},{"$f":"IF(K6=\"\",\"\",IF(MONTH(K6+1)<>MONTH(K6),\"\",K6+1))","v":"2024-05-08"},"2024-05-09","2024-05-10","2024-05-11",null,{"$f":"IF(W5=\"\",\"\",IF(MONTH(W5+1)<>MONTH(W5),\"\",W5+1))","v":"2024-06-02"},{"$f":"IF(Q6=\"\",\"\",IF(MONTH(Q6+1)<>MONTH(Q6),\"\",Q6+1))","v":"2024-06-03"},{"$f":"IF(R6=\"\",\"\",IF(MONTH(R6+1)<>MONTH(R6),\"\",R6+1))","v":"2024-06-04"},{"$f":"IF(S6=\"\",\"\",IF(MONTH(S6+1)<>MONTH(S6),\"\",S6+1))","v":"2024-06-05"},{"$f":"IF(T6=\"\",\"\",IF(MONTH(T6+1)<>MONTH(T6),\"\",T6+1))","v":"2024-06-06"},"2024-06-07","2024-06-08",null,null,null,null,null,null,null,null,{"$f":"IF(AL5=\"\",\"\",IF(MONTH(AL5+1)<>MONTH(AL5),\"\",AL5+1))","v":"2024-05-05"},{"$f":"IF(AF6=\"\",\"\",IF(MONTH(AF6+1)<>MONTH(AF6),\"\",AF6+1))","v":"2024-05-06"},{"$f":"IF(AG6=\"\",\"\",IF(MONTH(AG6+1)<>MONTH(AG6),\"\",AG6+1))","v":"2024-05-07"},{"$f":"IF(AH6=\"\",\"\",IF(MONTH(AH6+1)<>MONTH(AH6),\"\",AH6+1))","v":"2024-05-08"},{"$f":"IF(AI6=\"\",\"\",IF(MONTH(AI6+1)<>MONTH(AI6),\"\",AI6+1))","v":"2024-05-09"},"2024-05-10","2024-05-11",null,{"$f":"IF(AT5=\"\",\"\",IF(MONTH(AT5+1)<>MONTH(AT5),\"\",AT5+1))","v":"2024-06-02"},{"$f":"IF(AN6=\"\",\"\",IF(MONTH(AN6+1)<>MONTH(AN6),\"\",AN6+1))","v":"2024-06-03"},{"$f":"IF(AO6=\"\",\"\",IF(MONTH(AO6+1)<>MONTH(AO6),\"\",AO6+1))","v":"2024-06-04"},{"$f":"IF(AP6=\"\",\"\",IF(MONTH(AP6+1)<>MONTH(AP6),\"\",AP6+1))","v":"2024-06-05"},{"$f":"IF(AQ6=\"\",\"\",IF(MONTH(AQ6+1)<>MONTH(AQ6),\"\",AQ6+1))","v":"2024-06-06"},"2024-06-07","2024-06-08"]
[null,{"$f":"IFERROR(INDEX(arr_holiday,SMALL(IF(arr_holidaydate=$E$3,ROW(arr_holidaydate)),ROW()-ROW($B$6))),\"\")","v":""},null,null,null,null,null,null,{"$f":"IF(O6=\"\",\"\",IF(MONTH(O6+1)<>MONTH(O6),\"\",O6+1))","v":"2024-05-12"},{"$f":"IF(I7=\"\",\"\",IF(MONTH(I7+1)<>MONTH(I7),\"\",I7+1))","v":"2024-05-13"},"2024-05-14","2024-05-15","2024-05-16","2024-05-17","2024-05-18",null,{"$f":"IF(W6=\"\",\"\",IF(MONTH(W6+1)<>MONTH(W6),\"\",W6+1))","v":"2024-06-09"},{"$f":"IF(Q7=\"\",\"\",IF(MONTH(Q7+1)<>MONTH(Q7),\"\",Q7+1))","v":"2024-06-10"},"2024-06-11","2024-06-12","2024-06-13","2024-06-14","2024-06-15",null,{"$f":"IFERROR(INDEX(arr_holiday,SMALL(IF(arr_holidaydate=$AB$3,ROW(arr_holidaydate)),ROW()-ROW($B$6))),\"\")","v":""},null,null,null,null,null,null,{"$f":"IF(AL6=\"\",\"\",IF(MONTH(AL6+1)<>MONTH(AL6),\"\",AL6+1))","v":"2024-05-12"},{"$f":"IF(AF7=\"\",\"\",IF(MONTH(AF7+1)<>MONTH(AF7),\"\",AF7+1))","v":"2024-05-13"},"2024-05-14","2024-05-15","2024-05-16","2024-05-17","2024-05-18",null,{"$f":"IF(AT6=\"\",\"\",IF(MONTH(AT6+1)<>MONTH(AT6),\"\",AT6+1))","v":"2024-06-09"},{"$f":"IF(AN7=\"\",\"\",IF(MONTH(AN7+1)<>MONTH(AN7),\"\",AN7+1))","v":"2024-06-10"},"2024-06-11","2024-06-12","2024-06-13","2024-06-14","2024-06-15"]
[null,{"$f":"IFERROR(INDEX(arr_holiday,SMALL(IF(arr_holidaydate=$E$3,ROW(arr_holidaydate)),ROW()-ROW($B$6))),\"\")","v":""},null,null,null,null,null,null,"2024-05-19","2024-05-20","2024-05-21","2024-05-22","2024-05-23","2024-05-24","2024-05-25",null,"2024-06-16","2024-06-17","2024-06-18","2024-06-19","2024-06-20","2024-06-21","2024-06-22",null,{"$f":"IFERROR(INDEX(arr_holiday,SMALL(IF(arr_holidaydate=$AB$3,ROW(arr_holidaydate)),ROW()-ROW($B$6))),\"\")","v":""},null,null,null,null,null,null,"2024-05-19","2024-05-20","2024-05-21","2024-05-22","2024-05-23","2024-05-24","2024-05-25",null,"2024-06-16","2024-06-17","2024-06-18","2024-06-19","2024-06-20","2024-06-21","2024-06-22"]
[null,{"$f":"IFERROR(INDEX(arr_holiday,SMALL(IF(arr_holidaydate=$E$3,ROW(arr_holidaydate)),ROW()-ROW($B$6))),\"\")","v":""},null,null,null,null,null,null,"2024-05-26","2024-05-27","2024-05-28","2024-05-29","2024-05-30","2024-05-31","",null,"2024-06-23","2024-06-24","2024-06-25","2024-06-26","2024-06-27","2024-06-28","2024-06-29",null,{"$f":"IFERROR(INDEX(arr_holiday,SMALL(IF(arr_holidaydate=$AB$3,ROW(arr_holidaydate)),ROW()-ROW($B$6))),\"\")","v":""},null,null,null,null,null,null,"2024-05-26","2024-05-27","2024-05-28","2024-05-29","2024-05-30","2024-05-31","",null,"2024-06-23","2024-06-24","2024-06-25","2024-06-26","2024-06-27","2024-06-28","2024-06-29"]
[null,{"$f":"IFERROR(INDEX(arr_event,SMALL(IF(arr_eventdate=$E$3,ROW(arr_eventdate)),ROW()-ROW($B$9))),\"\")","v":""},null,null,null,null,null,null,"","","","","","","",null,"2024-06-30","","","","","","",null,{"$f":"IFERROR(INDEX(arr_event,SMALL(IF(arr_eventdate=$AB$3,ROW(arr_eventdate)),ROW()-ROW($B$9))),\"\")","v":""},null,null,null,null,null,null,"","","","","","","",null,"2024-06-30","","","","","",""]
[null,{"$f":"IFERROR(INDEX(arr_event,SMALL(IF(arr_eventdate=$E$3,ROW(arr_eventdate)),ROW()-ROW($B$9))),\"\")","v":""},null,null,null,null,null,null,null,null,null,null,null,null,null,null,null,null,null,null,null,null,null,null,{"$f":"IFERROR(INDEX(arr_event,SMALL(IF(arr_eventdate=$AB$3,ROW(arr_eventdate)),ROW()-ROW($B$9))),\"\")","v":""}]
[null,{"$f":"IFERROR(INDEX(arr_event,SMALL(IF(arr_eventdate=$E$3,ROW(arr_eventdate)),ROW()-ROW($B$9))),\"\")","v":""},null,null,null,null,null,null,null,null,null,null,null,null,null,null,null,null,null,null,null,null,null,null,{"$f":"IFERROR(INDEX(arr_event,SMALL(IF(arr_eventdate=$AB$3,ROW(arr_eventdate)),ROW()-ROW($B$9))),\"\")","v":""}]
[null,"Reminders",null,null,null,null,null,null,"Appointments",null,null,null,null,null,null,null,"Notes",null,null,null,null,null,null,null,"Reminders",null,null,null,null,null,null,"Appointments",null,null,null,null,null,null,null,"Notes"]
[null,{"$f":"IFERROR(INDEX(arr_event,SMALL(IF(arr_eventdate=$E$3,ROW(arr_eventdate)),ROW()-ROW($B$13))),\"\")","v":""},null,null,null,null,7,":00",null,null,null,null,null,null,null,null,null,null,null,null,null,null,null,null,{"$f":"IFERROR(INDEX(arr_event,SMALL(IF(arr_eventdate=$E$3,ROW(arr_eventdate)),ROW()-ROW($B$13))),\"\")","v":""},null,null,null,null,7,":00"]
[null,"",null,null,null,null,null,":30",null,null,null,null,null,null,null,null,null,null,null,null,null,null,null,null,"",null,null,null,null,null,":30"]
[null,"",null,null,null,null,8,":00",null,null,null,null,null,null,null,null,null,null,null,null,null,null,null,null,"",null,null,null,null,8,":00"]
[null,"",null,null,null,null,null,":30",null,null,null,null,null,null,null,null,null,null,null,null,null,null,null,null,"",null,null,null,null,null,":30"]
[null,"",null,null,null,null,9,":00",null,null,null,null,null,null,null,null,null,null,null,null,null,null,null,null,"",null,null,null,null,9,":00"]
[null,"",null,null,null,null,null,":30",null,null,null,null,null,null,null,null,null,null,null,null,null,null,null,null,"",null,null,null,null,null,":30"]
[null,"",null,null,null,null,10,":00",null,null,null,null,null,null,null,null,null,null,null,null,null,null,null,null,"",null,null,null,null,10,":00"]
[null,"",null,null,null,null,null,":30",null,null,null,null,null,null,null,null,null,null,null,null,null,null,null,null,"",null,null,null,null,null,":30"]
[null,"From",null,"Actions Carried Forward",null,null,11,":00",null,null,null,null,null,null,null,null,null,null,null,null,null,null,null,null,"From",null,"Actions Carried Forward",null,null,11,":00"]
[null,{"$f":"IFERROR(INDEX(arr_event,SMALL(IF(arr_eventdate=$E$3,ROW(arr_eventdate)),ROW()-ROW($B$13))),\"\")","v":""},null,null,null,null,null,":30",null,null,null,null,null,null,null,null,null,null,null,null,null,null,null,null,{"$f":"IFERROR(INDEX(arr_event,SMALL(IF(arr_eventdate=$E$3,ROW(arr_eventdate)),ROW()-ROW($B$13))),\"\")","v":""},null,null,null,null,null,":30"]
[null,{"$f":"IFERROR(INDEX(arr_event,SMALL(IF(arr_eventdate=$E$3,ROW(arr_eventdate)),ROW()-ROW($B$13))),\"\")","v":""},null,null,null,null,12,":00",null,null,null,null,null,null,null,null,null,null,null,null,null,null,null,null,{"$f":"IFERROR(INDEX(arr_event,SMALL(IF(arr_eventdate=$E$3,ROW(arr_eventdate)),ROW()-ROW($B$13))),\"\")","v":""},null,null,null,null,12,":00"]
[null,{"$f":"IFERROR(INDEX(arr_event,SMALL(IF(arr_eventdate=$E$3,ROW(arr_eventdate)),ROW()-ROW($B$13))),\"\")","v":""},null,null,null,null,null,":30",null,null,null,null,null,null,null,null,null,null,null,null,null,null,null,null,{"$f":"IFERROR(INDEX(arr_event,SMALL(IF(arr_eventdate=$E$3,ROW(arr_eventdate)),ROW()-ROW($B$13))),\"\")","v":""},null,null,null,null,null,":30"]
[null,{"$f":"IFERROR(INDEX(arr_event,SMALL(IF(arr_eventdate=$E$3,ROW(arr_eventdate)),ROW()-ROW($B$13))),\"\")","v":""},null,null,null,null,1,":00",null,null,null,null,null,null,null,null,null,null,null,null,null,null,null,null,{"$f":"IFERROR(INDEX(arr_event,SMALL(IF(arr_eventdate=$E$3,ROW(arr_eventdate)),ROW()-ROW($B$13))),\"\")","v":""},null,null,null,null,1,":00"]
[null,{"$f":"IFERROR(INDEX(arr_event,SMALL(IF(arr_eventdate=$E$3,ROW(arr_eventdate)),ROW()-ROW($B$13))),\"\")","v":""},null,null,null,null,null,":30",null,null,null,null,null,null,null,null,null,null,null,null,null,null,null,null,{"$f":"IFERROR(INDEX(arr_event,SMALL(IF(arr_eventdate=$E$3,ROW(arr_eventdate)),ROW()-ROW($B$13))),\"\")","v":""},null,null,null,null,null,":30"]
[null,{"$f":"IFERROR(INDEX(arr_event,SMALL(IF(arr_eventdate=$E$3,ROW(arr_eventdate)),ROW()-ROW($B$13))),\"\")","v":""},null,null,null,null,2,":00",null,null,null,null,null,null,null,null,null,null,null,null,null,null,null,null,{"$f":"IFERROR(INDEX(arr_event,SMALL(IF(arr_eventdate=$E$3,ROW(arr_eventdate)),ROW()-ROW($B$13))),\"\")","v":""},null,null,null,null,2,":00"]
[null,{"$f":"IFERROR(INDEX(arr_event,SMALL(IF(arr_eventdate=$E$3,ROW(arr_eventdate)),ROW()-ROW($B$13))),\"\")","v":""},null,null,null,null,null,":30",null,null,null,null,null,null,null,null,null,null,null,null,null,null,null,null,{"$f":"IFERROR(INDEX(arr_event,SMALL(IF(arr_eventdate=$E$3,ROW(arr_eventdate)),ROW()-ROW($B$13))),\"\")","v":""},null,null,null,null,null,":30"]
[null,{"$f":"IFERROR(INDEX(arr_event,SMALL(IF(arr_eventdate=$E$3,ROW(arr_eventdate)),ROW()-ROW($B$13))),\"\")","v":""},null,null,null,null,3,":00",null,null,null,null,null,null,null,null,null,null,null,null,null,null,null,null,{"$f":"IFERROR(INDEX(arr_event,SMALL(IF(arr_eventdate=$E$3,ROW(arr_eventdate)),ROW()-ROW($B$13))),\"\")","v":""},null,null,null,null,3,":00"]
[null,null,null,null,null,null,null,":30",null,null,null,null,null,null,null,null,null,null,null,null,null,null,null,null,null,null,null,null,null,null,":30"]
[null,"$Amt",null,"Expenses",null,null,4,":00",null,null,null,null,null,null,null,null,null,null,null,null,null,null,null,null,"$Amt",null,"Expenses",null,null,4,":00"]
[null,null,null,null,null,null,null,":30",null,null,null,null,null,null,null,null,null,null,null,null,null,null,null,null,null,null,null,null,null,null,":30"]
[null,null,null,null,null,null,5,":00",null,null,null,null,null,null,null,null,null,null,null,null,null,null,null,null,null,null,null,null,null,5,":00"]
[null,null,null,null,null,null,null,":30",null,null,null,null,null,null,null,null,null,null,null,null,null,null,null,null,null,null,null,null,null,null,":30"]
[null,null,null,null,null,null,6,":00",null,null,null,null,null,null,null,null,null,null,null,null,null,null,null,null,null,null,null,null,null,6,":00"]
[null,null,null,null,null,null,null,":30",null,null,null,null,null,null,null,null,null,null,null,null,null,null,null,null,null,null,null,null,null,null,":30"]
[]
[null,"Planned cases for today",null,null,null,null,null,":30",null,null,null,null,null,null,null,null,null,null,null,null,null,null,null,null,"Planned cases for today",null,null,null,null,null,":30"]
[null,"Case",null,null,null,"Action",null,null,null,null,null,null,null,null,null,null,null,null,null,"Follow-up",null,null,null,null,"Case",null,null,null,"Action",null,null,null,null,null,null,null,null,null,null,null,null,null,"Follow-up"]

{"sheet":"Days17-18","index":10,"n_rows":40,"n_cols":46,"rows_kept":40,"cut":false,"hidden":false,"merged":[[56,24,56,27],[56,28,56,41],[56,42,56,45],[57,24,57,27],[57,28,57,41],[57,42,57,45],[52,42,52,45],[53,24,53,27],[53,28,53,41],[53,42,53,45],[54,24,54,27],[54,28,54,41],[54,42,54,45],[55,24,55,27],[55,28,55,41],[55,42,55,45],[48,42,48,45],[49,24,49,27],[49,28,49,41],[49,42,49,45],[50,24,50,27],[50,28,50,41],[50,42,50,45],[51,24,51,27],[51,28,51,41],[51,42,51,45],[44,42,44,45],[45,24,45,27],[45,28,45,41],[45,42,45,45],[46,24,46,27],[46,28,46,41],[46,42,46,45],[47,24,47,27],[47,28,47,41],[47,42,47,45],[40,42,40,45],[41,24,41,27],[41,28,41,41],[41,42,41,45],[42,24,42,27],[42,28,42,41],[42,42,42,45],[43,24,43,27],[43,28,43,41],[43,42,43,45],[57,1,57,4],[57,5,57,18],[57,19,57,22],[58,1,58,4],[58,5,58,18],[58,19,58,22],[29,24,29,25],[31,24,31,25],[31,26,31,27],[32,24,32,25],[32,26,32,27],[33,24,33,25],[33,26,33,27],[34,24,34,25],[34,26,34,27],[35,24,35,25],[35,26,35,27],[36,24,36,25],[36,26,36,27],[38,24,38,45],[39,24,39,27],[39,28,39,41],[39,42,39,45],[40,24,40,27],[0,32,0,33],[2,1,5,3],[2,4,3,7],[2,8,2,14],[2,16,2,22],[2,24,5,26],[2,27,3,30],[2,31,2,37],[29,1,29,2],[13,6,14,6],[13,29,14,29],[15,6,16,6],[15,29,16,29],[17,6,18,6],[17,29,18,29],[2,39,2,45],[4,4,5,6],[4,27,5,29],[6,5,6,6],[6,28,6,29],[12,1,12,4],[12,16,12,22],[12,24,12,27],[12,39,12,45],[22,24,22,25],[22,26,22,27],[23,1,23,2],[23,3,23,4],[23,6,24,6],[23,24,23,25],[23,26,23,27],[19,6,20,6],[19,29,20,29],[21,1,21,2],[21,3,21,4],[21,6,22,6],[21,24,21,25],[21,26,21,27],[21,29,22,29],[22,1,22,2],[22,3,22,4],[23,29,24,29],[24,1,24,2],[24,3,24,4],[24,24,24,25],[24,26,24,27],[25,1,25,2],[25,3,25,4],[25,6,26,6],[25,24,25,25],[25,26,25,27],[25,29,26,29],[26,1,26,2],[26,3,26,4],[26,24,26,25],[26,26,26,27],[27,1,27,2],[27,3,27,4],[27,6,28,6],[27,24,27,25],[27,26,27,27],[27,29,28,29],[28,1,28,2],[28,3,28,4],[28,24,28,25],[28,26,28,27],[29,3,29,4],[29,6,30,6],[29,26,29,27],[29,29,30,29],[31,6,32,6],[31,29,32,29],[33,6,34,6],[33,29,34,29],[35,6,36,6],[35,29,36,29],[40,5,40,18],[40,19,40,22],[41,5,41,18],[41,19,41,22],[42,5,42,18],[42,19,42,22],[40,28,40,41],[42,1,42,4],[43,1,43,4],[43,5,43,18],[43,19,43,22],[44,24,44,27],[44,28,44,41],[31,1,31,2],[31,3,31,4],[40,1,40,4],[41,1,41,4],[44,1,44,4],[44,5,44,18],[44,19,44,22],[45,1,45,4],[45,5,45,18],[45,19,45,22],[46,1,46,4],[46,5,46,18],[46,19,46,22],[47,1,47,4],[47,5,47,18],[47,19,47,22],[32,1,32,2],[32,3,32,4],[33,1,33,2],[33,3,33,4],[48,1,48,4],[48,5,48,18],[48,19,48,22],[49,1,49,4],[49,5,49,18],[49,19,49,22],[50,1,50,4],[50,5,50,18],[50,19,50,22],[51,1,51,4],[51,5,51,18],[51,19,51,22],[48,24,48,27],[48,28,48,41],[34,1,34,2],[34,3,34,4],[35,1,35,2],[35,3,35,4],[52,1,52,4],[52,5,52,18],[52,19,52,22],[53,1,53,4],[53,5,53,18],[53,19,53,22],[52,24,52,27],[52,28,52,41],[39,1,39,4],[39,5,39,18],[39,19,39,22],[58,24,58,27],[58,28,58,41],[58,42,58,45],[36,1,36,2],[36,3,36,4],[38,1,38,22],[54,1,54,4],[54,5,54,18],[54,19,54,22],[55,1,55,4],[55,5,55,18],[55,19,55,22],[56,1,56,4],[56,5,56,18],[56,19,56,22],[61,1,61,4],[61,5,61,18],[61,19,61,22],[61,24,61,27],[61,28,61,41],[61,42,61,45],[59,1,59,4],[59,5,59,18],[59,19,59,22],[59,24,59,27],[59,28,59,41],[59,42,59,45],[62,1,62,4],[62,5,62,18],[62,19,62,22],[62,24,62,27],[62,28,62,41],[62,42,62,45]]}
[]
[]
[null,{"$f":"DAY(E3)","v":16},null,null,{"$f":"'Days15-16'!AB3+1","v":"2024-05-16"},null,null,null,{"$f":"DATE(YEAR($E$3),MONTH($E$3),1)","v":"2024-05-01"},null,null,null,null,null,null,null,{"$f":"DATE(YEAR(I3+35),MONTH(I3+35),1)","v":"2024-06-01"},null,null,null,null,null,null,null,{"$f":"DAY(AB3)","v":17},null,null,{"$f":"E3+1","v":"2024-05-17"},null,null,null,{"$f":"DATE(YEAR(AB3),MONTH(AB3),1)","v":"2024-05-01"},null,null,null,null,null,null,null,{"$f":"DATE(YEAR(AF3+35),MONTH(AF3+35),1)","v":"2024-06-01"}]
[null,null,null,null,null,null,null,null,{"$f":"CHOOSE(1+MOD('Days1-2'!J1+1-2,7),\"Su\",\"M\",\"Tu\",\"W\",\"Th\",\"F\",\"Sa\")","v":"Su"},{"$f":"CHOOSE(1+MOD('Days1-2'!$J$1+2-2,7),\"Su\",\"M\",\"Tu\",\"W\",\"Th\",\"F\",\"Sa\")","v":"M"},{"$f":"CHOOSE(1+MOD('Days1-2'!$J$1+3-2,7),\"Su\",\"M\",\"Tu\",\"W\",\"Th\",\"F\",\"Sa\")","v":"Tu"},{"$f":"CHOOSE(1+MOD('Days1-2'!$J$1+4-2,7),\"Su\",\"M\",\"Tu\",\"W\",\"Th\",\"F\",\"Sa\")","v":"W"},{"$f":"CHOOSE(1+MOD('Days1-2'!$J$1+5-2,7),\"Su\",\"M\",\"Tu\",\"W\",\"Th\",\"F\",\"Sa\")","v":"Th"},{"$f":"CHOOSE(1+MOD('Days1-2'!$J$1+6-2,7),\"Su\",\"M\",\"Tu\",\"W\",\"Th\",\"F\",\"Sa\")","v":"F"},{"$f":"CHOOSE(1+MOD('Days1-2'!$J$1+7-2,7),\"Su\",\"M\",\"Tu\",\"W\",\"Th\",\"F\",\"Sa\")","v":"Sa"},null,{"$f":"CHOOSE(1+MOD('Days1-2'!J1+1-2,7),\"Su\",\"M\",\"Tu\",\"W\",\"Th\",\"F\",\"Sa\")","v":"Su"},{"$f":"CHOOSE(1+MOD('Days1-2'!J1+2-2,7),\"Su\",\"M\",\"Tu\",\"W\",\"Th\",\"F\",\"Sa\")","v":"M"},{"$f":"CHOOSE(1+MOD('Days1-2'!J1+3-2,7),\"Su\",\"M\",\"Tu\",\"W\",\"Th\",\"F\",\"Sa\")","v":"Tu"},{"$f":"CHOOSE(1+MOD('Days1-2'!J1+4-2,7),\"Su\",\"M\",\"Tu\",\"W\",\"Th\",\"F\",\"Sa\")","v":"W"},{"$f":"CHOOSE(1+MOD('Days1-2'!J1+5-2,7),\"Su\",\"M\",\"Tu\",\"W\",\"Th\",\"F\",\"Sa\")","v":"Th"},{"$f":"CHOOSE(1+MOD('Days1-2'!J1+6-2,7),\"Su\",\"M\",\"Tu\",\"W\",\"Th\",\"F\",\"Sa\")","v":"F"},{"$f":"CHOOSE(1+MOD('Days1-2'!J1+7-2,7),\"Su\",\"M\",\"Tu\",\"W\",\"Th\",\"F\",\"Sa\")","v":"Sa"},null,null,null,null,null,null,null,null,{"$f":"CHOOSE(1+MOD('Days1-2'!$J$1+1-2,7),\"Su\",\"M\",\"Tu\",\"W\",\"Th\",\"F\",\"Sa\")","v":"Su"},{"$f":"CHOOSE(1+MOD('Days1-2'!$J$1+2-2,7),\"Su\",\"M\",\"Tu\",\"W\",\"Th\",\"F\",\"Sa\")","v":"M"},{"$f":"CHOOSE(1+MOD('Days1-2'!$J$1+3-2,7),\"Su\",\"M\",\"Tu\",\"W\",\"Th\",\"F\",\"Sa\")","v":"Tu"},{"$f":"CHOOSE(1+MOD('Days1-2'!$J$1+4-2,7),\"Su\",\"M\",\"Tu\",\"W\",\"Th\",\"F\",\"Sa\")","v":"W"},{"$f":"CHOOSE(1+MOD('Days1-2'!$J$1+5-2,7),\"Su\",\"M\",\"Tu\",\"W\",\"Th\",\"F\",\"Sa\")","v":"Th"},{"$f":"CHOOSE(1+MOD('Days1-2'!$J$1+6-2,7),\"Su\",\"M\",\"Tu\",\"W\",\"Th\",\"F\",\"Sa\")","v":"F"},{"$f":"CHOOSE(1+MOD('Days1-2'!$J$1+7-2,7),\"Su\",\"M\",\"Tu\",\"W\",\"Th\",\"F\",\"Sa\")","v":"Sa"},null,{"$f":"CHOOSE(1+MOD('Days1-2'!$J$1+1-2,7),\"Su\",\"M\",\"Tu\",\"W\",\"Th\",\"F\",\"Sa\")","v":"Su"},{"$f":"CHOOSE(1+MOD('Days1-2'!$J$1+2-2,7),\"Su\",\"M\",\"Tu\",\"W\",\"Th\",\"F\",\"Sa\")","v":"M"},{"$f":"CHOOSE(1+MOD('Days1-2'!$J$1+3-2,7),\"Su\",\"M\",\"Tu\",\"W\",\"Th\",\"F\",\"Sa\")","v":"Tu"},{"$f":"CHOOSE(1+MOD('Days1-2'!$J$1+4-2,7),\"Su\",\"M\",\"Tu\",\"W\",\"Th\",\"F\",\"Sa\")","v":"W"},{"$f":"CHOOSE(1+MOD('Days1-2'!$J$1+5-2,7),\"Su\",\"M\",\"Tu\",\"W\",\"Th\",\"F\",\"Sa\")","v":"Th"},{"$f":"CHOOSE(1+MOD('Days1-2'!$J$1+6-2,7),\"Su\",\"M\",\"Tu\",\"W\",\"Th\",\"F\",\"Sa\")","v":"F"},{"$f":"CHOOSE(1+MOD('Days1-2'!$J$1+7-2,7),\"Su\",\"M\",\"Tu\",\"W\",\"Th\",\"F\",\"Sa\")","v":"Sa"}]
[null,null,null,null,{"$f":"INDEX({\"Sunday\",\"Monday\",\"Tuesday\",\"Wednesday\",\"Thursday\",\"Friday\",\"Saturday\"},WEEKDAY(E3))","v":"Thursday"},null,null,null,{"$f":"IF(WEEKDAY(I3,1)='Days1-2'!$J$1,I3,\"\")","v":""},{"$f":"IF(I5=\"\",IF(WEEKDAY(I3,1)=MOD('Days1-2'!$J$1,7)+1,I3,\"\"),I5+1)","v":""},{"$f":"IF(J5=\"\",IF(WEEKDAY(I3,1)=MOD('Days1-2'!$J$1+1,7)+1,I3,\"\"),J5+1)","v":""},{"$f":"IF(K5=\"\",IF(WEEKDAY(I3,1)=MOD('Days1-2'!$J$1+2,7)+1,I3,\"\"),K5+1)","v":"2024-05-01"},{"$f":"IF(L5=\"\",IF(WEEKDAY(I3,1)=MOD('Days1-2'!$J$1+3,7)+1,I3,\"\"),L5+1)","v":"2024-05-02"},{"$f":"IF(M5=\"\",IF(WEEKDAY(I3,1)=MOD('Days1-2'!$J$1+4,7)+1,I3,\"\"),M5+1)","v":"2024-05-03"},{"$f":"IF(N5=\"\",IF(WEEKDAY(I3,1)=MOD('Days1-2'!$J$1+5,7)+1,I3,\"\"),N5+1)","v":"2024-05-04"},null,{"$f":"IF(WEEKDAY(Q3,1)='Days1-2'!$J$1,Q3,\"\")","v":""},{"$f":"IF(Q5=\"\",IF(WEEKDAY(Q3,1)=MOD('Days1-2'!$J$1,7)+1,Q3,\"\"),Q5+1)","v":""},{"$f":"IF(R5=\"\",IF(WEEKDAY(Q3,1)=MOD('Days1-2'!$J$1+1,7)+1,Q3,\"\"),R5+1)","v":""},{"$f":"IF(S5=\"\",IF(WEEKDAY(Q3,1)=MOD('Days1-2'!$J$1+2,7)+1,Q3,\"\"),S5+1)","v":""},{"$f":"IF(T5=\"\",IF(WEEKDAY(Q3,1)=MOD('Days1-2'!$J$1+3,7)+1,Q3,\"\"),T5+1)","v":""},{"$f":"IF(U5=\"\",IF(WEEKDAY(Q3,1)=MOD('Days1-2'!$J$1+4,7)+1,Q3,\"\"),U5+1)","v":""},{"$f":"IF(V5=\"\",IF(WEEKDAY(Q3,1)=MOD('Days1-2'!$J$1+5,7)+1,Q3,\"\"),V5+1)","v":"2024-06-01"},null,null,null,null,{"$f":"INDEX({\"Sunday\",\"Monday\",\"Tuesday\",\"Wednesday\",\"Thursday\",\"Friday\",\"Saturday\"},WEEKDAY(AB3))","v":"Friday"},null,null,null,{"$f":"IF(WEEKDAY(AF3,1)='Days1-2'!$J$1,AF3,\"\")","v":""},{"$f":"IF(AF5=\"\",IF(WEEKDAY(AF3,1)=MOD('Days1-2'!$J$1,7)+1,AF3,\"\"),AF5+1)","v":""},{"$f":"IF(AG5=\"\",IF(WEEKDAY(AF3,1)=MOD('Days1-2'!$J$1+1,7)+1,AF3,\"\"),AG5+1)","v":""},{"$f":"IF(AH5=\"\",IF(WEEKDAY(AF3,1)=MOD('Days1-2'!$J$1+2,7)+1,AF3,\"\"),AH5+1)","v":"2024-05-01"},{"$f":"IF(AI5=\"\",IF(WEEKDAY(AF3,1)=MOD('Days1-2'!$J$1+3,7)+1,AF3,\"\"),AI5+1)","v":"2024-05-02"},{"$f":"IF(AJ5=\"\",IF(WEEKDAY(AF3,1)=MOD('Days1-2'!$J$1+4,7)+1,AF3,\"\"),AJ5+1)","v":"2024-05-03"},{"$f":"IF(AK5=\"\",IF(WEEKDAY(AF3,1)=MOD('Days1-2'!$J$1+5,7)+1,AF3,\"\"),AK5+1)","v":"2024-05-04"},null,{"$f":"IF(WEEKDAY(AN3,1)='Days1-2'!$J$1,AN3,\"\")","v":""},{"$f":"IF(AN5=\"\",IF(WEEKDAY(AN3,1)=MOD('Days1-2'!$J$1,7)+1,AN3,\"\"),AN5+1)","v":""},{"$f":"IF(AO5=\"\",IF(WEEKDAY(AN3,1)=MOD('Days1-2'!$J$1+1,7)+1,AN3,\"\"),AO5+1)","v":""},{"$f":"IF(AP5=\"\",IF(WEEKDAY(AN3,1)=MOD('Days1-2'!$J$1+2,7)+1,AN3,\"\"),AP5+1)","v":""},{"$f":"IF(AQ5=\"\",IF(WEEKDAY(AN3,1)=MOD('Days1-2'!$J$1+3,7)+1,AN3,\"\"),AQ5+1)","v":""},{"$f":"IF(AR5=\"\",IF(WEEKDAY(AN3,1)=MOD('Days1-2'!$J$1+4,7)+1,AN3,\"\"),AR5+1)","v":""},{"$f":"IF(AS5=\"\",IF(WEEKDAY(AN3,1)=MOD('Days1-2'!$J$1+5,7)+1,AN3,\"\"),AS5+1)","v":"2024-06-01"}]
[null,null,null,null,null,null,null,null,{"$f":"IF(O5=\"\",\"\",IF(MONTH(O5+1)<>MONTH(O5),\"\",O5+1))","v":"2024-05-05"},{"$f":"IF(I6=\"\",\"\",IF(MONTH(I6+1)<>MONTH(I6),\"\",I6+1))","v":"2024-05-06"},{"$f":"IF(J6=\"\",\"\",IF(MONTH(J6+1)<>MONTH(J6),\"\",J6+1))","v":"2024-05-07"},{"$f":"IF(K6=\"\",\"\",IF(MONTH(K6+1)<>MONTH(K6),\"\",K6+1))","v":"2024-05-08"},"2024-05-09","2024-05-10","2024-05-11",null,{"$f":"IF(W5=\"\",\"\",IF(MONTH(W5+1)<>MONTH(W5),\"\",W5+1))","v":"2024-06-02"},{"$f":"IF(Q6=\"\",\"\",IF(MONTH(Q6+1)<>MONTH(Q6),\"\",Q6+1))","v":"2024-06-03"},{"$f":"IF(R6=\"\",\"\",IF(MONTH(R6+1)<>MONTH(R6),\"\",R6+1))","v":"2024-06-04"},{"$f":"IF(S6=\"\",\"\",IF(MONTH(S6+1)<>MONTH(S6),\"\",S6+1))","v":"2024-06-05"},{"$f":"IF(T6=\"\",\"\",IF(MONTH(T6+1)<>MONTH(T6),\"\",T6+1))","v":"2024-06-06"},"2024-06-07","2024-06-08",null,null,null,null,null,null,null,null,{"$f":"IF(AL5=\"\",\"\",IF(MONTH(AL5+1)<>MONTH(AL5),\"\",AL5+1))","v":"2024-05-05"},{"$f":"IF(AF6=\"\",\"\",IF(MONTH(AF6+1)<>MONTH(AF6),\"\",AF6+1))","v":"2024-05-06"},{"$f":"IF(AG6=\"\",\"\",IF(MONTH(AG6+1)<>MONTH(AG6),\"\",AG6+1))","v":"2024-05-07"},{"$f":"IF(AH6=\"\",\"\",IF(MONTH(AH6+1)<>MONTH(AH6),\"\",AH6+1))","v":"2024-05-08"},{"$f":"IF(AI6=\"\",\"\",IF(MONTH(AI6+1)<>MONTH(AI6),\"\",AI6+1))","v":"2024-05-09"},"2024-05-10","2024-05-11",null,{"$f":"IF(AT5=\"\",\"\",IF(MONTH(AT5+1)<>MONTH(AT5),\"\",AT5+1))","v":"2024-06-02"},{"$f":"IF(AN6=\"\",\"\",IF(MONTH(AN6+1)<>MONTH(AN6),\"\",AN6+1))","v":"2024-06-03"},{"$f":"IF(AO6=\"\",\"\",IF(MONTH(AO6+1)<>MONTH(AO6),\"\",AO6+1))","v":"2024-06-04"},{"$f":"IF(AP6=\"\",\"\",IF(MONTH(AP6+1)<>MONTH(AP6),\"\",AP6+1))","v":"2024-06-05"},{"$f":"IF(AQ6=\"\",\"\",IF(MONTH(AQ6+1)<>MONTH(AQ6),\"\",AQ6+1))","v":"2024-06-06"},"2024-06-07","2024-06-08"]
[null,{"$f":"IFERROR(INDEX(arr_holiday,SMALL(IF(arr_holidaydate=$E$3,ROW(arr_holidaydate)),ROW()-ROW($B$6))),\"\")","v":""},null,null,null,null,null,null,{"$f":"IF(O6=\"\",\"\",IF(MONTH(O6+1)<>MONTH(O6),\"\",O6+1))","v":"2024-05-12"},{"$f":"IF(I7=\"\",\"\",IF(MONTH(I7+1)<>MONTH(I7),\"\",I7+1))","v":"2024-05-13"},"2024-05-14","2024-05-15","2024-05-16","2024-05-17","2024-05-18",null,{"$f":"IF(W6=\"\",\"\",IF(MONTH(W6+1)<>MONTH(W6),\"\",W6+1))","v":"2024-06-09"},{"$f":"IF(Q7=\"\",\"\",IF(MONTH(Q7+1)<>MONTH(Q7),\"\",Q7+1))","v":"2024-06-10"},"2024-06-11","2024-06-12","2024-06-13","2024-06-14","2024-06-15",null,{"$f":"IFERROR(INDEX(arr_holiday,SMALL(IF(arr_holidaydate=$AB$3,ROW(arr_holidaydate)),ROW()-ROW($B$6))),\"\")","v":""},null,null,null,null,null,null,{"$f":"IF(AL6=\"\",\"\",IF(MONTH(AL6+1)<>MONTH(AL6),\"\",AL6+1))","v":"2024-05-12"},{"$f":"IF(AF7=\"\",\"\",IF(MONTH(AF7+1)<>MONTH(AF7),\"\",AF7+1))","v":"2024-05-13"},"2024-05-14","2024-05-15","2024-05-16","2024-05-17","2024-05-18",null,{"$f":"IF(AT6=\"\",\"\",IF(MONTH(AT6+1)<>MONTH(AT6),\"\",AT6+1))","v":"2024-06-09"},{"$f":"IF(AN7=\"\",\"\",IF(MONTH(AN7+1)<>MONTH(AN7),\"\",AN7+1))","v":"2024-06-10"},"2024-06-11","2024-06-12","2024-06-13","2024-06-14","2024-06-15"]
[null,{"$f":"IFERROR(INDEX(arr_holiday,SMALL(IF(arr_holidaydate=$E$3,ROW(arr_holidaydate)),ROW()-ROW($B$6))),\"\")","v":""},null,null,null,null,null,null,"2024-05-19","2024-05-20","2024-05-21","2024-05-22","2024-05-23","2024-05-24","2024-05-25",null,"2024-06-16","2024-06-17","2024-06-18","2024-06-19","2024-06-20","2024-06-21","2024-06-22",null,{"$f":"IFERROR(INDEX(arr_holiday,SMALL(IF(arr_holidaydate=$AB$3,ROW(arr_holidaydate)),ROW()-ROW($B$6))),\"\")","v":""},null,null,null,null,null,null,"2024-05-19","2024-05-20","2024-05-21","2024-05-22","2024-05-23","2024-05-24","2024-05-25",null,"2024-06-16","2024-06-17","2024-06-18","2024-06-19","2024-06-20","2024-06-21","2024-06-22"]
[null,{"$f":"IFERROR(INDEX(arr_holiday,SMALL(IF(arr_holidaydate=$E$3,ROW(arr_holidaydate)),ROW()-ROW($B$6))),\"\")","v":""},null,null,null,null,null,null,"2024-05-26","2024-05-27","2024-05-28","2024-05-29","2024-05-30","2024-05-31","",null,"2024-06-23","2024-06-24","2024-06-25","2024-06-26","2024-06-27","2024-06-28","2024-06-29",null,{"$f":"IFERROR(INDEX(arr_holiday,SMALL(IF(arr_holidaydate=$AB$3,ROW(arr_holidaydate)),ROW()-ROW($B$6))),\"\")","v":""},null,null,null,null,null,null,"2024-05-26","2024-05-27","2024-05-28","2024-05-29","2024-05-30","2024-05-31","",null,"2024-06-23","2024-06-24","2024-06-25","2024-06-26","2024-06-27","2024-06-28","2024-06-29"]
[null,{"$f":"IFERROR(INDEX(arr_event,SMALL(IF(arr_eventdate=$E$3,ROW(arr_eventdate)),ROW()-ROW($B$9))),\"\")","v":""},null,null,null,null,null,null,"","","","","","","",null,"2024-06-30","","","","","","",null,{"$f":"IFERROR(INDEX(arr_event,SMALL(IF(arr_eventdate=$AB$3,ROW(arr_eventdate)),ROW()-ROW($B$9))),\"\")","v":""},null,null,null,null,null,null,"","","","","","","",null,"2024-06-30","","","","","",""]
[null,{"$f":"IFERROR(INDEX(arr_event,SMALL(IF(arr_eventdate=$E$3,ROW(arr_eventdate)),ROW()-ROW($B$9))),\"\")","v":""},null,null,null,null,null,null,null,null,null,null,null,null,null,null,null,null,null,null,null,null,null,null,{"$f":"IFERROR(INDEX(arr_event,SMALL(IF(arr_eventdate=$AB$3,ROW(arr_eventdate)),ROW()-ROW($B$9))),\"\")","v":""}]
[null,{"$f":"IFERROR(INDEX(arr_event,SMALL(IF(arr_eventdate=$E$3,ROW(arr_eventdate)),ROW()-ROW($B$9))),\"\")","v":""},null,null,null,null,null,null,null,null,null,null,null,null,null,null,null,null,null,null,null,null,null,null,{"$f":"IFERROR(INDEX(arr_event,SMALL(IF(arr_eventdate=$AB$3,ROW(arr_eventdate)),ROW()-ROW($B$9))),\"\")","v":""}]
[null,"Reminders",null,null,null,null,null,null,"Appointments",null,null,null,null,null,null,null,"Notes",null,null,null,null,null,null,null,"Reminders",null,null,null,null,null,null,"Appointments",null,null,null,null,null,null,null,"Notes"]
[null,{"$f":"IFERROR(INDEX(arr_event,SMALL(IF(arr_eventdate=$E$3,ROW(arr_eventdate)),ROW()-ROW($B$13))),\"\")","v":""},null,null,null,null,7,":00",null,null,null,null,null,null,null,null,null,null,null,null,null,null,null,null,{"$f":"IFERROR(INDEX(arr_event,SMALL(IF(arr_eventdate=$E$3,ROW(arr_eventdate)),ROW()-ROW($B$13))),\"\")","v":""},null,null,null,null,7,":00"]
[null,"",null,null,null,null,null,":30",null,null,null,null,null,null,null,null,null,null,null,null,null,null,null,null,"",null,null,null,null,null,":30"]
[null,"",null,null,null,null,8,":00",null,null,null,null,null,null,null,null,null,null,null,null,null,null,null,null,"",null,null,null,null,8,":00"]
[null,"",null,null,null,null,null,":30",null,null,null,null,null,null,null,null,null,null,null,null,null,null,null,null,"",null,null,null,null,null,":30"]
[null,"",null,null,null,null,9,":00",null,null,null,null,null,null,null,null,null,null,null,null,null,null,null,null,"",null,null,null,null,9,":00"]
[null,"",null,null,null,null,null,":30",null,null,null,null,null,null,null,null,null,null,null,null,null,null,null,null,"",null,null,null,null,null,":30"]
[null,"",null,null,null,null,10,":00",null,null,null,null,null,null,null,null,null,null,null,null,null,null,null,null,"",null,null,null,null,10,":00"]
[null,"",null,null,null,null,null,":30",null,null,null,null,null,null,null,null,null,null,null,null,null,null,null,null,"",null,null,null,null,null,":30"]
[null,"From",null,"Actions Carried Forward",null,null,11,":00",null,null,null,null,null,null,null,null,null,null,null,null,null,null,null,null,"From",null,"Actions Carried Forward",null,null,11,":00"]
[null,{"$f":"IFERROR(INDEX(arr_event,SMALL(IF(arr_eventdate=$E$3,ROW(arr_eventdate)),ROW()-ROW($B$13))),\"\")","v":""},null,null,null,null,null,":30",null,null,null,null,null,null,null,null,null,null,null,null,null,null,null,null,{"$f":"IFERROR(INDEX(arr_event,SMALL(IF(arr_eventdate=$E$3,ROW(arr_eventdate)),ROW()-ROW($B$13))),\"\")","v":""},null,null,null,null,null,":30"]
[null,{"$f":"IFERROR(INDEX(arr_event,SMALL(IF(arr_eventdate=$E$3,ROW(arr_eventdate)),ROW()-ROW($B$13))),\"\")","v":""},null,null,null,null,12,":00",null,null,null,null,null,null,null,null,null,null,null,null,null,null,null,null,{"$f":"IFERROR(INDEX(arr_event,SMALL(IF(arr_eventdate=$E$3,ROW(arr_eventdate)),ROW()-ROW($B$13))),\"\")","v":""},null,null,null,null,12,":00"]
[null,{"$f":"IFERROR(INDEX(arr_event,SMALL(IF(arr_eventdate=$E$3,ROW(arr_eventdate)),ROW()-ROW($B$13))),\"\")","v":""},null,null,null,null,null,":30",null,null,null,null,null,null,null,null,null,null,null,null,null,null,null,null,{"$f":"IFERROR(INDEX(arr_event,SMALL(IF(arr_eventdate=$E$3,ROW(arr_eventdate)),ROW()-ROW($B$13))),\"\")","v":""},null,null,null,null,null,":30"]
[null,{"$f":"IFERROR(INDEX(arr_event,SMALL(IF(arr_eventdate=$E$3,ROW(arr_eventdate)),ROW()-ROW($B$13))),\"\")","v":""},null,null,null,null,1,":00",null,null,null,null,null,null,null,null,null,null,null,null,null,null,null,null,{"$f":"IFERROR(INDEX(arr_event,SMALL(IF(arr_eventdate=$E$3,ROW(arr_eventdate)),ROW()-ROW($B$13))),\"\")","v":""},null,null,null,null,1,":00"]
[null,{"$f":"IFERROR(INDEX(arr_event,SMALL(IF(arr_eventdate=$E$3,ROW(arr_eventdate)),ROW()-ROW($B$13))),\"\")","v":""},null,null,null,null,null,":30",null,null,null,null,null,null,null,null,null,null,null,null,null,null,null,null,{"$f":"IFERROR(INDEX(arr_event,SMALL(IF(arr_eventdate=$E$3,ROW(arr_eventdate)),ROW()-ROW($B$13))),\"\")","v":""},null,null,null,null,null,":30"]
[null,{"$f":"IFERROR(INDEX(arr_event,SMALL(IF(arr_eventdate=$E$3,ROW(arr_eventdate)),ROW()-ROW($B$13))),\"\")","v":""},null,null,null,null,2,":00",null,null,null,null,null,null,null,null,null,null,null,null,null,null,null,null,{"$f":"IFERROR(INDEX(arr_event,SMALL(IF(arr_eventdate=$E$3,ROW(arr_eventdate)),ROW()-ROW($B$13))),\"\")","v":""},null,null,null,null,2,":00"]
[null,{"$f":"IFERROR(INDEX(arr_event,SMALL(IF(arr_eventdate=$E$3,ROW(arr_eventdate)),ROW()-ROW($B$13))),\"\")","v":""},null,null,null,null,null,":30",null,null,null,null,null,null,null,null,null,null,null,null,null,null,null,null,{"$f":"IFERROR(INDEX(arr_event,SMALL(IF(arr_eventdate=$E$3,ROW(arr_eventdate)),ROW()-ROW($B$13))),\"\")","v":""},null,null,null,null,null,":30"]
[null,{"$f":"IFERROR(INDEX(arr_event,SMALL(IF(arr_eventdate=$E$3,ROW(arr_eventdate)),ROW()-ROW($B$13))),\"\")","v":""},null,null,null,null,3,":00",null,null,null,null,null,null,null,null,null,null,null,null,null,null,null,null,{"$f":"IFERROR(INDEX(arr_event,SMALL(IF(arr_eventdate=$E$3,ROW(arr_eventdate)),ROW()-ROW($B$13))),\"\")","v":""},null,null,null,null,3,":00"]
[null,null,null,null,null,null,null,":30",null,null,null,null,null,null,null,null,null,null,null,null,null,null,null,null,null,null,null,null,null,null,":30"]
[null,"$Amt",null,"Expenses",null,null,4,":00",null,null,null,null,null,null,null,null,null,null,null,null,null,null,null,null,"$Amt",null,"Expenses",null,null,4,":00"]
[null,null,null,null,null,null,null,":30",null,null,null,null,null,null,null,null,null,null,null,null,null,null,null,null,null,null,null,null,null,null,":30"]
[null,null,null,null,null,null,5,":00",null,null,null,null,null,null,null,null,null,null,null,null,null,null,null,null,null,null,null,null,null,5,":00"]
[null,null,null,null,null,null,null,":30",null,null,null,null,null,null,null,null,null,null,null,null,null,null,null,null,null,null,null,null,null,null,":30"]
[null,null,null,null,null,null,6,":00",null,null,null,null,null,null,null,null,null,null,null,null,null,null,null,null,null,null,null,null,null,6,":00"]
[null,null,null,null,null,null,null,":30",null,null,null,null,null,null,null,null,null,null,null,null,null,null,null,null,null,null,null,null,null,null,":30"]
[]
[null,"Planned cases for today",null,null,null,null,null,":30",null,null,null,null,null,null,null,null,null,null,null,null,null,null,null,null,"Planned cases for today",null,null,null,null,null,":30"]
[null,"Case",null,null,null,"Action",null,null,null,null,null,null,null,null,null,null,null,null,null,"Follow-up",null,null,null,null,"Case",null,null,null,"Action",null,null,null,null,null,null,null,null,null,null,null,null,null,"Follow-up"]

{"sheet":"Days19-20","index":11,"n_rows":40,"n_cols":46,"rows_kept":40,"cut":false,"hidden":false,"merged":[[56,24,56,27],[56,28,56,41],[56,42,56,45],[57,24,57,27],[57,28,57,41],[57,42,57,45],[52,42,52,45],[53,24,53,27],[53,28,53,41],[53,42,53,45],[54,24,54,27],[54,28,54,41],[54,42,54,45],[55,24,55,27],[55,28,55,41],[55,42,55,45],[48,42,48,45],[49,24,49,27],[49,28,49,41],[49,42,49,45],[50,24,50,27],[50,28,50,41],[50,42,50,45],[51,24,51,27],[51,28,51,41],[51,42,51,45],[44,42,44,45],[45,24,45,27],[45,28,45,41],[45,42,45,45],[46,24,46,27],[46,28,46,41],[46,42,46,45],[47,24,47,27],[47,28,47,41],[47,42,47,45],[40,42,40,45],[41,24,41,27],[41,28,41,41],[41,42,41,45],[42,24,42,27],[42,28,42,41],[42,42,42,45],[43,24,43,27],[43,28,43,41],[43,42,43,45],[57,1,57,4],[57,5,57,18],[57,19,57,22],[58,1,58,4],[58,5,58,18],[58,19,58,22],[29,24,29,25],[31,24,31,25],[31,26,31,27],[32,24,32,25],[32,26,32,27],[33,24,33,25],[33,26,33,27],[34,24,34,25],[34,26,34,27],[35,24,35,25],[35,26,35,27],[36,24,36,25],[36,26,36,27],[38,24,38,45],[39,24,39,27],[39,28,39,41],[39,42,39,45],[40,24,40,27],[0,32,0,33],[2,1,5,3],[2,4,3,7],[2,8,2,14],[2,16,2,22],[2,24,5,26],[2,27,3,30],[2,31,2,37],[29,1,29,2],[13,6,14,6],[13,29,14,29],[15,6,16,6],[15,29,16,29],[17,6,18,6],[17,29,18,29],[2,39,2,45],[4,4,5,6],[4,27,5,29],[6,5,6,6],[6,28,6,29],[12,1,12,4],[12,16,12,22],[12,24,12,27],[12,39,12,45],[22,24,22,25],[22,26,22,27],[23,1,23,2],[23,3,23,4],[23,6,24,6],[23,24,23,25],[23,26,23,27],[19,6,20,6],[19,29,20,29],[21,1,21,2],[21,3,21,4],[21,6,22,6],[21,24,21,25],[21,26,21,27],[21,29,22,29],[22,1,22,2],[22,3,22,4],[23,29,24,29],[24,1,24,2],[24,3,24,4],[24,24,24,25],[24,26,24,27],[25,1,25,2],[25,3,25,4],[25,6,26,6],[25,24,25,25],[25,26,25,27],[25,29,26,29],[26,1,26,2],[26,3,26,4],[26,24,26,25],[26,26,26,27],[27,1,27,2],[27,3,27,4],[27,6,28,6],[27,24,27,25],[27,26,27,27],[27,29,28,29],[28,1,28,2],[28,3,28,4],[28,24,28,25],[28,26,28,27],[29,3,29,4],[29,6,30,6],[29,26,29,27],[29,29,30,29],[31,6,32,6],[31,29,32,29],[33,6,34,6],[33,29,34,29],[35,6,36,6],[35,29,36,29],[40,5,40,18],[40,19,40,22],[41,5,41,18],[41,19,41,22],[42,5,42,18],[42,19,42,22],[40,28,40,41],[42,1,42,4],[43,1,43,4],[43,5,43,18],[43,19,43,22],[44,24,44,27],[44,28,44,41],[31,1,31,2],[31,3,31,4],[40,1,40,4],[41,1,41,4],[44,1,44,4],[44,5,44,18],[44,19,44,22],[45,1,45,4],[45,5,45,18],[45,19,45,22],[46,1,46,4],[46,5,46,18],[46,19,46,22],[47,1,47,4],[47,5,47,18],[47,19,47,22],[32,1,32,2],[32,3,32,4],[33,1,33,2],[33,3,33,4],[48,1,48,4],[48,5,48,18],[48,19,48,22],[49,1,49,4],[49,5,49,18],[49,19,49,22],[50,1,50,4],[50,5,50,18],[50,19,50,22],[51,1,51,4],[51,5,51,18],[51,19,51,22],[48,24,48,27],[48,28,48,41],[34,1,34,2],[34,3,34,4],[35,1,35,2],[35,3,35,4],[52,1,52,4],[52,5,52,18],[52,19,52,22],[53,1,53,4],[53,5,53,18],[53,19,53,22],[52,24,52,27],[52,28,52,41],[39,1,39,4],[39,5,39,18],[39,19,39,22],[58,24,58,27],[58,28,58,41],[58,42,58,45],[36,1,36,2],[36,3,36,4],[38,1,38,22],[54,1,54,4],[54,5,54,18],[54,19,54,22],[55,1,55,4],[55,5,55,18],[55,19,55,22],[56,1,56,4],[56,5,56,18],[56,19,56,22],[61,1,61,4],[61,5,61,18],[61,19,61,22],[61,24,61,27],[61,28,61,41],[61,42,61,45],[59,1,59,4],[59,5,59,18],[59,19,59,22],[59,24,59,27],[59,28,59,41],[59,42,59,45],[62,1,62,4],[62,5,62,18],[62,19,62,22],[62,24,62,27],[62,28,62,41],[62,42,62,45]]}
[]
[]
[null,{"$f":"DAY(E3)","v":18},null,null,{"$f":"'Days17-18'!AB3+1","v":"2024-05-18"},null,null,null,{"$f":"DATE(YEAR($E$3),MONTH($E$3),1)","v":"2024-05-01"},null,null,null,null,null,null,null,{"$f":"DATE(YEAR(I3+35),MONTH(I3+35),1)","v":"2024-06-01"},null,null,null,null,null,null,null,{"$f":"DAY(AB3)","v":19},null,null,{"$f":"E3+1","v":"2024-05-19"},null,null,null,{"$f":"DATE(YEAR(AB3),MONTH(AB3),1)","v":"2024-05-01"},null,null,null,null,null,null,null,{"$f":"DATE(YEAR(AF3+35),MONTH(AF3+35),1)","v":"2024-06-01"}]
[null,null,null,null,null,null,null,null,{"$f":"CHOOSE(1+MOD('Days1-2'!J1+1-2,7),\"Su\",\"M\",\"Tu\",\"W\",\"Th\",\"F\",\"Sa\")","v":"Su"},{"$f":"CHOOSE(1+MOD('Days1-2'!$J$1+2-2,7),\"Su\",\"M\",\"Tu\",\"W\",\"Th\",\"F\",\"Sa\")","v":"M"},{"$f":"CHOOSE(1+MOD('Days1-2'!$J$1+3-2,7),\"Su\",\"M\",\"Tu\",\"W\",\"Th\",\"F\",\"Sa\")","v":"Tu"},{"$f":"CHOOSE(1+MOD('Days1-2'!$J$1+4-2,7),\"Su\",\"M\",\"Tu\",\"W\",\"Th\",\"F\",\"Sa\")","v":"W"},{"$f":"CHOOSE(1+MOD('Days1-2'!$J$1+5-2,7),\"Su\",\"M\",\"Tu\",\"W\",\"Th\",\"F\",\"Sa\")","v":"Th"},{"$f":"CHOOSE(1+MOD('Days1-2'!$J$1+6-2,7),\"Su\",\"M\",\"Tu\",\"W\",\"Th\",\"F\",\"Sa\")","v":"F"},{"$f":"CHOOSE(1+MOD('Days1-2'!$J$1+7-2,7),\"Su\",\"M\",\"Tu\",\"W\",\"Th\",\"F\",\"Sa\")","v":"Sa"},null,{"$f":"CHOOSE(1+MOD('Days1-2'!J1+1-2,7),\"Su\",\"M\",\"Tu\",\"W\",\"Th\",\"F\",\"Sa\")","v":"Su"},{"$f":"CHOOSE(1+MOD('Days1-2'!J1+2-2,7),\"Su\",\"M\",\"Tu\",\"W\",\"Th\",\"F\",\"Sa\")","v":"M"},{"$f":"CHOOSE(1+MOD('Days1-2'!J1+3-2,7),\"Su\",\"M\",\"Tu\",\"W\",\"Th\",\"F\",\"Sa\")","v":"Tu"},{"$f":"CHOOSE(1+MOD('Days1-2'!J1+4-2,7),\"Su\",\"M\",\"Tu\",\"W\",\"Th\",\"F\",\"Sa\")","v":"W"},{"$f":"CHOOSE(1+MOD('Days1-2'!J1+5-2,7),\"Su\",\"M\",\"Tu\",\"W\",\"Th\",\"F\",\"Sa\")","v":"Th"},{"$f":"CHOOSE(1+MOD('Days1-2'!J1+6-2,7),\"Su\",\"M\",\"Tu\",\"W\",\"Th\",\"F\",\"Sa\")","v":"F"},{"$f":"CHOOSE(1+MOD('Days1-2'!J1+7-2,7),\"Su\",\"M\",\"Tu\",\"W\",\"Th\",\"F\",\"Sa\")","v":"Sa"},null,null,null,null,null,null,null,null,{"$f":"CHOOSE(1+MOD('Days1-2'!$J$1+1-2,7),\"Su\",\"M\",\"Tu\",\"W\",\"Th\",\"F\",\"Sa\")","v":"Su"},{"$f":"CHOOSE(1+MOD('Days1-2'!$J$1+2-2,7),\"Su\",\"M\",\"Tu\",\"W\",\"Th\",\"F\",\"Sa\")","v":"M"},{"$f":"CHOOSE(1+MOD('Days1-2'!$J$1+3-2,7),\"Su\",\"M\",\"Tu\",\"W\",\"Th\",\"F\",\"Sa\")","v":"Tu"},{"$f":"CHOOSE(1+MOD('Days1-2'!$J$1+4-2,7),\"Su\",\"M\",\"Tu\",\"W\",\"Th\",\"F\",\"Sa\")","v":"W"},{"$f":"CHOOSE(1+MOD('Days1-2'!$J$1+5-2,7),\"Su\",\"M\",\"Tu\",\"W\",\"Th\",\"F\",\"Sa\")","v":"Th"},{"$f":"CHOOSE(1+MOD('Days1-2'!$J$1+6-2,7),\"Su\",\"M\",\"Tu\",\"W\",\"Th\",\"F\",\"Sa\")","v":"F"},{"$f":"CHOOSE(1+MOD('Days1-2'!$J$1+7-2,7),\"Su\",\"M\",\"Tu\",\"W\",\"Th\",\"F\",\"Sa\")","v":"Sa"},null,{"$f":"CHOOSE(1+MOD('Days1-2'!$J$1+1-2,7),\"Su\",\"M\",\"Tu\",\"W\",\"Th\",\"F\",\"Sa\")","v":"Su"},{"$f":"CHOOSE(1+MOD('Days1-2'!$J$1+2-2,7),\"Su\",\"M\",\"Tu\",\"W\",\"Th\",\"F\",\"Sa\")","v":"M"},{"$f":"CHOOSE(1+MOD('Days1-2'!$J$1+3-2,7),\"Su\",\"M\",\"Tu\",\"W\",\"Th\",\"F\",\"Sa\")","v":"Tu"},{"$f":"CHOOSE(1+MOD('Days1-2'!$J$1+4-2,7),\"Su\",\"M\",\"Tu\",\"W\",\"Th\",\"F\",\"Sa\")","v":"W"},{"$f":"CHOOSE(1+MOD('Days1-2'!$J$1+5-2,7),\"Su\",\"M\",\"Tu\",\"W\",\"Th\",\"F\",\"Sa\")","v":"Th"},{"$f":"CHOOSE(1+MOD('Days1-2'!$J$1+6-2,7),\"Su\",\"M\",\"Tu\",\"W\",\"Th\",\"F\",\"Sa\")","v":"F"},{"$f":"CHOOSE(1+MOD('Days1-2'!$J$1+7-2,7),\"Su\",\"M\",\"Tu\",\"W\",\"Th\",\"F\",\"Sa\")","v":"Sa"}]
[null,null,null,null,{"$f":"INDEX({\"Sunday\",\"Monday\",\"Tuesday\",\"Wednesday\",\"Thursday\",\"Friday\",\"Saturday\"},WEEKDAY(E3))","v":"Saturday"},null,null,null,{"$f":"IF(WEEKDAY(I3,1)='Days1-2'!$J$1,I3,\"\")","v":""},{"$f":"IF(I5=\"\",IF(WEEKDAY(I3,1)=MOD('Days1-2'!$J$1,7)+1,I3,\"\"),I5+1)","v":""},{"$f":"IF(J5=\"\",IF(WEEKDAY(I3,1)=MOD('Days1-2'!$J$1+1,7)+1,I3,\"\"),J5+1)","v":""},{"$f":"IF(K5=\"\",IF(WEEKDAY(I3,1)=MOD('Days1-2'!$J$1+2,7)+1,I3,\"\"),K5+1)","v":"2024-05-01"},{"$f":"IF(L5=\"\",IF(WEEKDAY(I3,1)=MOD('Days1-2'!$J$1+3,7)+1,I3,\"\"),L5+1)","v":"2024-05-02"},{"$f":"IF(M5=\"\",IF(WEEKDAY(I3,1)=MOD('Days1-2'!$J$1+4,7)+1,I3,\"\"),M5+1)","v":"2024-05-03"},{"$f":"IF(N5=\"\",IF(WEEKDAY(I3,1)=MOD('Days1-2'!$J$1+5,7)+1,I3,\"\"),N5+1)","v":"2024-05-04"},null,{"$f":"IF(WEEKDAY(Q3,1)='Days1-2'!$J$1,Q3,\"\")","v":""},{"$f":"IF(Q5=\"\",IF(WEEKDAY(Q3,1)=MOD('Days1-2'!$J$1,7)+1,Q3,\"\"),Q5+1)","v":""},{"$f":"IF(R5=\"\",IF(WEEKDAY(Q3,1)=MOD('Days1-2'!$J$1+1,7)+1,Q3,\"\"),R5+1)","v":""},{"$f":"IF(S5=\"\",IF(WEEKDAY(Q3,1)=MOD('Days1-2'!$J$1+2,7)+1,Q3,\"\"),S5+1)","v":""},{"$f":"IF(T5=\"\",IF(WEEKDAY(Q3,1)=MOD('Days1-2'!$J$1+3,7)+1,Q3,\"\"),T5+1)","v":""},{"$f":"IF(U5=\"\",IF(WEEKDAY(Q3,1)=MOD('Days1-2'!$J$1+4,7)+1,Q3,\"\"),U5+1)","v":""},{"$f":"IF(V5=\"\",IF(WEEKDAY(Q3,1)=MOD('Days1-2'!$J$1+5,7)+1,Q3,\"\"),V5+1)","v":"2024-06-01"},null,null,null,null,{"$f":"INDEX({\"Sunday\",\"Monday\",\"Tuesday\",\"Wednesday\",\"Thursday\",\"Friday\",\"Saturday\"},WEEKDAY(AB3))","v":"Sunday"},null,null,null,{"$f":"IF(WEEKDAY(AF3,1)='Days1-2'!$J$1,AF3,\"\")","v":""},{"$f":"IF(AF5=\"\",IF(WEEKDAY(AF3,1)=MOD('Days1-2'!$J$1,7)+1,AF3,\"\"),AF5+1)","v":""},{"$f":"IF(AG5=\"\",IF(WEEKDAY(AF3,1)=MOD('Days1-2'!$J$1+1,7)+1,AF3,\"\"),AG5+1)","v":""},{"$f":"IF(AH5=\"\",IF(WEEKDAY(AF3,1)=MOD('Days1-2'!$J$1+2,7)+1,AF3,\"\"),AH5+1)","v":"2024-05-01"},{"$f":"IF(AI5=\"\",IF(WEEKDAY(AF3,1)=MOD('Days1-2'!$J$1+3,7)+1,AF3,\"\"),AI5+1)","v":"2024-05-02"},{"$f":"IF(AJ5=\"\",IF(WEEKDAY(AF3,1)=MOD('Days1-2'!$J$1+4,7)+1,AF3,\"\"),AJ5+1)","v":"2024-05-03"},{"$f":"IF(AK5=\"\",IF(WEEKDAY(AF3,1)=MOD('Days1-2'!$J$1+5,7)+1,AF3,\"\"),AK5+1)","v":"2024-05-04"},null,{"$f":"IF(WEEKDAY(AN3,1)='Days1-2'!$J$1,AN3,\"\")","v":""},{"$f":"IF(AN5=\"\",IF(WEEKDAY(AN3,1)=MOD('Days1-2'!$J$1,7)+1,AN3,\"\"),AN5+1)","v":""},{"$f":"IF(AO5=\"\",IF(WEEKDAY(AN3,1)=MOD('Days1-2'!$J$1+1,7)+1,AN3,\"\"),AO5+1)","v":""},{"$f":"IF(AP5=\"\",IF(WEEKDAY(AN3,1)=MOD('Days1-2'!$J$1+2,7)+1,AN3,\"\"),AP5+1)","v":""},{"$f":"IF(AQ5=\"\",IF(WEEKDAY(AN3,1)=MOD('Days1-2'!$J$1+3,7)+1,AN3,\"\"),AQ5+1)","v":""},{"$f":"IF(AR5=\"\",IF(WEEKDAY(AN3,1)=MOD('Days1-2'!$J$1+4,7)+1,AN3,\"\"),AR5+1)","v":""},{"$f":"IF(AS5=\"\",IF(WEEKDAY(AN3,1)=MOD('Days1-2'!$J$1+5,7)+1,AN3,\"\"),AS5+1)","v":"2024-06-01"}]
[null,null,null,null,null,null,null,null,{"$f":"IF(O5=\"\",\"\",IF(MONTH(O5+1)<>MONTH(O5),\"\",O5+1))","v":"2024-05-05"},{"$f":"IF(I6=\"\",\"\",IF(MONTH(I6+1)<>MONTH(I6),\"\",I6+1))","v":"2024-05-06"},{"$f":"IF(J6=\"\",\"\",IF(MONTH(J6+1)<>MONTH(J6),\"\",J6+1))","v":"2024-05-07"},{"$f":"IF(K6=\"\",\"\",IF(MONTH(K6+1)<>MONTH(K6),\"\",K6+1))","v":"2024-05-08"},"2024-05-09","2024-05-10","2024-05-11",null,{"$f":"IF(W5=\"\",\"\",IF(MONTH(W5+1)<>MONTH(W5),\"\",W5+1))","v":"2024-06-02"},{"$f":"IF(Q6=\"\",\"\",IF(MONTH(Q6+1)<>MONTH(Q6),\"\",Q6+1))","v":"2024-06-03"},{"$f":"IF(R6=\"\",\"\",IF(MONTH(R6+1)<>MONTH(R6),\"\",R6+1))","v":"2024-06-04"},{"$f":"IF(S6=\"\",\"\",IF(MONTH(S6+1)<>MONTH(S6),\"\",S6+1))","v":"2024-06-05"},{"$f":"IF(T6=\"\",\"\",IF(MONTH(T6+1)<>MONTH(T6),\"\",T6+1))","v":"2024-06-06"},"2024-06-07","2024-06-08",null,null,null,null,null,null,null,null,{"$f":"IF(AL5=\"\",\"\",IF(MONTH(AL5+1)<>MONTH(AL5),\"\",AL5+1))","v":"2024-05-05"},{"$f":"IF(AF6=\"\",\"\",IF(MONTH(AF6+1)<>MONTH(AF6),\"\",AF6+1))","v":"2024-05-06"},{"$f":"IF(AG6=\"\",\"\",IF(MONTH(AG6+1)<>MONTH(AG6),\"\",AG6+1))","v":"2024-05-07"},{"$f":"IF(AH6=\"\",\"\",IF(MONTH(AH6+1)<>MONTH(AH6),\"\",AH6+1))","v":"2024-05-08"},{"$f":"IF(AI6=\"\",\"\",IF(MONTH(AI6+1)<>MONTH(AI6),\"\",AI6+1))","v":"2024-05-09"},"2024-05-10","2024-05-11",null,{"$f":"IF(AT5=\"\",\"\",IF(MONTH(AT5+1)<>MONTH(AT5),\"\",AT5+1))","v":"2024-06-02"},{"$f":"IF(AN6=\"\",\"\",IF(MONTH(AN6+1)<>MONTH(AN6),\"\",AN6+1))","v":"2024-06-03"},{"$f":"IF(AO6=\"\",\"\",IF(MONTH(AO6+1)<>MONTH(AO6),\"\",AO6+1))","v":"2024-06-04"},{"$f":"IF(AP6=\"\",\"\",IF(MONTH(AP6+1)<>MONTH(AP6),\"\",AP6+1))","v":"2024-06-05"},{"$f":"IF(AQ6=\"\",\"\",IF(MONTH(AQ6+1)<>MONTH(AQ6),\"\",AQ6+1))","v":"2024-06-06"},"2024-06-07","2024-06-08"]
[null,{"$f":"IFERROR(INDEX(arr_holiday,SMALL(IF(arr_holidaydate=$E$3,ROW(arr_holidaydate)),ROW()-ROW($B$6))),\"\")","v":""},null,null,null,null,null,null,{"$f":"IF(O6=\"\",\"\",IF(MONTH(O6+1)<>MONTH(O6),\"\",O6+1))","v":"2024-05-12"},{"$f":"IF(I7=\"\",\"\",IF(MONTH(I7+1)<>MONTH(I7),\"\",I7+1))","v":"2024-05-13"},"2024-05-14","2024-05-15","2024-05-16","2024-05-17","2024-05-18",null,{"$f":"IF(W6=\"\",\"\",IF(MONTH(W6+1)<>MONTH(W6),\"\",W6+1))","v":"2024-06-09"},{"$f":"IF(Q7=\"\",\"\",IF(MONTH(Q7+1)<>MONTH(Q7),\"\",Q7+1))","v":"2024-06-10"},"2024-06-11","2024-06-12","2024-06-13","2024-06-14","2024-06-15",null,{"$f":"IFERROR(INDEX(arr_holiday,SMALL(IF(arr_holidaydate=$AB$3,ROW(arr_holidaydate)),ROW()-ROW($B$6))),\"\")","v":"Pentecost"},null,null,null,null,null,null,{"$f":"IF(AL6=\"\",\"\",IF(MONTH(AL6+1)<>MONTH(AL6),\"\",AL6+1))","v":"2024-05-12"},{"$f":"IF(AF7=\"\",\"\",IF(MONTH(AF7+1)<>MONTH(AF7),\"\",AF7+1))","v":"2024-05-13"},"2024-05-14","2024-05-15","2024-05-16","2024-05-17","2024-05-18",null,{"$f":"IF(AT6=\"\",\"\",IF(MONTH(AT6+1)<>MONTH(AT6),\"\",AT6+1))","v":"2024-06-09"},{"$f":"IF(AN7=\"\",\"\",IF(MONTH(AN7+1)<>MONTH(AN7),\"\",AN7+1))","v":"2024-06-10"},"2024-06-11","2024-06-12","2024-06-13","2024-06-14","2024-06-15"]
[null,{"$f":"IFERROR(INDEX(arr_holiday,SMALL(IF(arr_holidaydate=$E$3,ROW(arr_holidaydate)),ROW()-ROW($B$6))),\"\")","v":""},null,null,null,null,null,null,"2024-05-19","2024-05-20","2024-05-21","2024-05-22","2024-05-23","2024-05-24","2024-05-25",null,"2024-06-16","2024-06-17","2024-06-18","2024-06-19","2024-06-20","2024-06-21","2024-06-22",null,{"$f":"IFERROR(INDEX(arr_holiday,SMALL(IF(arr_holidaydate=$AB$3,ROW(arr_holidaydate)),ROW()-ROW($B$6))),\"\")","v":""},null,null,null,null,null,null,"2024-05-19","2024-05-20","2024-05-21","2024-05-22","2024-05-23","2024-05-24","2024-05-25",null,"2024-06-16","2024-06-17","2024-06-18","2024-06-19","2024-06-20","2024-06-21","2024-06-22"]
[null,{"$f":"IFERROR(INDEX(arr_holiday,SMALL(IF(arr_holidaydate=$E$3,ROW(arr_holidaydate)),ROW()-ROW($B$6))),\"\")","v":""},null,null,null,null,null,null,"2024-05-26","2024-05-27","2024-05-28","2024-05-29","2024-05-30","2024-05-31","",null,"2024-06-23","2024-06-24","2024-06-25","2024-06-26","2024-06-27","2024-06-28","2024-06-29",null,{"$f":"IFERROR(INDEX(arr_holiday,SMALL(IF(arr_holidaydate=$AB$3,ROW(arr_holidaydate)),ROW()-ROW($B$6))),\"\")","v":""},null,null,null,null,null,null,"2024-05-26","2024-05-27","2024-05-28","2024-05-29","2024-05-30","2024-05-31","",null,"2024-06-23","2024-06-24","2024-06-25","2024-06-26","2024-06-27","2024-06-28","2024-06-29"]
[null,{"$f":"IFERROR(INDEX(arr_event,SMALL(IF(arr_eventdate=$E$3,ROW(arr_eventdate)),ROW()-ROW($B$9))),\"\")","v":""},null,null,null,null,null,null,"","","","","","","",null,"2024-06-30","","","","","","",null,{"$f":"IFERROR(INDEX(arr_event,SMALL(IF(arr_eventdate=$AB$3,ROW(arr_eventdate)),ROW()-ROW($B$9))),\"\")","v":""},null,null,null,null,null,null,"","","","","","","",null,"2024-06-30","","","","","",""]
[null,{"$f":"IFERROR(INDEX(arr_event,SMALL(IF(arr_eventdate=$E$3,ROW(arr_eventdate)),ROW()-ROW($B$9))),\"\")","v":""},null,null,null,null,null,null,null,null,null,null,null,null,null,null,null,null,null,null,null,null,null,null,{"$f":"IFERROR(INDEX(arr_event,SMALL(IF(arr_eventdate=$AB$3,ROW(arr_eventdate)),ROW()-ROW($B$9))),\"\")","v":""}]
[null,{"$f":"IFERROR(INDEX(arr_event,SMALL(IF(arr_eventdate=$E$3,ROW(arr_eventdate)),ROW()-ROW($B$9))),\"\")","v":""},null,null,null,null,null,null,null,null,null,null,null,null,null,null,null,null,null,null,null,null,null,null,{"$f":"IFERROR(INDEX(arr_event,SMALL(IF(arr_eventdate=$AB$3,ROW(arr_eventdate)),ROW()-ROW($B$9))),\"\")","v":""}]
[null,"Reminders",null,null,null,null,null,null,"Appointments",null,null,null,null,null,null,null,"Notes",null,null,null,null,null,null,null,"Reminders",null,null,null,null,null,null,"Appointments",null,null,null,null,null,null,null,"Notes"]
[null,{"$f":"IFERROR(INDEX(arr_event,SMALL(IF(arr_eventdate=$E$3,ROW(arr_eventdate)),ROW()-ROW($B$13))),\"\")","v":""},null,null,null,null,7,":00",null,null,null,null,null,null,null,null,null,null,null,null,null,null,null,null,{"$f":"IFERROR(INDEX(arr_event,SMALL(IF(arr_eventdate=$E$3,ROW(arr_eventdate)),ROW()-ROW($B$13))),\"\")","v":""},null,null,null,null,7,":00"]
[null,"",null,null,null,null,null,":30",null,null,null,null,null,null,null,null,null,null,null,null,null,null,null,null,"",null,null,null,null,null,":30"]
[null,"",null,null,null,null,8,":00",null,null,null,null,null,null,null,null,null,null,null,null,null,null,null,null,"",null,null,null,null,8,":00"]
[null,"",null,null,null,null,null,":30",null,null,null,null,null,null,null,null,null,null,null,null,null,null,null,null,"",null,null,null,null,null,":30"]
[null,"",null,null,null,null,9,":00",null,null,null,null,null,null,null,null,null,null,null,null,null,null,null,null,"",null,null,null,null,9,":00"]
[null,"",null,null,null,null,null,":30",null,null,null,null,null,null,null,null,null,null,null,null,null,null,null,null,"",null,null,null,null,null,":30"]
[null,"",null,null,null,null,10,":00",null,null,null,null,null,null,null,null,null,null,null,null,null,null,null,null,"",null,null,null,null,10,":00"]
[null,"",null,null,null,null,null,":30",null,null,null,null,null,null,null,null,null,null,null,null,null,null,null,null,"",null,null,null,null,null,":30"]
[null,"From",null,"Actions Carried Forward",null,null,11,":00",null,null,null,null,null,null,null,null,null,null,null,null,null,null,null,null,"From",null,"Actions Carried Forward",null,null,11,":00"]
[null,{"$f":"IFERROR(INDEX(arr_event,SMALL(IF(arr_eventdate=$E$3,ROW(arr_eventdate)),ROW()-ROW($B$13))),\"\")","v":""},null,null,null,null,null,":30",null,null,null,null,null,null,null,null,null,null,null,null,null,null,null,null,{"$f":"IFERROR(INDEX(arr_event,SMALL(IF(arr_eventdate=$E$3,ROW(arr_eventdate)),ROW()-ROW($B$13))),\"\")","v":""},null,null,null,null,null,":30"]
[null,{"$f":"IFERROR(INDEX(arr_event,SMALL(IF(arr_eventdate=$E$3,ROW(arr_eventdate)),ROW()-ROW($B$13))),\"\")","v":""},null,null,null,null,12,":00",null,null,null,null,null,null,null,null,null,null,null,null,null,null,null,null,{"$f":"IFERROR(INDEX(arr_event,SMALL(IF(arr_eventdate=$E$3,ROW(arr_eventdate)),ROW()-ROW($B$13))),\"\")","v":""},null,null,null,null,12,":00"]
[null,{"$f":"IFERROR(INDEX(arr_event,SMALL(IF(arr_eventdate=$E$3,ROW(arr_eventdate)),ROW()-ROW($B$13))),\"\")","v":""},null,null,null,null,null,":30",null,null,null,null,null,null,null,null,null,null,null,null,null,null,null,null,{"$f":"IFERROR(INDEX(arr_event,SMALL(IF(arr_eventdate=$E$3,ROW(arr_eventdate)),ROW()-ROW($B$13))),\"\")","v":""},null,null,null,null,null,":30"]
[null,{"$f":"IFERROR(INDEX(arr_event,SMALL(IF(arr_eventdate=$E$3,ROW(arr_eventdate)),ROW()-ROW($B$13))),\"\")","v":""},null,null,null,null,1,":00",null,null,null,null,null,null,null,null,null,null,null,null,null,null,null,null,{"$f":"IFERROR(INDEX(arr_event,SMALL(IF(arr_eventdate=$E$3,ROW(arr_eventdate)),ROW()-ROW($B$13))),\"\")","v":""},null,null,null,null,1,":00"]
[null,{"$f":"IFERROR(INDEX(arr_event,SMALL(IF(arr_eventdate=$E$3,ROW(arr_eventdate)),ROW()-ROW($B$13))),\"\")","v":""},null,null,null,null,null,":30",null,null,null,null,null,null,null,null,null,null,null,null,null,null,null,null,{"$f":"IFERROR(INDEX(arr_event,SMALL(IF(arr_eventdate=$E$3,ROW(arr_eventdate)),ROW()-ROW($B$13))),\"\")","v":""},null,null,null,null,null,":30"]
[null,{"$f":"IFERROR(INDEX(arr_event,SMALL(IF(arr_eventdate=$E$3,ROW(arr_eventdate)),ROW()-ROW($B$13))),\"\")","v":""},null,null,null,null,2,":00",null,null,null,null,null,null,null,null,null,null,null,null,null,null,null,null,{"$f":"IFERROR(INDEX(arr_event,SMALL(IF(arr_eventdate=$E$3,ROW(arr_eventdate)),ROW()-ROW($B$13))),\"\")","v":""},null,null,null,null,2,":00"]
[null,{"$f":"IFERROR(INDEX(arr_event,SMALL(IF(arr_eventdate=$E$3,ROW(arr_eventdate)),ROW()-ROW($B$13))),\"\")","v":""},null,null,null,null,null,":30",null,null,null,null,null,null,null,null,null,null,null,null,null,null,null,null,{"$f":"IFERROR(INDEX(arr_event,SMALL(IF(arr_eventdate=$E$3,ROW(arr_eventdate)),ROW()-ROW($B$13))),\"\")","v":""},null,null,null,null,null,":30"]
[null,{"$f":"IFERROR(INDEX(arr_event,SMALL(IF(arr_eventdate=$E$3,ROW(arr_eventdate)),ROW()-ROW($B$13))),\"\")","v":""},null,null,null,null,3,":00",null,null,null,null,null,null,null,null,null,null,null,null,null,null,null,null,{"$f":"IFERROR(INDEX(arr_event,SMALL(IF(arr_eventdate=$E$3,ROW(arr_eventdate)),ROW()-ROW($B$13))),\"\")","v":""},null,null,null,null,3,":00"]
[null,null,null,null,null,null,null,":30",null,null,null,null,null,null,null,null,null,null,null,null,null,null,null,null,null,null,null,null,null,null,":30"]
[null,"$Amt",null,"Expenses",null,null,4,":00",null,null,null,null,null,null,null,null,null,null,null,null,null,null,null,null,"$Amt",null,"Expenses",null,null,4,":00"]
[null,null,null,null,null,null,null,":30",null,null,null,null,null,null,null,null,null,null,null,null,null,null,null,null,null,null,null,null,null,null,":30"]
[null,null,null,null,null,null,5,":00",null,null,null,null,null,null,null,null,null,null,null,null,null,null,null,null,null,null,null,null,null,5,":00"]
[null,null,null,null,null,null,null,":30",null,null,null,null,null,null,null,null,null,null,null,null,null,null,null,null,null,null,null,null,null,null,":30"]
[null,null,null,null,null,null,6,":00",null,null,null,null,null,null,null,null,null,null,null,null,null,null,null,null,null,null,null,null,null,6,":00"]
[null,null,null,null,null,null,null,":30",null,null,null,null,null,null,null,null,null,null,null,null,null,null,null,null,null,null,null,null,null,null,":30"]
[]
[null,"Planned cases for today",null,null,null,null,null,":30",null,null,null,null,null,null,null,null,null,null,null,null,null,null,null,null,"Planned cases for today",null,null,null,null,null,":30"]
[null,"Case",null,null,null,"Action",null,null,null,null,null,null,null,null,null,null,null,null,null,"Follow-up",null,null,null,null,"Case",null,null,null,"Action",null,null,null,null,null,null,null,null,null,null,null,null,null,"Follow-up"]

{"sheet":"Days21-22","index":12,"n_rows":40,"n_cols":46,"rows_kept":40,"cut":false,"hidden":false,"merged":[[56,24,56,27],[56,28,56,41],[56,42,56,45],[57,24,57,27],[57,28,57,41],[57,42,57,45],[52,42,52,45],[53,24,53,27],[53,28,53,41],[53,42,53,45],[54,24,54,27],[54,28,54,41],[54,42,54,45],[55,24,55,27],[55,28,55,41],[55,42,55,45],[48,42,48,45],[49,24,49,27],[49,28,49,41],[49,42,49,45],[50,24,50,27],[50,28,50,41],[50,42,50,45],[51,24,51,27],[51,28,51,41],[51,42,51,45],[44,42,44,45],[45,24,45,27],[45,28,45,41],[45,42,45,45],[46,24,46,27],[46,28,46,41],[46,42,46,45],[47,24,47,27],[47,28,47,41],[47,42,47,45],[40,42,40,45],[41,24,41,27],[41,28,41,41],[41,42,41,45],[42,24,42,27],[42,28,42,41],[42,42,42,45],[43,24,43,27],[43,28,43,41],[43,42,43,45],[57,1,57,4],[57,5,57,18],[57,19,57,22],[58,1,58,4],[58,5,58,18],[58,19,58,22],[29,24,29,25],[31,24,31,25],[31,26,31,27],[32,24,32,25],[32,26,32,27],[33,24,33,25],[33,26,33,27],[34,24,34,25],[34,26,34,27],[35,24,35,25],[35,26,35,27],[36,24,36,25],[36,26,36,27],[38,24,38,45],[39,24,39,27],[39,28,39,41],[39,42,39,45],[40,24,40,27],[0,32,0,33],[2,1,5,3],[2,4,3,7],[2,8,2,14],[2,16,2,22],[2,24,5,26],[2,27,3,30],[2,31,2,37],[29,1,29,2],[13,6,14,6],[13,29,14,29],[15,6,16,6],[15,29,16,29],[17,6,18,6],[17,29,18,29],[2,39,2,45],[4,4,5,6],[4,27,5,29],[6,5,6,6],[6,28,6,29],[12,1,12,4],[12,16,12,22],[12,24,12,27],[12,39,12,45],[22,24,22,25],[22,26,22,27],[23,1,23,2],[23,3,23,4],[23,6,24,6],[23,24,23,25],[23,26,23,27],[19,6,20,6],[19,29,20,29],[21,1,21,2],[21,3,21,4],[21,6,22,6],[21,24,21,25],[21,26,21,27],[21,29,22,29],[22,1,22,2],[22,3,22,4],[23,29,24,29],[24,1,24,2],[24,3,24,4],[24,24,24,25],[24,26,24,27],[25,1,25,2],[25,3,25,4],[25,6,26,6],[25,24,25,25],[25,26,25,27],[25,29,26,29],[26,1,26,2],[26,3,26,4],[26,24,26,25],[26,26,26,27],[27,1,27,2],[27,3,27,4],[27,6,28,6],[27,24,27,25],[27,26,27,27],[27,29,28,29],[28,1,28,2],[28,3,28,4],[28,24,28,25],[28,26,28,27],[29,3,29,4],[29,6,30,6],[29,26,29,27],[29,29,30,29],[31,6,32,6],[31,29,32,29],[33,6,34,6],[33,29,34,29],[35,6,36,6],[35,29,36,29],[40,5,40,18],[40,19,40,22],[41,5,41,18],[41,19,41,22],[42,5,42,18],[42,19,42,22],[40,28,40,41],[42,1,42,4],[43,1,43,4],[43,5,43,18],[43,19,43,22],[44,24,44,27],[44,28,44,41],[31,1,31,2],[31,3,31,4],[40,1,40,4],[41,1,41,4],[44,1,44,4],[44,5,44,18],[44,19,44,22],[45,1,45,4],[45,5,45,18],[45,19,45,22],[46,1,46,4],[46,5,46,18],[46,19,46,22],[47,1,47,4],[47,5,47,18],[47,19,47,22],[32,1,32,2],[32,3,32,4],[33,1,33,2],[33,3,33,4],[48,1,48,4],[48,5,48,18],[48,19,48,22],[49,1,49,4],[49,5,49,18],[49,19,49,22],[50,1,50,4],[50,5,50,18],[50,19,50,22],[51,1,51,4],[51,5,51,18],[51,19,51,22],[48,24,48,27],[48,28,48,41],[34,1,34,2],[34,3,34,4],[35,1,35,2],[35,3,35,4],[52,1,52,4],[52,5,52,18],[52,19,52,22],[53,1,53,4],[53,5,53,18],[53,19,53,22],[52,24,52,27],[52,28,52,41],[39,1,39,4],[39,5,39,18],[39,19,39,22],[58,24,58,27],[58,28,58,41],[58,42,58,45],[36,1,36,2],[36,3,36,4],[38,1,38,22],[54,1,54,4],[54,5,54,18],[54,19,54,22],[55,1,55,4],[55,5,55,18],[55,19,55,22],[56,1,56,4],[56,5,56,18],[56,19,56,22],[61,1,61,4],[61,5,61,18],[61,19,61,22],[61,24,61,27],[61,28,61,41],[61,42,61,45],[59,1,59,4],[59,5,59,18],[59,19,59,22],[59,24,59,27],[59,28,59,41],[59,42,59,45],[62,1,62,4],[62,5,62,18],[62,19,62,22],[62,24,62,27],[62,28,62,41],[62,42,62,45]]}
[]
[]
[null,{"$f":"DAY(E3)","v":20},null,null,{"$f":"'Days19-20'!AB3+1","v":"2024-05-20"},null,null,null,{"$f":"DATE(YEAR($E$3),MONTH($E$3),1)","v":"2024-05-01"},null,null,null,null,null,null,null,{"$f":"DATE(YEAR(I3+35),MONTH(I3+35),1)","v":"2024-06-01"},null,null,null,null,null,null,null,{"$f":"DAY(AB3)","v":21},null,null,{"$f":"E3+1","v":"2024-05-21"},null,null,null,{"$f":"DATE(YEAR(AB3),MONTH(AB3),1)","v":"2024-05-01"},null,null,null,null,null,null,null,{"$f":"DATE(YEAR(AF3+35),MONTH(AF3+35),1)","v":"2024-06-01"}]
[null,null,null,null,null,null,null,null,{"$f":"CHOOSE(1+MOD('Days1-2'!J1+1-2,7),\"Su\",\"M\",\"Tu\",\"W\",\"Th\",\"F\",\"Sa\")","v":"Su"},{"$f":"CHOOSE(1+MOD('Days1-2'!$J$1+2-2,7),\"Su\",\"M\",\"Tu\",\"W\",\"Th\",\"F\",\"Sa\")","v":"M"},{"$f":"CHOOSE(1+MOD('Days1-2'!$J$1+3-2,7),\"Su\",\"M\",\"Tu\",\"W\",\"Th\",\"F\",\"Sa\")","v":"Tu"},{"$f":"CHOOSE(1+MOD('Days1-2'!$J$1+4-2,7),\"Su\",\"M\",\"Tu\",\"W\",\"Th\",\"F\",\"Sa\")","v":"W"},{"$f":"CHOOSE(1+MOD('Days1-2'!$J$1+5-2,7),\"Su\",\"M\",\"Tu\",\"W\",\"Th\",\"F\",\"Sa\")","v":"Th"},{"$f":"CHOOSE(1+MOD('Days1-2'!$J$1+6-2,7),\"Su\",\"M\",\"Tu\",\"W\",\"Th\",\"F\",\"Sa\")","v":"F"},{"$f":"CHOOSE(1+MOD('Days1-2'!$J$1+7-2,7),\"Su\",\"M\",\"Tu\",\"W\",\"Th\",\"F\",\"Sa\")","v":"Sa"},null,{"$f":"CHOOSE(1+MOD('Days1-2'!J1+1-2,7),\"Su\",\"M\",\"Tu\",\"W\",\"Th\",\"F\",\"Sa\")","v":"Su"},{"$f":"CHOOSE(1+MOD('Days1-2'!J1+2-2,7),\"Su\",\"M\",\"Tu\",\"W\",\"Th\",\"F\",\"Sa\")","v":"M"},{"$f":"CHOOSE(1+MOD('Days1-2'!J1+3-2,7),\"Su\",\"M\",\"Tu\",\"W\",\"Th\",\"F\",\"Sa\")","v":"Tu"},{"$f":"CHOOSE(1+MOD('Days1-2'!J1+4-2,7),\"Su\",\"M\",\"Tu\",\"W\",\"Th\",\"F\",\"Sa\")","v":"W"},{"$f":"CHOOSE(1+MOD('Days1-2'!J1+5-2,7),\"Su\",\"M\",\"Tu\",\"W\",\"Th\",\"F\",\"Sa\")","v":"Th"},{"$f":"CHOOSE(1+MOD('Days1-2'!J1+6-2,7),\"Su\",\"M\",\"Tu\",\"W\",\"Th\",\"F\",\"Sa\")","v":"F"},{"$f":"CHOOSE(1+MOD('Days1-2'!J1+7-2,7),\"Su\",\"M\",\"Tu\",\"W\",\"Th\",\"F\",\"Sa\")","v":"Sa"},null,null,null,null,null,null,null,null,{"$f":"CHOOSE(1+MOD('Days1-2'!$J$1+1-2,7),\"Su\",\"M\",\"Tu\",\"W\",\"Th\",\"F\",\"Sa\")","v":"Su"},{"$f":"CHOOSE(1+MOD('Days1-2'!$J$1+2-2,7),\"Su\",\"M\",\"Tu\",\"W\",\"Th\",\"F\",\"Sa\")","v":"M"},{"$f":"CHOOSE(1+MOD('Days1-2'!$J$1+3-2,7),\"Su\",\"M\",\"Tu\",\"W\",\"Th\",\"F\",\"Sa\")","v":"Tu"},{"$f":"CHOOSE(1+MOD('Days1-2'!$J$1+4-2,7),\"Su\",\"M\",\"Tu\",\"W\",\"Th\",\"F\",\"Sa\")","v":"W"},{"$f":"CHOOSE(1+MOD('Days1-2'!$J$1+5-2,7),\"Su\",\"M\",\"Tu\",\"W\",\"Th\",\"F\",\"Sa\")","v":"Th"},{"$f":"CHOOSE(1+MOD('Days1-2'!$J$1+6-2,7),\"Su\",\"M\",\"Tu\",\"W\",\"Th\",\"F\",\"Sa\")","v":"F"},{"$f":"CHOOSE(1+MOD('Days1-2'!$J$1+7-2,7),\"Su\",\"M\",\"Tu\",\"W\",\"Th\",\"F\",\"Sa\")","v":"Sa"},null,{"$f":"CHOOSE(1+MOD('Days1-2'!$J$1+1-2,7),\"Su\",\"M\",\"Tu\",\"W\",\"Th\",\"F\",\"Sa\")","v":"Su"},{"$f":"CHOOSE(1+MOD('Days1-2'!$J$1+2-2,7),\"Su\",\"M\",\"Tu\",\"W\",\"Th\",\"F\",\"Sa\")","v":"M"},{"$f":"CHOOSE(1+MOD('Days1-2'!$J$1+3-2,7),\"Su\",\"M\",\"Tu\",\"W\",\"Th\",\"F\",\"Sa\")","v":"Tu"},{"$f":"CHOOSE(1+MOD('Days1-2'!$J$1+4-2,7),\"Su\",\"M\",\"Tu\",\"W\",\"Th\",\"F\",\"Sa\")","v":"W"},{"$f":"CHOOSE(1+MOD('Days1-2'!$J$1+5-2,7),\"Su\",\"M\",\"Tu\",\"W\",\"Th\",\"F\",\"Sa\")","v":"Th"},{"$f":"CHOOSE(1+MOD('Days1-2'!$J$1+6-2,7),\"Su\",\"M\",\"Tu\",\"W\",\"Th\",\"F\",\"Sa\")","v":"F"},{"$f":"CHOOSE(1+MOD('Days1-2'!$J$1+7-2,7),\"Su\",\"M\",\"Tu\",\"W\",\"Th\",\"F\",\"Sa\")","v":"Sa"}]
[null,null,null,null,{"$f":"INDEX({\"Sunday\",\"Monday\",\"Tuesday\",\"Wednesday\",\"Thursday\",\"Friday\",\"Saturday\"},WEEKDAY(E3))","v":"Monday"},null,null,null,{"$f":"IF(WEEKDAY(I3,1)='Days1-2'!$J$1,I3,\"\")","v":""},{"$f":"IF(I5=\"\",IF(WEEKDAY(I3,1)=MOD('Days1-2'!$J$1,7)+1,I3,\"\"),I5+1)","v":""},{"$f":"IF(J5=\"\",IF(WEEKDAY(I3,1)=MOD('Days1-2'!$J$1+1,7)+1,I3,\"\"),J5+1)","v":""},{"$f":"IF(K5=\"\",IF(WEEKDAY(I3,1)=MOD('Days1-2'!$J$1+2,7)+1,I3,\"\"),K5+1)","v":"2024-05-01"},{"$f":"IF(L5=\"\",IF(WEEKDAY(I3,1)=MOD('Days1-2'!$J$1+3,7)+1,I3,\"\"),L5+1)","v":"2024-05-02"},{"$f":"IF(M5=\"\",IF(WEEKDAY(I3,1)=MOD('Days1-2'!$J$1+4,7)+1,I3,\"\"),M5+1)","v":"2024-05-03"},{"$f":"IF(N5=\"\",IF(WEEKDAY(I3,1)=MOD('Days1-2'!$J$1+5,7)+1,I3,\"\"),N5+1)","v":"2024-05-04"},null,{"$f":"IF(WEEKDAY(Q3,1)='Days1-2'!$J$1,Q3,\"\")","v":""},{"$f":"IF(Q5=\"\",IF(WEEKDAY(Q3,1)=MOD('Days1-2'!$J$1,7)+1,Q3,\"\"),Q5+1)","v":""},{"$f":"IF(R5=\"\",IF(WEEKDAY(Q3,1)=MOD('Days1-2'!$J$1+1,7)+1,Q3,\"\"),R5+1)","v":""},{"$f":"IF(S5=\"\",IF(WEEKDAY(Q3,1)=MOD('Days1-2'!$J$1+2,7)+1,Q3,\"\"),S5+1)","v":""},{"$f":"IF(T5=\"\",IF(WEEKDAY(Q3,1)=MOD('Days1-2'!$J$1+3,7)+1,Q3,\"\"),T5+1)","v":""},{"$f":"IF(U5=\"\",IF(WEEKDAY(Q3,1)=MOD('Days1-2'!$J$1+4,7)+1,Q3,\"\"),U5+1)","v":""},{"$f":"IF(V5=\"\",IF(WEEKDAY(Q3,1)=MOD('Days1-2'!$J$1+5,7)+1,Q3,\"\"),V5+1)","v":"2024-06-01"},null,null,null,null,{"$f":"INDEX({\"Sunday\",\"Monday\",\"Tuesday\",\"Wednesday\",\"Thursday\",\"Friday\",\"Saturday\"},WEEKDAY(AB3))","v":"Tuesday"},null,null,null,{"$f":"IF(WEEKDAY(AF3,1)='Days1-2'!$J$1,AF3,\"\")","v":""},{"$f":"IF(AF5=\"\",IF(WEEKDAY(AF3,1)=MOD('Days1-2'!$J$1,7)+1,AF3,\"\"),AF5+1)","v":""},{"$f":"IF(AG5=\"\",IF(WEEKDAY(AF3,1)=MOD('Days1-2'!$J$1+1,7)+1,AF3,\"\"),AG5+1)","v":""},{"$f":"IF(AH5=\"\",IF(WEEKDAY(AF3,1)=MOD('Days1-2'!$J$1+2,7)+1,AF3,\"\"),AH5+1)","v":"2024-05-01"},{"$f":"IF(AI5=\"\",IF(WEEKDAY(AF3,1)=MOD('Days1-2'!$J$1+3,7)+1,AF3,\"\"),AI5+1)","v":"2024-05-02"},{"$f":"IF(AJ5=\"\",IF(WEEKDAY(AF3,1)=MOD('Days1-2'!$J$1+4,7)+1,AF3,\"\"),AJ5+1)","v":"2024-05-03"},{"$f":"IF(AK5=\"\",IF(WEEKDAY(AF3,1)=MOD('Days1-2'!$J$1+5,7)+1,AF3,\"\"),AK5+1)","v":"2024-05-04"},null,{"$f":"IF(WEEKDAY(AN3,1)='Days1-2'!$J$1,AN3,\"\")","v":""},{"$f":"IF(AN5=\"\",IF(WEEKDAY(AN3,1)=MOD('Days1-2'!$J$1,7)+1,AN3,\"\"),AN5+1)","v":""},{"$f":"IF(AO5=\"\",IF(WEEKDAY(AN3,1)=MOD('Days1-2'!$J$1+1,7)+1,AN3,\"\"),AO5+1)","v":""},{"$f":"IF(AP5=\"\",IF(WEEKDAY(AN3,1)=MOD('Days1-2'!$J$1+2,7)+1,AN3,\"\"),AP5+1)","v":""},{"$f":"IF(AQ5=\"\",IF(WEEKDAY(AN3,1)=MOD('Days1-2'!$J$1+3,7)+1,AN3,\"\"),AQ5+1)","v":""},{"$f":"IF(AR5=\"\",IF(WEEKDAY(AN3,1)=MOD('Days1-2'!$J$1+4,7)+1,AN3,\"\"),AR5+1)","v":""},{"$f":"IF(AS5=\"\",IF(WEEKDAY(AN3,1)=MOD('Days1-2'!$J$1+5,7)+1,AN3,\"\"),AS5+1)","v":"2024-06-01"}]
[null,null,null,null,null,null,null,null,{"$f":"IF(O5=\"\",\"\",IF(MONTH(O5+1)<>MONTH(O5),\"\",O5+1))","v":"2024-05-05"},{"$f":"IF(I6=\"\",\"\",IF(MONTH(I6+1)<>MONTH(I6),\"\",I6+1))","v":"2024-05-06"},{"$f":"IF(J6=\"\",\"\",IF(MONTH(J6+1)<>MONTH(J6),\"\",J6+1))","v":"2024-05-07"},{"$f":"IF(K6=\"\",\"\",IF(MONTH(K6+1)<>MONTH(K6),\"\",K6+1))","v":"2024-05-08"},"2024-05-09","2024-05-10","2024-05-11",null,{"$f":"IF(W5=\"\",\"\",IF(MONTH(W5+1)<>MONTH(W5),\"\",W5+1))","v":"2024-06-02"},{"$f":"IF(Q6=\"\",\"\",IF(MONTH(Q6+1)<>MONTH(Q6),\"\",Q6+1))","v":"2024-06-03"},{"$f":"IF(R6=\"\",\"\",IF(MONTH(R6+1)<>MONTH(R6),\"\",R6+1))","v":"2024-06-04"},{"$f":"IF(S6=\"\",\"\",IF(MONTH(S6+1)<>MONTH(S6),\"\",S6+1))","v":"2024-06-05"},{"$f":"IF(T6=\"\",\"\",IF(MONTH(T6+1)<>MONTH(T6),\"\",T6+1))","v":"2024-06-06"},"2024-06-07","2024-06-08",null,null,null,null,null,null,null,null,{"$f":"IF(AL5=\"\",\"\",IF(MONTH(AL5+1)<>MONTH(AL5),\"\",AL5+1))","v":"2024-05-05"},{"$f":"IF(AF6=\"\",\"\",IF(MONTH(AF6+1)<>MONTH(AF6),\"\",AF6+1))","v":"2024-05-06"},{"$f":"IF(AG6=\"\",\"\",IF(MONTH(AG6+1)<>MONTH(AG6),\"\",AG6+1))","v":"2024-05-07"},{"$f":"IF(AH6=\"\",\"\",IF(MONTH(AH6+1)<>MONTH(AH6),\"\",AH6+1))","v":"2024-05-08"},{"$f":"IF(AI6=\"\",\"\",IF(MONTH(AI6+1)<>MONTH(AI6),\"\",AI6+1))","v":"2024-05-09"},"2024-05-10","2024-05-11",null,{"$f":"IF(AT5=\"\",\"\",IF(MONTH(AT5+1)<>MONTH(AT5),\"\",AT5+1))","v":"2024-06-02"},{"$f":"IF(AN6=\"\",\"\",IF(MONTH(AN6+1)<>MONTH(AN6),\"\",AN6+1))","v":"2024-06-03"},{"$f":"IF(AO6=\"\",\"\",IF(MONTH(AO6+1)<>MONTH(AO6),\"\",AO6+1))","v":"2024-06-04"},{"$f":"IF(AP6=\"\",\"\",IF(MONTH(AP6+1)<>MONTH(AP6),\"\",AP6+1))","v":"2024-06-05"},{"$f":"IF(AQ6=\"\",\"\",IF(MONTH(AQ6+1)<>MONTH(AQ6),\"\",AQ6+1))","v":"2024-06-06"},"2024-06-07","2024-06-08"]
[null,{"$f":"IFERROR(INDEX(arr_holiday,SMALL(IF(arr_holidaydate=$E$3,ROW(arr_holidaydate)),ROW()-ROW($B$6))),\"\")","v":"Victoria Day (Canada)"},null,null,null,null,null,null,{"$f":"IF(O6=\"\",\"\",IF(MONTH(O6+1)<>MONTH(O6),\"\",O6+1))","v":"2024-05-12"},{"$f":"IF(I7=\"\",\"\",IF(MONTH(I7+1)<>MONTH(I7),\"\",I7+1))","v":"2024-05-13"},"2024-05-14","2024-05-15","2024-05-16","2024-05-17","2024-05-18",null,{"$f":"IF(W6=\"\",\"\",IF(MONTH(W6+1)<>MONTH(W6),\"\",W6+1))","v":"2024-06-09"},{"$f":"IF(Q7=\"\",\"\",IF(MONTH(Q7+1)<>MONTH(Q7),\"\",Q7+1))","v":"2024-06-10"},"2024-06-11","2024-06-12","2024-06-13","2024-06-14","2024-06-15",null,{"$f":"IFERROR(INDEX(arr_holiday,SMALL(IF(arr_holidaydate=$AB$3,ROW(arr_holidaydate)),ROW()-ROW($B$6))),\"\")","v":""},null,null,null,null,null,null,{"$f":"IF(AL6=\"\",\"\",IF(MONTH(AL6+1)<>MONTH(AL6),\"\",AL6+1))","v":"2024-05-12"},{"$f":"IF(AF7=\"\",\"\",IF(MONTH(AF7+1)<>MONTH(AF7),\"\",AF7+1))","v":"2024-05-13"},"2024-05-14","2024-05-15","2024-05-16","2024-05-17","2024-05-18",null,{"$f":"IF(AT6=\"\",\"\",IF(MONTH(AT6+1)<>MONTH(AT6),\"\",AT6+1))","v":"2024-06-09"},{"$f":"IF(AN7=\"\",\"\",IF(MONTH(AN7+1)<>MONTH(AN7),\"\",AN7+1))","v":"2024-06-10"},"2024-06-11","2024-06-12","2024-06-13","2024-06-14","2024-06-15"]
[null,{"$f":"IFERROR(INDEX(arr_holiday,SMALL(IF(arr_holidaydate=$E$3,ROW(arr_holidaydate)),ROW()-ROW($B$6))),\"\")","v":""},null,null,null,null,null,null,"2024-05-19","2024-05-20","2024-05-21","2024-05-22","2024-05-23","2024-05-24","2024-05-25",null,"2024-06-16","2024-06-17","2024-06-18","2024-06-19","2024-06-20","2024-06-21","2024-06-22",null,{"$f":"IFERROR(INDEX(arr_holiday,SMALL(IF(arr_holidaydate=$AB$3,ROW(arr_holidaydate)),ROW()-ROW($B$6))),\"\")","v":""},null,null,null,null,null,null,"2024-05-19","2024-05-20","2024-05-21","2024-05-22","2024-05-23","2024-05-24","2024-05-25",null,"2024-06-16","2024-06-17","2024-06-18","2024-06-19","2024-06-20","2024-06-21","2024-06-22"]
[null,{"$f":"IFERROR(INDEX(arr_holiday,SMALL(IF(arr_holidaydate=$E$3,ROW(arr_holidaydate)),ROW()-ROW($B$6))),\"\")","v":""},null,null,null,null,null,null,"2024-05-26","2024-05-27","2024-05-28","2024-05-29","2024-05-30","2024-05-31","",null,"2024-06-23","2024-06-24","2024-06-25","2024-06-26","2024-06-27","2024-06-28","2024-06-29",null,{"$f":"IFERROR(INDEX(arr_holiday,SMALL(IF(arr_holidaydate=$AB$3,ROW(arr_holidaydate)),ROW()-ROW($B$6))),\"\")","v":""},null,null,null,null,null,null,"2024-05-26","2024-05-27","2024-05-28","2024-05-29","2024-05-30","2024-05-31","",null,"2024-06-23","2024-06-24","2024-06-25","2024-06-26","2024-06-27","2024-06-28","2024-06-29"]
[null,{"$f":"IFERROR(INDEX(arr_event,SMALL(IF(arr_eventdate=$E$3,ROW(arr_eventdate)),ROW()-ROW($B$9))),\"\")","v":""},null,null,null,null,null,null,"","","","","","","",null,"2024-06-30","","","","","","",null,{"$f":"IFERROR(INDEX(arr_event,SMALL(IF(arr_eventdate=$AB$3,ROW(arr_eventdate)),ROW()-ROW($B$9))),\"\")","v":""},null,null,null,null,null,null,"","","","","","","",null,"2024-06-30","","","","","",""]
[null,{"$f":"IFERROR(INDEX(arr_event,SMALL(IF(arr_eventdate=$E$3,ROW(arr_eventdate)),ROW()-ROW($B$9))),\"\")","v":""},null,null,null,null,null,null,null,null,null,null,null,null,null,null,null,null,null,null,null,null,null,null,{"$f":"IFERROR(INDEX(arr_event,SMALL(IF(arr_eventdate=$AB$3,ROW(arr_eventdate)),ROW()-ROW($B$9))),\"\")","v":""}]
[null,{"$f":"IFERROR(INDEX(arr_event,SMALL(IF(arr_eventdate=$E$3,ROW(arr_eventdate)),ROW()-ROW($B$9))),\"\")","v":""},null,null,null,null,null,null,null,null,null,null,null,null,null,null,null,null,null,null,null,null,null,null,{"$f":"IFERROR(INDEX(arr_event,SMALL(IF(arr_eventdate=$AB$3,ROW(arr_eventdate)),ROW()-ROW($B$9))),\"\")","v":""}]
[null,"Reminders",null,null,null,null,null,null,"Appointments",null,null,null,null,null,null,null,"Notes",null,null,null,null,null,null,null,"Reminders",null,null,null,null,null,null,"Appointments",null,null,null,null,null,null,null,"Notes"]
[null,{"$f":"IFERROR(INDEX(arr_event,SMALL(IF(arr_eventdate=$E$3,ROW(arr_eventdate)),ROW()-ROW($B$13))),\"\")","v":""},null,null,null,null,7,":00",null,null,null,null,null,null,null,null,null,null,null,null,null,null,null,null,{"$f":"IFERROR(INDEX(arr_event,SMALL(IF(arr_eventdate=$E$3,ROW(arr_eventdate)),ROW()-ROW($B$13))),\"\")","v":""},null,null,null,null,7,":00"]
[null,"",null,null,null,null,null,":30",null,null,null,null,null,null,null,null,null,null,null,null,null,null,null,null,"",null,null,null,null,null,":30"]
[null,"",null,null,null,null,8,":00",null,null,null,null,null,null,null,null,null,null,null,null,null,null,null,null,"",null,null,null,null,8,":00"]
[null,"",null,null,null,null,null,":30",null,null,null,null,null,null,null,null,null,null,null,null,null,null,null,null,"",null,null,null,null,null,":30"]
[null,"",null,null,null,null,9,":00",null,null,null,null,null,null,null,null,null,null,null,null,null,null,null,null,"",null,null,null,null,9,":00"]
[null,"",null,null,null,null,null,":30",null,null,null,null,null,null,null,null,null,null,null,null,null,null,null,null,"",null,null,null,null,null,":30"]
[null,"",null,null,null,null,10,":00",null,null,null,null,null,null,null,null,null,null,null,null,null,null,null,null,"",null,null,null,null,10,":00"]
[null,"",null,null,null,null,null,":30",null,null,null,null,null,null,null,null,null,null,null,null,null,null,null,null,"",null,null,null,null,null,":30"]
[null,"From",null,"Actions Carried Forward",null,null,11,":00",null,null,null,null,null,null,null,null,null,null,null,null,null,null,null,null,"From",null,"Actions Carried Forward",null,null,11,":00"]
[null,{"$f":"IFERROR(INDEX(arr_event,SMALL(IF(arr_eventdate=$E$3,ROW(arr_eventdate)),ROW()-ROW($B$13))),\"\")","v":""},null,null,null,null,null,":30",null,null,null,null,null,null,null,null,null,null,null,null,null,null,null,null,{"$f":"IFERROR(INDEX(arr_event,SMALL(IF(arr_eventdate=$E$3,ROW(arr_eventdate)),ROW()-ROW($B$13))),\"\")","v":""},null,null,null,null,null,":30"]
[null,{"$f":"IFERROR(INDEX(arr_event,SMALL(IF(arr_eventdate=$E$3,ROW(arr_eventdate)),ROW()-ROW($B$13))),\"\")","v":""},null,null,null,null,12,":00",null,null,null,null,null,null,null,null,null,null,null,null,null,null,null,null,{"$f":"IFERROR(INDEX(arr_event,SMALL(IF(arr_eventdate=$E$3,ROW(arr_eventdate)),ROW()-ROW($B$13))),\"\")","v":""},null,null,null,null,12,":00"]
[null,{"$f":"IFERROR(INDEX(arr_event,SMALL(IF(arr_eventdate=$E$3,ROW(arr_eventdate)),ROW()-ROW($B$13))),\"\")","v":""},null,null,null,null,null,":30",null,null,null,null,null,null,null,null,null,null,null,null,null,null,null,null,{"$f":"IFERROR(INDEX(arr_event,SMALL(IF(arr_eventdate=$E$3,ROW(arr_eventdate)),ROW()-ROW($B$13))),\"\")","v":""},null,null,null,null,null,":30"]
[null,{"$f":"IFERROR(INDEX(arr_event,SMALL(IF(arr_eventdate=$E$3,ROW(arr_eventdate)),ROW()-ROW($B$13))),\"\")","v":""},null,null,null,null,1,":00",null,null,null,null,null,null,null,null,null,null,null,null,null,null,null,null,{"$f":"IFERROR(INDEX(arr_event,SMALL(IF(arr_eventdate=$E$3,ROW(arr_eventdate)),ROW()-ROW($B$13))),\"\")","v":""},null,null,null,null,1,":00"]
[null,{"$f":"IFERROR(INDEX(arr_event,SMALL(IF(arr_eventdate=$E$3,ROW(arr_eventdate)),ROW()-ROW($B$13))),\"\")","v":""},null,null,null,null,null,":30",null,null,null,null,null,null,null,null,null,null,null,null,null,null,null,null,{"$f":"IFERROR(INDEX(arr_event,SMALL(IF(arr_eventdate=$E$3,ROW(arr_eventdate)),ROW()-ROW($B$13))),\"\")","v":""},null,null,null,null,null,":30"]
[null,{"$f":"IFERROR(INDEX(arr_event,SMALL(IF(arr_eventdate=$E$3,ROW(arr_eventdate)),ROW()-ROW($B$13))),\"\")","v":""},null,null,null,null,2,":00",null,null,null,null,null,null,null,null,null,null,null,null,null,null,null,null,{"$f":"IFERROR(INDEX(arr_event,SMALL(IF(arr_eventdate=$E$3,ROW(arr_eventdate)),ROW()-ROW($B$13))),\"\")","v":""},null,null,null,null,2,":00"]
[null,{"$f":"IFERROR(INDEX(arr_event,SMALL(IF(arr_eventdate=$E$3,ROW(arr_eventdate)),ROW()-ROW($B$13))),\"\")","v":""},null,null,null,null,null,":30",null,null,null,null,null,null,null,null,null,null,null,null,null,null,null,null,{"$f":"IFERROR(INDEX(arr_event,SMALL(IF(arr_eventdate=$E$3,ROW(arr_eventdate)),ROW()-ROW($B$13))),\"\")","v":""},null,null,null,null,null,":30"]
[null,{"$f":"IFERROR(INDEX(arr_event,SMALL(IF(arr_eventdate=$E$3,ROW(arr_eventdate)),ROW()-ROW($B$13))),\"\")","v":""},null,null,null,null,3,":00",null,null,null,null,null,null,null,null,null,null,null,null,null,null,null,null,{"$f":"IFERROR(INDEX(arr_event,SMALL(IF(arr_eventdate=$E$3,ROW(arr_eventdate)),ROW()-ROW($B$13))),\"\")","v":""},null,null,null,null,3,":00"]
[null,null,null,null,null,null,null,":30",null,null,null,null,null,null,null,null,null,null,null,null,null,null,null,null,null,null,null,null,null,null,":30"]
[null,"$Amt",null,"Expenses",null,null,4,":00",null,null,null,null,null,null,null,null,null,null,null,null,null,null,null,null,"$Amt",null,"Expenses",null,null,4,":00"]
[null,null,null,null,null,null,null,":30",null,null,null,null,null,null,null,null,null,null,null,null,null,null,null,null,null,null,null,null,null,null,":30"]
[null,null,null,null,null,null,5,":00",null,null,null,null,null,null,null,null,null,null,null,null,null,null,null,null,null,null,null,null,null,5,":00"]
[null,null,null,null,null,null,null,":30",null,null,null,null,null,null,null,null,null,null,null,null,null,null,null,null,null,null,null,null,null,null,":30"]
[null,null,null,null,null,null,6,":00",null,null,null,null,null,null,null,null,null,null,null,null,null,null,null,null,null,null,null,null,null,6,":00"]
[null,null,null,null,null,null,null,":30",null,null,null,null,null,null,null,null,null,null,null,null,null,null,null,null,null,null,null,null,null,null,":30"]
[]
[null,"Planned cases for today",null,null,null,null,null,":30",null,null,null,null,null,null,null,null,null,null,null,null,null,null,null,null,"Planned cases for today",null,null,null,null,null,":30"]
[null,"Case",null,null,null,"Action",null,null,null,null,null,null,null,null,null,null,null,null,null,"Follow-up",null,null,null,null,"Case",null,null,null,"Action",null,null,null,null,null,null,null,null,null,null,null,null,null,"Follow-up"]

{"sheet":"Days23-24","index":13,"n_rows":40,"n_cols":46,"rows_kept":40,"cut":false,"hidden":false,"merged":[[56,24,56,27],[56,28,56,41],[56,42,56,45],[57,24,57,27],[57,28,57,41],[57,42,57,45],[52,42,52,45],[53,24,53,27],[53,28,53,41],[53,42,53,45],[54,24,54,27],[54,28,54,41],[54,42,54,45],[55,24,55,27],[55,28,55,41],[55,42,55,45],[48,42,48,45],[49,24,49,27],[49,28,49,41],[49,42,49,45],[50,24,50,27],[50,28,50,41],[50,42,50,45],[51,24,51,27],[51,28,51,41],[51,42,51,45],[44,42,44,45],[45,24,45,27],[45,28,45,41],[45,42,45,45],[46,24,46,27],[46,28,46,41],[46,42,46,45],[47,24,47,27],[47,28,47,41],[47,42,47,45],[40,42,40,45],[41,24,41,27],[41,28,41,41],[41,42,41,45],[42,24,42,27],[42,28,42,41],[42,42,42,45],[43,24,43,27],[43,28,43,41],[43,42,43,45],[57,1,57,4],[57,5,57,18],[57,19,57,22],[58,1,58,4],[58,5,58,18],[58,19,58,22],[29,24,29,25],[31,24,31,25],[31,26,31,27],[32,24,32,25],[32,26,32,27],[33,24,33,25],[33,26,33,27],[34,24,34,25],[34,26,34,27],[35,24,35,25],[35,26,35,27],[36,24,36,25],[36,26,36,27],[38,24,38,45],[39,24,39,27],[39,28,39,41],[39,42,39,45],[40,24,40,27],[0,32,0,33],[2,1,5,3],[2,4,3,7],[2,8,2,14],[2,16,2,22],[2,24,5,26],[2,27,3,30],[2,31,2,37],[29,1,29,2],[13,6,14,6],[13,29,14,29],[15,6,16,6],[15,29,16,29],[17,6,18,6],[17,29,18,29],[2,39,2,45],[4,4,5,6],[4,27,5,29],[6,5,6,6],[6,28,6,29],[12,1,12,4],[12,16,12,22],[12,24,12,27],[12,39,12,45],[22,24,22,25],[22,26,22,27],[23,1,23,2],[23,3,23,4],[23,6,24,6],[23,24,23,25],[23,26,23,27],[19,6,20,6],[19,29,20,29],[21,1,21,2],[21,3,21,4],[21,6,22,6],[21,24,21,25],[21,26,21,27],[21,29,22,29],[22,1,22,2],[22,3,22,4],[23,29,24,29],[24,1,24,2],[24,3,24,4],[24,24,24,25],[24,26,24,27],[25,1,25,2],[25,3,25,4],[25,6,26,6],[25,24,25,25],[25,26,25,27],[25,29,26,29],[26,1,26,2],[26,3,26,4],[26,24,26,25],[26,26,26,27],[27,1,27,2],[27,3,27,4],[27,6,28,6],[27,24,27,25],[27,26,27,27],[27,29,28,29],[28,1,28,2],[28,3,28,4],[28,24,28,25],[28,26,28,27],[29,3,29,4],[29,6,30,6],[29,26,29,27],[29,29,30,29],[31,6,32,6],[31,29,32,29],[33,6,34,6],[33,29,34,29],[35,6,36,6],[35,29,36,29],[40,5,40,18],[40,19,40,22],[41,5,41,18],[41,19,41,22],[42,5,42,18],[42,19,42,22],[40,28,40,41],[42,1,42,4],[43,1,43,4],[43,5,43,18],[43,19,43,22],[44,24,44,27],[44,28,44,41],[31,1,31,2],[31,3,31,4],[40,1,40,4],[41,1,41,4],[44,1,44,4],[44,5,44,18],[44,19,44,22],[45,1,45,4],[45,5,45,18],[45,19,45,22],[46,1,46,4],[46,5,46,18],[46,19,46,22],[47,1,47,4],[47,5,47,18],[47,19,47,22],[32,1,32,2],[32,3,32,4],[33,1,33,2],[33,3,33,4],[48,1,48,4],[48,5,48,18],[48,19,48,22],[49,1,49,4],[49,5,49,18],[49,19,49,22],[50,1,50,4],[50,5,50,18],[50,19,50,22],[51,1,51,4],[51,5,51,18],[51,19,51,22],[48,24,48,27],[48,28,48,41],[34,1,34,2],[34,3,34,4],[35,1,35,2],[35,3,35,4],[52,1,52,4],[52,5,52,18],[52,19,52,22],[53,1,53,4],[53,5,53,18],[53,19,53,22],[52,24,52,27],[52,28,52,41],[39,1,39,4],[39,5,39,18],[39,19,39,22],[58,24,58,27],[58,28,58,41],[58,42,58,45],[36,1,36,2],[36,3,36,4],[38,1,38,22],[54,1,54,4],[54,5,54,18],[54,19,54,22],[55,1,55,4],[55,5,55,18],[55,19,55,22],[56,1,56,4],[56,5,56,18],[56,19,56,22],[61,1,61,4],[61,5,61,18],[61,19,61,22],[61,24,61,27],[61,28,61,41],[61,42,61,45],[59,1,59,4],[59,5,59,18],[59,19,59,22],[59,24,59,27],[59,28,59,41],[59,42,59,45],[62,1,62,4],[62,5,62,18],[62,19,62,22],[62,24,62,27],[62,28,62,41],[62,42,62,45]]}
[]
[]
[null,{"$f":"DAY(E3)","v":22},null,null,{"$f":"'Days21-22'!AB3+1","v":"2024-05-22"},null,null,null,{"$f":"DATE(YEAR($E$3),MONTH($E$3),1)","v":"2024-05-01"},null,null,null,null,null,null,null,{"$f":"DATE(YEAR(I3+35),MONTH(I3+35),1)","v":"2024-06-01"},null,null,null,null,null,null,null,{"$f":"DAY(AB3)","v":23},null,null,{"$f":"E3+1","v":"2024-05-23"},null,null,null,{"$f":"DATE(YEAR(AB3),MONTH(AB3),1)","v":"2024-05-01"},null,null,null,null,null,null,null,{"$f":"DATE(YEAR(AF3+35),MONTH(AF3+35),1)","v":"2024-06-01"}]
[null,null,null,null,null,null,null,null,{"$f":"CHOOSE(1+MOD('Days1-2'!J1+1-2,7),\"Su\",\"M\",\"Tu\",\"W\",\"Th\",\"F\",\"Sa\")","v":"Su"},{"$f":"CHOOSE(1+MOD('Days1-2'!$J$1+2-2,7),\"Su\",\"M\",\"Tu\",\"W\",\"Th\",\"F\",\"Sa\")","v":"M"},{"$f":"CHOOSE(1+MOD('Days1-2'!$J$1+3-2,7),\"Su\",\"M\",\"Tu\",\"W\",\"Th\",\"F\",\"Sa\")","v":"Tu"},{"$f":"CHOOSE(1+MOD('Days1-2'!$J$1+4-2,7),\"Su\",\"M\",\"Tu\",\"W\",\"Th\",\"F\",\"Sa\")","v":"W"},{"$f":"CHOOSE(1+MOD('Days1-2'!$J$1+5-2,7),\"Su\",\"M\",\"Tu\",\"W\",\"Th\",\"F\",\"Sa\")","v":"Th"},{"$f":"CHOOSE(1+MOD('Days1-2'!$J$1+6-2,7),\"Su\",\"M\",\"Tu\",\"W\",\"Th\",\"F\",\"Sa\")","v":"F"},{"$f":"CHOOSE(1+MOD('Days1-2'!$J$1+7-2,7),\"Su\",\"M\",\"Tu\",\"W\",\"Th\",\"F\",\"Sa\")","v":"Sa"},null,{"$f":"CHOOSE(1+MOD('Days1-2'!J1+1-2,7),\"Su\",\"M\",\"Tu\",\"W\",\"Th\",\"F\",\"Sa\")","v":"Su"},{"$f":"CHOOSE(1+MOD('Days1-2'!J1+2-2,7),\"Su\",\"M\",\"Tu\",\"W\",\"Th\",\"F\",\"Sa\")","v":"M"},{"$f":"CHOOSE(1+MOD('Days1-2'!J1+3-2,7),\"Su\",\"M\",\"Tu\",\"W\",\"Th\",\"F\",\"Sa\")","v":"Tu"},{"$f":"CHOOSE(1+MOD('Days1-2'!J1+4-2,7),\"Su\",\"M\",\"Tu\",\"W\",\"Th\",\"F\",\"Sa\")","v":"W"},{"$f":"CHOOSE(1+MOD('Days1-2'!J1+5-2,7),\"Su\",\"M\",\"Tu\",\"W\",\"Th\",\"F\",\"Sa\")","v":"Th"},{"$f":"CHOOSE(1+MOD('Days1-2'!J1+6-2,7),\"Su\",\"M\",\"Tu\",\"W\",\"Th\",\"F\",\"Sa\")","v":"F"},{"$f":"CHOOSE(1+MOD('Days1-2'!J1+7-2,7),\"Su\",\"M\",\"Tu\",\"W\",\"Th\",\"F\",\"Sa\")","v":"Sa"},null,null,null,null,null,null,null,null,{"$f":"CHOOSE(1+MOD('Days1-2'!$J$1+1-2,7),\"Su\",\"M\",\"Tu\",\"W\",\"Th\",\"F\",\"Sa\")","v":"Su"},{"$f":"CHOOSE(1+MOD('Days1-2'!$J$1+2-2,7),\"Su\",\"M\",\"Tu\",\"W\",\"Th\",\"F\",\"Sa\")","v":"M"},{"$f":"CHOOSE(1+MOD('Days1-2'!$J$1+3-2,7),\"Su\",\"M\",\"Tu\",\"W\",\"Th\",\"F\",\"Sa\")","v":"Tu"},{"$f":"CHOOSE(1+MOD('Days1-2'!$J$1+4-2,7),\"Su\",\"M\",\"Tu\",\"W\",\"Th\",\"F\",\"Sa\")","v":"W"},{"$f":"CHOOSE(1+MOD('Days1-2'!$J$1+5-2,7),\"Su\",\"M\",\"Tu\",\"W\",\"Th\",\"F\",\"Sa\")","v":"Th"},{"$f":"CHOOSE(1+MOD('Days1-2'!$J$1+6-2,7),\"Su\",\"M\",\"Tu\",\"W\",\"Th\",\"F\",\"Sa\")","v":"F"},{"$f":"CHOOSE(1+MOD('Days1-2'!$J$1+7-2,7),\"Su\",\"M\",\"Tu\",\"W\",\"Th\",\"F\",\"Sa\")","v":"Sa"},null,{"$f":"CHOOSE(1+MOD('Days1-2'!$J$1+1-2,7),\"Su\",\"M\",\"Tu\",\"W\",\"Th\",\"F\",\"Sa\")","v":"Su"},{"$f":"CHOOSE(1+MOD('Days1-2'!$J$1+2-2,7),\"Su\",\"M\",\"Tu\",\"W\",\"Th\",\"F\",\"Sa\")","v":"M"},{"$f":"CHOOSE(1+MOD('Days1-2'!$J$1+3-2,7),\"Su\",\"M\",\"Tu\",\"W\",\"Th\",\"F\",\"Sa\")","v":"Tu"},{"$f":"CHOOSE(1+MOD('Days1-2'!$J$1+4-2,7),\"Su\",\"M\",\"Tu\",\"W\",\"Th\",\"F\",\"Sa\")","v":"W"},{"$f":"CHOOSE(1+MOD('Days1-2'!$J$1+5-2,7),\"Su\",\"M\",\"Tu\",\"W\",\"Th\",\"F\",\"Sa\")","v":"Th"},{"$f":"CHOOSE(1+MOD('Days1-2'!$J$1+6-2,7),\"Su\",\"M\",\"Tu\",\"W\",\"Th\",\"F\",\"Sa\")","v":"F"},{"$f":"CHOOSE(1+MOD('Days1-2'!$J$1+7-2,7),\"Su\",\"M\",\"Tu\",\"W\",\"Th\",\"F\",\"Sa\")","v":"Sa"}]
[null,null,null,null,{"$f":"INDEX({\"Sunday\",\"Monday\",\"Tuesday\",\"Wednesday\",\"Thursday\",\"Friday\",\"Saturday\"},WEEKDAY(E3))","v":"Wednesday"},null,null,null,{"$f":"IF(WEEKDAY(I3,1)='Days1-2'!$J$1,I3,\"\")","v":""},{"$f":"IF(I5=\"\",IF(WEEKDAY(I3,1)=MOD('Days1-2'!$J$1,7)+1,I3,\"\"),I5+1)","v":""},{"$f":"IF(J5=\"\",IF(WEEKDAY(I3,1)=MOD('Days1-2'!$J$1+1,7)+1,I3,\"\"),J5+1)","v":""},{"$f":"IF(K5=\"\",IF(WEEKDAY(I3,1)=MOD('Days1-2'!$J$1+2,7)+1,I3,\"\"),K5+1)","v":"2024-05-01"},{"$f":"IF(L5=\"\",IF(WEEKDAY(I3,1)=MOD('Days1-2'!$J$1+3,7)+1,I3,\"\"),L5+1)","v":"2024-05-02"},{"$f":"IF(M5=\"\",IF(WEEKDAY(I3,1)=MOD('Days1-2'!$J$1+4,7)+1,I3,\"\"),M5+1)","v":"2024-05-03"},{"$f":"IF(N5=\"\",IF(WEEKDAY(I3,1)=MOD('Days1-2'!$J$1+5,7)+1,I3,\"\"),N5+1)","v":"2024-05-04"},null,{"$f":"IF(WEEKDAY(Q3,1)='Days1-2'!$J$1,Q3,\"\")","v":""},{"$f":"IF(Q5=\"\",IF(WEEKDAY(Q3,1)=MOD('Days1-2'!$J$1,7)+1,Q3,\"\"),Q5+1)","v":""},{"$f":"IF(R5=\"\",IF(WEEKDAY(Q3,1)=MOD('Days1-2'!$J$1+1,7)+1,Q3,\"\"),R5+1)","v":""},{"$f":"IF(S5=\"\",IF(WEEKDAY(Q3,1)=MOD('Days1-2'!$J$1+2,7)+1,Q3,\"\"),S5+1)","v":""},{"$f":"IF(T5=\"\",IF(WEEKDAY(Q3,1)=MOD('Days1-2'!$J$1+3,7)+1,Q3,\"\"),T5+1)","v":""},{"$f":"IF(U5=\"\",IF(WEEKDAY(Q3,1)=MOD('Days1-2'!$J$1+4,7)+1,Q3,\"\"),U5+1)","v":""},{"$f":"IF(V5=\"\",IF(WEEKDAY(Q3,1)=MOD('Days1-2'!$J$1+5,7)+1,Q3,\"\"),V5+1)","v":"2024-06-01"},null,null,null,null,{"$f":"INDEX({\"Sunday\",\"Monday\",\"Tuesday\",\"Wednesday\",\"Thursday\",\"Friday\",\"Saturday\"},WEEKDAY(AB3))","v":"Thursday"},null,null,null,{"$f":"IF(WEEKDAY(AF3,1)='Days1-2'!$J$1,AF3,\"\")","v":""},{"$f":"IF(AF5=\"\",IF(WEEKDAY(AF3,1)=MOD('Days1-2'!$J$1,7)+1,AF3,\"\"),AF5+1)","v":""},{"$f":"IF(AG5=\"\",IF(WEEKDAY(AF3,1)=MOD('Days1-2'!$J$1+1,7)+1,AF3,\"\"),AG5+1)","v":""},{"$f":"IF(AH5=\"\",IF(WEEKDAY(AF3,1)=MOD('Days1-2'!$J$1+2,7)+1,AF3,\"\"),AH5+1)","v":"2024-05-01"},{"$f":"IF(AI5=\"\",IF(WEEKDAY(AF3,1)=MOD('Days1-2'!$J$1+3,7)+1,AF3,\"\"),AI5+1)","v":"2024-05-02"},{"$f":"IF(AJ5=\"\",IF(WEEKDAY(AF3,1)=MOD('Days1-2'!$J$1+4,7)+1,AF3,\"\"),AJ5+1)","v":"2024-05-03"},{"$f":"IF(AK5=\"\",IF(WEEKDAY(AF3,1)=MOD('Days1-2'!$J$1+5,7)+1,AF3,\"\"),AK5+1)","v":"2024-05-04"},null,{"$f":"IF(WEEKDAY(AN3,1)='Days1-2'!$J$1,AN3,\"\")","v":""},{"$f":"IF(AN5=\"\",IF(WEEKDAY(AN3,1)=MOD('Days1-2'!$J$1,7)+1,AN3,\"\"),AN5+1)","v":""},{"$f":"IF(AO5=\"\",IF(WEEKDAY(AN3,1)=MOD('Days1-2'!$J$1+1,7)+1,AN3,\"\"),AO5+1)","v":""},{"$f":"IF(AP5=\"\",IF(WEEKDAY(AN3,1)=MOD('Days1-2'!$J$1+2,7)+1,AN3,\"\"),AP5+1)","v":""},{"$f":"IF(AQ5=\"\",IF(WEEKDAY(AN3,1)=MOD('Days1-2'!$J$1+3,7)+1,AN3,\"\"),AQ5+1)","v":""},{"$f":"IF(AR5=\"\",IF(WEEKDAY(AN3,1)=MOD('Days1-2'!$J$1+4,7)+1,AN3,\"\"),AR5+1)","v":""},{"$f":"IF(AS5=\"\",IF(WEEKDAY(AN3,1)=MOD('Days1-2'!$J$1+5,7)+1,AN3,\"\"),AS5+1)","v":"2024-06-01"}]
[null,null,null,null,null,null,null,null,{"$f":"IF(O5=\"\",\"\",IF(MONTH(O5+1)<>MONTH(O5),\"\",O5+1))","v":"2024-05-05"},{"$f":"IF(I6=\"\",\"\",IF(MONTH(I6+1)<>MONTH(I6),\"\",I6+1))","v":"2024-05-06"},{"$f":"IF(J6=\"\",\"\",IF(MONTH(J6+1)<>MONTH(J6),\"\",J6+1))","v":"2024-05-07"},{"$f":"IF(K6=\"\",\"\",IF(MONTH(K6+1)<>MONTH(K6),\"\",K6+1))","v":"2024-05-08"},"2024-05-09","2024-05-10","2024-05-11",null,{"$f":"IF(W5=\"\",\"\",IF(MONTH(W5+1)<>MONTH(W5),\"\",W5+1))","v":"2024-06-02"},{"$f":"IF(Q6=\"\",\"\",IF(MONTH(Q6+1)<>MONTH(Q6),\"\",Q6+1))","v":"2024-06-03"},{"$f":"IF(R6=\"\",\"\",IF(MONTH(R6+1)<>MONTH(R6),\"\",R6+1))","v":"2024-06-04"},{"$f":"IF(S6=\"\",\"\",IF(MONTH(S6+1)<>MONTH(S6),\"\",S6+1))","v":"2024-06-05"},{"$f":"IF(T6=\"\",\"\",IF(MONTH(T6+1)<>MONTH(T6),\"\",T6+1))","v":"2024-06-06"},"2024-06-07","2024-06-08",null,null,null,null,null,null,null,null,{"$f":"IF(AL5=\"\",\"\",IF(MONTH(AL5+1)<>MONTH(AL5),\"\",AL5+1))","v":"2024-05-05"},{"$f":"IF(AF6=\"\",\"\",IF(MONTH(AF6+1)<>MONTH(AF6),\"\",AF6+1))","v":"2024-05-06"},{"$f":"IF(AG6=\"\",\"\",IF(MONTH(AG6+1)<>MONTH(AG6),\"\",AG6+1))","v":"2024-05-07"},{"$f":"IF(AH6=\"\",\"\",IF(MONTH(AH6+1)<>MONTH(AH6),\"\",AH6+1))","v":"2024-05-08"},{"$f":"IF(AI6=\"\",\"\",IF(MONTH(AI6+1)<>MONTH(AI6),\"\",AI6+1))","v":"2024-05-09"},"2024-05-10","2024-05-11",null,{"$f":"IF(AT5=\"\",\"\",IF(MONTH(AT5+1)<>MONTH(AT5),\"\",AT5+1))","v":"2024-06-02"},{"$f":"IF(AN6=\"\",\"\",IF(MONTH(AN6+1)<>MONTH(AN6),\"\",AN6+1))","v":"2024-06-03"},{"$f":"IF(AO6=\"\",\"\",IF(MONTH(AO6+1)<>MONTH(AO6),\"\",AO6+1))","v":"2024-06-04"},{"$f":"IF(AP6=\"\",\"\",IF(MONTH(AP6+1)<>MONTH(AP6),\"\",AP6+1))","v":"2024-06-05"},{"$f":"IF(AQ6=\"\",\"\",IF(MONTH(AQ6+1)<>MONTH(AQ6),\"\",AQ6+1))","v":"2024-06-06"},"2024-06-07","2024-06-08"]
[null,{"$f":"IFERROR(INDEX(arr_holiday,SMALL(IF(arr_holidaydate=$E$3,ROW(arr_holidaydate)),ROW()-ROW($B$6))),\"\")","v":""},null,null,null,null,null,null,{"$f":"IF(O6=\"\",\"\",IF(MONTH(O6+1)<>MONTH(O6),\"\",O6+1))","v":"2024-05-12"},{"$f":"IF(I7=\"\",\"\",IF(MONTH(I7+1)<>MONTH(I7),\"\",I7+1))","v":"2024-05-13"},"2024-05-14","2024-05-15","2024-05-16","2024-05-17","2024-05-18",null,{"$f":"IF(W6=\"\",\"\",IF(MONTH(W6+1)<>MONTH(W6),\"\",W6+1))","v":"2024-06-09"},{"$f":"IF(Q7=\"\",\"\",IF(MONTH(Q7+1)<>MONTH(Q7),\"\",Q7+1))","v":"2024-06-10"},"2024-06-11","2024-06-12","2024-06-13","2024-06-14","2024-06-15",null,{"$f":"IFERROR(INDEX(arr_holiday,SMALL(IF(arr_holidaydate=$AB$3,ROW(arr_holidaydate)),ROW()-ROW($B$6))),\"\")","v":""},null,null,null,null,null,null,{"$f":"IF(AL6=\"\",\"\",IF(MONTH(AL6+1)<>MONTH(AL6),\"\",AL6+1))","v":"2024-05-12"},{"$f":"IF(AF7=\"\",\"\",IF(MONTH(AF7+1)<>MONTH(AF7),\"\",AF7+1))","v":"2024-05-13"},"2024-05-14","2024-05-15","2024-05-16","2024-05-17","2024-05-18",null,{"$f":"IF(AT6=\"\",\"\",IF(MONTH(AT6+1)<>MONTH(AT6),\"\",AT6+1))","v":"2024-06-09"},{"$f":"IF(AN7=\"\",\"\",IF(MONTH(AN7+1)<>MONTH(AN7),\"\",AN7+1))","v":"2024-06-10"},"2024-06-11","2024-06-12","2024-06-13","2024-06-14","2024-06-15"]
[null,{"$f":"IFERROR(INDEX(arr_holiday,SMALL(IF(arr_holidaydate=$E$3,ROW(arr_holidaydate)),ROW()-ROW($B$6))),\"\")","v":""},null,null,null,null,null,null,"2024-05-19","2024-05-20","2024-05-21","2024-05-22","2024-05-23","2024-05-24","2024-05-25",null,"2024-06-16","2024-06-17","2024-06-18","2024-06-19","2024-06-20","2024-06-21","2024-06-22",null,{"$f":"IFERROR(INDEX(arr_holiday,SMALL(IF(arr_holidaydate=$AB$3,ROW(arr_holidaydate)),ROW()-ROW($B$6))),\"\")","v":""},null,null,null,null,null,null,"2024-05-19","2024-05-20","2024-05-21","2024-05-22","2024-05-23","2024-05-24","2024-05-25",null,"2024-06-16","2024-06-17","2024-06-18","2024-06-19","2024-06-20","2024-06-21","2024-06-22"]
[null,{"$f":"IFERROR(INDEX(arr_holiday,SMALL(IF(arr_holidaydate=$E$3,ROW(arr_holidaydate)),ROW()-ROW($B$6))),\"\")","v":""},null,null,null,null,null,null,"2024-05-26","2024-05-27","2024-05-28","2024-05-29","2024-05-30","2024-05-31","",null,"2024-06-23","2024-06-24","2024-06-25","2024-06-26","2024-06-27","2024-06-28","2024-06-29",null,{"$f":"IFERROR(INDEX(arr_holiday,SMALL(IF(arr_holidaydate=$AB$3,ROW(arr_holidaydate)),ROW()-ROW($B$6))),\"\")","v":""},null,null,null,null,null,null,"2024-05-26","2024-05-27","2024-05-28","2024-05-29","2024-05-30","2024-05-31","",null,"2024-06-23","2024-06-24","2024-06-25","2024-06-26","2024-06-27","2024-06-28","2024-06-29"]
[null,{"$f":"IFERROR(INDEX(arr_event,SMALL(IF(arr_eventdate=$E$3,ROW(arr_eventdate)),ROW()-ROW($B$9))),\"\")","v":""},null,null,null,null,null,null,"","","","","","","",null,"2024-06-30","","","","","","",null,{"$f":"IFERROR(INDEX(arr_event,SMALL(IF(arr_eventdate=$AB$3,ROW(arr_eventdate)),ROW()-ROW($B$9))),\"\")","v":""},null,null,null,null,null,null,"","","","","","","",null,"2024-06-30","","","","","",""]
[null,{"$f":"IFERROR(INDEX(arr_event,SMALL(IF(arr_eventdate=$E$3,ROW(arr_eventdate)),ROW()-ROW($B$9))),\"\")","v":""},null,null,null,null,null,null,null,null,null,null,null,null,null,null,null,null,null,null,null,null,null,null,{"$f":"IFERROR(INDEX(arr_event,SMALL(IF(arr_eventdate=$AB$3,ROW(arr_eventdate)),ROW()-ROW($B$9))),\"\")","v":""}]
[null,{"$f":"IFERROR(INDEX(arr_event,SMALL(IF(arr_eventdate=$E$3,ROW(arr_eventdate)),ROW()-ROW($B$9))),\"\")","v":""},null,null,null,null,null,null,null,null,null,null,null,null,null,null,null,null,null,null,null,null,null,null,{"$f":"IFERROR(INDEX(arr_event,SMALL(IF(arr_eventdate=$AB$3,ROW(arr_eventdate)),ROW()-ROW($B$9))),\"\")","v":""}]
[null,"Reminders",null,null,null,null,null,null,"Appointments",null,null,null,null,null,null,null,"Notes",null,null,null,null,null,null,null,"Reminders",null,null,null,null,null,null,"Appointments",null,null,null,null,null,null,null,"Notes"]
[null,{"$f":"IFERROR(INDEX(arr_event,SMALL(IF(arr_eventdate=$E$3,ROW(arr_eventdate)),ROW()-ROW($B$13))),\"\")","v":""},null,null,null,null,7,":00",null,null,null,null,null,null,null,null,null,null,null,null,null,null,null,null,{"$f":"IFERROR(INDEX(arr_event,SMALL(IF(arr_eventdate=$E$3,ROW(arr_eventdate)),ROW()-ROW($B$13))),\"\")","v":""},null,null,null,null,7,":00"]
[null,"",null,null,null,null,null,":30",null,null,null,null,null,null,null,null,null,null,null,null,null,null,null,null,"",null,null,null,null,null,":30"]
[null,"",null,null,null,null,8,":00",null,null,null,null,null,null,null,null,null,null,null,null,null,null,null,null,"",null,null,null,null,8,":00"]
[null,"",null,null,null,null,null,":30",null,null,null,null,null,null,null,null,null,null,null,null,null,null,null,null,"",null,null,null,null,null,":30"]
[null,"",null,null,null,null,9,":00",null,null,null,null,null,null,null,null,null,null,null,null,null,null,null,null,"",null,null,null,null,9,":00"]
[null,"",null,null,null,null,null,":30",null,null,null,null,null,null,null,null,null,null,null,null,null,null,null,null,"",null,null,null,null,null,":30"]
[null,"",null,null,null,null,10,":00",null,null,null,null,null,null,null,null,null,null,null,null,null,null,null,null,"",null,null,null,null,10,":00"]
[null,"",null,null,null,null,null,":30",null,null,null,null,null,null,null,null,null,null,null,null,null,null,null,null,"",null,null,null,null,null,":30"]
[null,"From",null,"Actions Carried Forward",null,null,11,":00",null,null,null,null,null,null,null,null,null,null,null,null,null,null,null,null,"From",null,"Actions Carried Forward",null,null,11,":00"]
[null,{"$f":"IFERROR(INDEX(arr_event,SMALL(IF(arr_eventdate=$E$3,ROW(arr_eventdate)),ROW()-ROW($B$13))),\"\")","v":""},null,null,null,null,null,":30",null,null,null,null,null,null,null,null,null,null,null,null,null,null,null,null,{"$f":"IFERROR(INDEX(arr_event,SMALL(IF(arr_eventdate=$E$3,ROW(arr_eventdate)),ROW()-ROW($B$13))),\"\")","v":""},null,null,null,null,null,":30"]
[null,{"$f":"IFERROR(INDEX(arr_event,SMALL(IF(arr_eventdate=$E$3,ROW(arr_eventdate)),ROW()-ROW($B$13))),\"\")","v":""},null,null,null,null,12,":00",null,null,null,null,null,null,null,null,null,null,null,null,null,null,null,null,{"$f":"IFERROR(INDEX(arr_event,SMALL(IF(arr_eventdate=$E$3,ROW(arr_eventdate)),ROW()-ROW($B$13))),\"\")","v":""},null,null,null,null,12,":00"]
[null,{"$f":"IFERROR(INDEX(arr_event,SMALL(IF(arr_eventdate=$E$3,ROW(arr_eventdate)),ROW()-ROW($B$13))),\"\")","v":""},null,null,null,null,null,":30",null,null,null,null,null,null,null,null,null,null,null,null,null,null,null,null,{"$f":"IFERROR(INDEX(arr_event,SMALL(IF(arr_eventdate=$E$3,ROW(arr_eventdate)),ROW()-ROW($B$13))),\"\")","v":""},null,null,null,null,null,":30"]
[null,{"$f":"IFERROR(INDEX(arr_event,SMALL(IF(arr_eventdate=$E$3,ROW(arr_eventdate)),ROW()-ROW($B$13))),\"\")","v":""},null,null,null,null,1,":00",null,null,null,null,null,null,null,null,null,null,null,null,null,null,null,null,{"$f":"IFERROR(INDEX(arr_event,SMALL(IF(arr_eventdate=$E$3,ROW(arr_eventdate)),ROW()-ROW($B$13))),\"\")","v":""},null,null,null,null,1,":00"]
[null,{"$f":"IFERROR(INDEX(arr_event,SMALL(IF(arr_eventdate=$E$3,ROW(arr_eventdate)),ROW()-ROW($B$13))),\"\")","v":""},null,null,null,null,null,":30",null,null,null,null,null,null,null,null,null,null,null,null,null,null,null,null,{"$f":"IFERROR(INDEX(arr_event,SMALL(IF(arr_eventdate=$E$3,ROW(arr_eventdate)),ROW()-ROW($B$13))),\"\")","v":""},null,null,null,null,null,":30"]
[null,{"$f":"IFERROR(INDEX(arr_event,SMALL(IF(arr_eventdate=$E$3,ROW(arr_eventdate)),ROW()-ROW($B$13))),\"\")","v":""},null,null,null,null,2,":00",null,null,null,null,null,null,null,null,null,null,null,null,null,null,null,null,{"$f":"IFERROR(INDEX(arr_event,SMALL(IF(arr_eventdate=$E$3,ROW(arr_eventdate)),ROW()-ROW($B$13))),\"\")","v":""},null,null,null,null,2,":00"]
[null,{"$f":"IFERROR(INDEX(arr_event,SMALL(IF(arr_eventdate=$E$3,ROW(arr_eventdate)),ROW()-ROW($B$13))),\"\")","v":""},null,null,null,null,null,":30",null,null,null,null,null,null,null,null,null,null,null,null,null,null,null,null,{"$f":"IFERROR(INDEX(arr_event,SMALL(IF(arr_eventdate=$E$3,ROW(arr_eventdate)),ROW()-ROW($B$13))),\"\")","v":""},null,null,null,null,null,":30"]
[null,{"$f":"IFERROR(INDEX(arr_event,SMALL(IF(arr_eventdate=$E$3,ROW(arr_eventdate)),ROW()-ROW($B$13))),\"\")","v":""},null,null,null,null,3,":00",null,null,null,null,null,null,null,null,null,null,null,null,null,null,null,null,{"$f":"IFERROR(INDEX(arr_event,SMALL(IF(arr_eventdate=$E$3,ROW(arr_eventdate)),ROW()-ROW($B$13))),\"\")","v":""},null,null,null,null,3,":00"]
[null,null,null,null,null,null,null,":30",null,null,null,null,null,null,null,null,null,null,null,null,null,null,null,null,null,null,null,null,null,null,":30"]
[null,"$Amt",null,"Expenses",null,null,4,":00",null,null,null,null,null,null,null,null,null,null,null,null,null,null,null,null,"$Amt",null,"Expenses",null,null,4,":00"]
[null,null,null,null,null,null,null,":30",null,null,null,null,null,null,null,null,null,null,null,null,null,null,null,null,null,null,null,null,null,null,":30"]
[null,null,null,null,null,null,5,":00",null,null,null,null,null,null,null,null,null,null,null,null,null,null,null,null,null,null,null,null,null,5,":00"]
[null,null,null,null,null,null,null,":30",null,null,null,null,null,null,null,null,null,null,null,null,null,null,null,null,null,null,null,null,null,null,":30"]
[null,null,null,null,null,null,6,":00",null,null,null,null,null,null,null,null,null,null,null,null,null,null,null,null,null,null,null,null,null,6,":00"]
[null,null,null,null,null,null,null,":30",null,null,null,null,null,null,null,null,null,null,null,null,null,null,null,null,null,null,null,null,null,null,":30"]
[]
[null,"Planned cases for today",null,null,null,null,null,":30",null,null,null,null,null,null,null,null,null,null,null,null,null,null,null,null,"Planned cases for today",null,null,null,null,null,":30"]
[null,"Case",null,null,null,"Action",null,null,null,null,null,null,null,null,null,null,null,null,null,"Follow-up",null,null,null,null,"Case",null,null,null,"Action",null,null,null,null,null,null,null,null,null,null,null,null,null,"Follow-up"]

{"sheet":"Days25-26","index":14,"n_rows":40,"n_cols":46,"rows_kept":40,"cut":false,"hidden":false,"merged":[[56,24,56,27],[56,28,56,41],[56,42,56,45],[57,24,57,27],[57,28,57,41],[57,42,57,45],[52,42,52,45],[53,24,53,27],[53,28,53,41],[53,42,53,45],[54,24,54,27],[54,28,54,41],[54,42,54,45],[55,24,55,27],[55,28,55,41],[55,42,55,45],[48,42,48,45],[49,24,49,27],[49,28,49,41],[49,42,49,45],[50,24,50,27],[50,28,50,41],[50,42,50,45],[51,24,51,27],[51,28,51,41],[51,42,51,45],[44,42,44,45],[45,24,45,27],[45,28,45,41],[45,42,45,45],[46,24,46,27],[46,28,46,41],[46,42,46,45],[47,24,47,27],[47,28,47,41],[47,42,47,45],[40,42,40,45],[41,24,41,27],[41,28,41,41],[41,42,41,45],[42,24,42,27],[42,28,42,41],[42,42,42,45],[43,24,43,27],[43,28,43,41],[43,42,43,45],[57,1,57,4],[57,5,57,18],[57,19,57,22],[58,1,58,4],[58,5,58,18],[58,19,58,22],[29,24,29,25],[31,24,31,25],[31,26,31,27],[32,24,32,25],[32,26,32,27],[33,24,33,25],[33,26,33,27],[34,24,34,25],[34,26,34,27],[35,24,35,25],[35,26,35,27],[36,24,36,25],[36,26,36,27],[38,24,38,45],[39,24,39,27],[39,28,39,41],[39,42,39,45],[40,24,40,27],[0,32,0,33],[2,1,5,3],[2,4,3,7],[2,8,2,14],[2,16,2,22],[2,24,5,26],[2,27,3,30],[2,31,2,37],[29,1,29,2],[13,6,14,6],[13,29,14,29],[15,6,16,6],[15,29,16,29],[17,6,18,6],[17,29,18,29],[2,39,2,45],[4,4,5,6],[4,27,5,29],[6,5,6,6],[6,28,6,29],[12,1,12,4],[12,16,12,22],[12,24,12,27],[12,39,12,45],[22,24,22,25],[22,26,22,27],[23,1,23,2],[23,3,23,4],[23,6,24,6],[23,24,23,25],[23,26,23,27],[19,6,20,6],[19,29,20,29],[21,1,21,2],[21,3,21,4],[21,6,22,6],[21,24,21,25],[21,26,21,27],[21,29,22,29],[22,1,22,2],[22,3,22,4],[23,29,24,29],[24,1,24,2],[24,3,24,4],[24,24,24,25],[24,26,24,27],[25,1,25,2],[25,3,25,4],[25,6,26,6],[25,24,25,25],[25,26,25,27],[25,29,26,29],[26,1,26,2],[26,3,26,4],[26,24,26,25],[26,26,26,27],[27,1,27,2],[27,3,27,4],[27,6,28,6],[27,24,27,25],[27,26,27,27],[27,29,28,29],[28,1,28,2],[28,3,28,4],[28,24,28,25],[28,26,28,27],[29,3,29,4],[29,6,30,6],[29,26,29,27],[29,29,30,29],[31,6,32,6],[31,29,32,29],[33,6,34,6],[33,29,34,29],[35,6,36,6],[35,29,36,29],[40,5,40,18],[40,19,40,22],[41,5,41,18],[41,19,41,22],[42,5,42,18],[42,19,42,22],[40,28,40,41],[42,1,42,4],[43,1,43,4],[43,5,43,18],[43,19,43,22],[44,24,44,27],[44,28,44,41],[31,1,31,2],[31,3,31,4],[40,1,40,4],[41,1,41,4],[44,1,44,4],[44,5,44,18],[44,19,44,22],[45,1,45,4],[45,5,45,18],[45,19,45,22],[46,1,46,4],[46,5,46,18],[46,19,46,22],[47,1,47,4],[47,5,47,18],[47,19,47,22],[32,1,32,2],[32,3,32,4],[33,1,33,2],[33,3,33,4],[48,1,48,4],[48,5,48,18],[48,19,48,22],[49,1,49,4],[49,5,49,18],[49,19,49,22],[50,1,50,4],[50,5,50,18],[50,19,50,22],[51,1,51,4],[51,5,51,18],[51,19,51,22],[48,24,48,27],[48,28,48,41],[34,1,34,2],[34,3,34,4],[35,1,35,2],[35,3,35,4],[52,1,52,4],[52,5,52,18],[52,19,52,22],[53,1,53,4],[53,5,53,18],[53,19,53,22],[52,24,52,27],[52,28,52,41],[39,1,39,4],[39,5,39,18],[39,19,39,22],[58,24,58,27],[58,28,58,41],[58,42,58,45],[36,1,36,2],[36,3,36,4],[38,1,38,22],[54,1,54,4],[54,5,54,18],[54,19,54,22],[55,1,55,4],[55,5,55,18],[55,19,55,22],[56,1,56,4],[56,5,56,18],[56,19,56,22],[61,1,61,4],[61,5,61,18],[61,19,61,22],[61,24,61,27],[61,28,61,41],[61,42,61,45],[59,1,59,4],[59,5,59,18],[59,19,59,22],[59,24,59,27],[59,28,59,41],[59,42,59,45],[62,1,62,4],[62,5,62,18],[62,19,62,22],[62,24,62,27],[62,28,62,41],[62,42,62,45]]}
[]
[]
[null,{"$f":"DAY(E3)","v":24},null,null,{"$f":"'Days23-24'!AB3+1","v":"2024-05-24"},null,null,null,{"$f":"DATE(YEAR($E$3),MONTH($E$3),1)","v":"2024-05-01"},null,null,null,null,null,null,null,{"$f":"DATE(YEAR(I3+35),MONTH(I3+35),1)","v":"2024-06-01"},null,null,null,null,null,null,null,{"$f":"DAY(AB3)","v":25},null,null,{"$f":"E3+1","v":"2024-05-25"},null,null,null,{"$f":"DATE(YEAR(AB3),MONTH(AB3),1)","v":"2024-05-01"},null,null,null,null,null,null,null,{"$f":"DATE(YEAR(AF3+35),MONTH(AF3+35),1)","v":"2024-06-01"}]
[null,null,null,null,null,null,null,null,{"$f":"CHOOSE(1+MOD('Days1-2'!J1+1-2,7),\"Su\",\"M\",\"Tu\",\"W\",\"Th\",\"F\",\"Sa\")","v":"Su"},{"$f":"CHOOSE(1+MOD('Days1-2'!$J$1+2-2,7),\"Su\",\"M\",\"Tu\",\"W\",\"Th\",\"F\",\"Sa\")","v":"M"},{"$f":"CHOOSE(1+MOD('Days1-2'!$J$1+3-2,7),\"Su\",\"M\",\"Tu\",\"W\",\"Th\",\"F\",\"Sa\")","v":"Tu"},{"$f":"CHOOSE(1+MOD('Days1-2'!$J$1+4-2,7),\"Su\",\"M\",\"Tu\",\"W\",\"Th\",\"F\",\"Sa\")","v":"W"},{"$f":"CHOOSE(1+MOD('Days1-2'!$J$1+5-2,7),\"Su\",\"M\",\"Tu\",\"W\",\"Th\",\"F\",\"Sa\")","v":"Th"},{"$f":"CHOOSE(1+MOD('Days1-2'!$J$1+6-2,7),\"Su\",\"M\",\"Tu\",\"W\",\"Th\",\"F\",\"Sa\")","v":"F"},{"$f":"CHOOSE(1+MOD('Days1-2'!$J$1+7-2,7),\"Su\",\"M\",\"Tu\",\"W\",\"Th\",\"F\",\"Sa\")","v":"Sa"},null,{"$f":"CHOOSE(1+MOD('Days1-2'!J1+1-2,7),\"Su\",\"M\",\"Tu\",\"W\",\"Th\",\"F\",\"Sa\")","v":"Su"},{"$f":"CHOOSE(1+MOD('Days1-2'!J1+2-2,7),\"Su\",\"M\",\"Tu\",\"W\",\"Th\",\"F\",\"Sa\")","v":"M"},{"$f":"CHOOSE(1+MOD('Days1-2'!J1+3-2,7),\"Su\",\"M\",\"Tu\",\"W\",\"Th\",\"F\",\"Sa\")","v":"Tu"},{"$f":"CHOOSE(1+MOD('Days1-2'!J1+4-2,7),\"Su\",\"M\",\"Tu\",\"W\",\"Th\",\"F\",\"Sa\")","v":"W"},{"$f":"CHOOSE(1+MOD('Days1-2'!J1+5-2,7),\"Su\",\"M\",\"Tu\",\"W\",\"Th\",\"F\",\"Sa\")","v":"Th"},{"$f":"CHOOSE(1+MOD('Days1-2'!J1+6-2,7),\"Su\",\"M\",\"Tu\",\"W\",\"Th\",\"F\",\"Sa\")","v":"F"},{"$f":"CHOOSE(1+MOD('Days1-2'!J1+7-2,7),\"Su\",\"M\",\"Tu\",\"W\",\"Th\",\"F\",\"Sa\")","v":"Sa"},null,null,null,null,null,null,null,null,{"$f":"CHOOSE(1+MOD('Days1-2'!$J$1+1-2,7),\"Su\",\"M\",\"Tu\",\"W\",\"Th\",\"F\",\"Sa\")","v":"Su"},{"$f":"CHOOSE(1+MOD('Days1-2'!$J$1+2-2,7),\"Su\",\"M\",\"Tu\",\"W\",\"Th\",\"F\",\"Sa\")","v":"M"},{"$f":"CHOOSE(1+MOD('Days1-2'!$J$1+3-2,7),\"Su\",\"M\",\"Tu\",\"W\",\"Th\",\"F\",\"Sa\")","v":"Tu"},{"$f":"CHOOSE(1+MOD('Days1-2'!$J$1+4-2,7),\"Su\",\"M\",\"Tu\",\"W\",\"Th\",\"F\",\"Sa\")","v":"W"},{"$f":"CHOOSE(1+MOD('Days1-2'!$J$1+5-2,7),\"Su\",\"M\",\"Tu\",\"W\",\"Th\",\"F\",\"Sa\")","v":"Th"},{"$f":"CHOOSE(1+MOD('Days1-2'!$J$1+6-2,7),\"Su\",\"M\",\"Tu\",\"W\",\"Th\",\"F\",\"Sa\")","v":"F"},{"$f":"CHOOSE(1+MOD('Days1-2'!$J$1+7-2,7),\"Su\",\"M\",\"Tu\",\"W\",\"Th\",\"F\",\"Sa\")","v":"Sa"},null,{"$f":"CHOOSE(1+MOD('Days1-2'!$J$1+1-2,7),\"Su\",\"M\",\"Tu\",\"W\",\"Th\",\"F\",\"Sa\")","v":"Su"},{"$f":"CHOOSE(1+MOD('Days1-2'!$J$1+2-2,7),\"Su\",\"M\",\"Tu\",\"W\",\"Th\",\"F\",\"Sa\")","v":"M"},{"$f":"CHOOSE(1+MOD('Days1-2'!$J$1+3-2,7),\"Su\",\"M\",\"Tu\",\"W\",\"Th\",\"F\",\"Sa\")","v":"Tu"},{"$f":"CHOOSE(1+MOD('Days1-2'!$J$1+4-2,7),\"Su\",\"M\",\"Tu\",\"W\",\"Th\",\"F\",\"Sa\")","v":"W"},{"$f":"CHOOSE(1+MOD('Days1-2'!$J$1+5-2,7),\"Su\",\"M\",\"Tu\",\"W\",\"Th\",\"F\",\"Sa\")","v":"Th"},{"$f":"CHOOSE(1+MOD('Days1-2'!$J$1+6-2,7),\"Su\",\"M\",\"Tu\",\"W\",\"Th\",\"F\",\"Sa\")","v":"F"},{"$f":"CHOOSE(1+MOD('Days1-2'!$J$1+7-2,7),\"Su\",\"M\",\"Tu\",\"W\",\"Th\",\"F\",\"Sa\")","v":"Sa"}]
[null,null,null,null,{"$f":"INDEX({\"Sunday\",\"Monday\",\"Tuesday\",\"Wednesday\",\"Thursday\",\"Friday\",\"Saturday\"},WEEKDAY(E3))","v":"Friday"},null,null,null,{"$f":"IF(WEEKDAY(I3,1)='Days1-2'!$J$1,I3,\"\")","v":""},{"$f":"IF(I5=\"\",IF(WEEKDAY(I3,1)=MOD('Days1-2'!$J$1,7)+1,I3,\"\"),I5+1)","v":""},{"$f":"IF(J5=\"\",IF(WEEKDAY(I3,1)=MOD('Days1-2'!$J$1+1,7)+1,I3,\"\"),J5+1)","v":""},{"$f":"IF(K5=\"\",IF(WEEKDAY(I3,1)=MOD('Days1-2'!$J$1+2,7)+1,I3,\"\"),K5+1)","v":"2024-05-01"},{"$f":"IF(L5=\"\",IF(WEEKDAY(I3,1)=MOD('Days1-2'!$J$1+3,7)+1,I3,\"\"),L5+1)","v":"2024-05-02"},{"$f":"IF(M5=\"\",IF(WEEKDAY(I3,1)=MOD('Days1-2'!$J$1+4,7)+1,I3,\"\"),M5+1)","v":"2024-05-03"},{"$f":"IF(N5=\"\",IF(WEEKDAY(I3,1)=MOD('Days1-2'!$J$1+5,7)+1,I3,\"\"),N5+1)","v":"2024-05-04"},null,{"$f":"IF(WEEKDAY(Q3,1)='Days1-2'!$J$1,Q3,\"\")","v":""},{"$f":"IF(Q5=\"\",IF(WEEKDAY(Q3,1)=MOD('Days1-2'!$J$1,7)+1,Q3,\"\"),Q5+1)","v":""},{"$f":"IF(R5=\"\",IF(WEEKDAY(Q3,1)=MOD('Days1-2'!$J$1+1,7)+1,Q3,\"\"),R5+1)","v":""},{"$f":"IF(S5=\"\",IF(WEEKDAY(Q3,1)=MOD('Days1-2'!$J$1+2,7)+1,Q3,\"\"),S5+1)","v":""},{"$f":"IF(T5=\"\",IF(WEEKDAY(Q3,1)=MOD('Days1-2'!$J$1+3,7)+1,Q3,\"\"),T5+1)","v":""},{"$f":"IF(U5=\"\",IF(WEEKDAY(Q3,1)=MOD('Days1-2'!$J$1+4,7)+1,Q3,\"\"),U5+1)","v":""},{"$f":"IF(V5=\"\",IF(WEEKDAY(Q3,1)=MOD('Days1-2'!$J$1+5,7)+1,Q3,\"\"),V5+1)","v":"2024-06-01"},null,null,null,null,{"$f":"INDEX({\"Sunday\",\"Monday\",\"Tuesday\",\"Wednesday\",\"Thursday\",\"Friday\",\"Saturday\"},WEEKDAY(AB3))","v":"Saturday"},null,null,null,{"$f":"IF(WEEKDAY(AF3,1)='Days1-2'!$J$1,AF3,\"\")","v":""},{"$f":"IF(AF5=\"\",IF(WEEKDAY(AF3,1)=MOD('Days1-2'!$J$1,7)+1,AF3,\"\"),AF5+1)","v":""},{"$f":"IF(AG5=\"\",IF(WEEKDAY(AF3,1)=MOD('Days1-2'!$J$1+1,7)+1,AF3,\"\"),AG5+1)","v":""},{"$f":"IF(AH5=\"\",IF(WEEKDAY(AF3,1)=MOD('Days1-2'!$J$1+2,7)+1,AF3,\"\"),AH5+1)","v":"2024-05-01"},{"$f":"IF(AI5=\"\",IF(WEEKDAY(AF3,1)=MOD('Days1-2'!$J$1+3,7)+1,AF3,\"\"),AI5+1)","v":"2024-05-02"},{"$f":"IF(AJ5=\"\",IF(WEEKDAY(AF3,1)=MOD('Days1-2'!$J$1+4,7)+1,AF3,\"\"),AJ5+1)","v":"2024-05-03"},{"$f":"IF(AK5=\"\",IF(WEEKDAY(AF3,1)=MOD('Days1-2'!$J$1+5,7)+1,AF3,\"\"),AK5+1)","v":"2024-05-04"},null,{"$f":"IF(WEEKDAY(AN3,1)='Days1-2'!$J$1,AN3,\"\")","v":""},{"$f":"IF(AN5=\"\",IF(WEEKDAY(AN3,1)=MOD('Days1-2'!$J$1,7)+1,AN3,\"\"),AN5+1)","v":""},{"$f":"IF(AO5=\"\",IF(WEEKDAY(AN3,1)=MOD('Days1-2'!$J$1+1,7)+1,AN3,\"\"),AO5+1)","v":""},{"$f":"IF(AP5=\"\",IF(WEEKDAY(AN3,1)=MOD('Days1-2'!$J$1+2,7)+1,AN3,\"\"),AP5+1)","v":""},{"$f":"IF(AQ5=\"\",IF(WEEKDAY(AN3,1)=MOD('Days1-2'!$J$1+3,7)+1,AN3,\"\"),AQ5+1)","v":""},{"$f":"IF(AR5=\"\",IF(WEEKDAY(AN3,1)=MOD('Days1-2'!$J$1+4,7)+1,AN3,\"\"),AR5+1)","v":""},{"$f":"IF(AS5=\"\",IF(WEEKDAY(AN3,1)=MOD('Days1-2'!$J$1+5,7)+1,AN3,\"\"),AS5+1)","v":"2024-06-01"}]
[null,null,null,null,null,null,null,null,{"$f":"IF(O5=\"\",\"\",IF(MONTH(O5+1)<>MONTH(O5),\"\",O5+1))","v":"2024-05-05"},{"$f":"IF(I6=\"\",\"\",IF(MONTH(I6+1)<>MONTH(I6),\"\",I6+1))","v":"2024-05-06"},{"$f":"IF(J6=\"\",\"\",IF(MONTH(J6+1)<>MONTH(J6),\"\",J6+1))","v":"2024-05-07"},{"$f":"IF(K6=\"\",\"\",IF(MONTH(K6+1)<>MONTH(K6),\"\",K6+1))","v":"2024-05-08"},"2024-05-09","2024-05-10","2024-05-11",null,{"$f":"IF(W5=\"\",\"\",IF(MONTH(W5+1)<>MONTH(W5),\"\",W5+1))","v":"2024-06-02"},{"$f":"IF(Q6=\"\",\"\",IF(MONTH(Q6+1)<>MONTH(Q6),\"\",Q6+1))","v":"2024-06-03"},{"$f":"IF(R6=\"\",\"\",IF(MONTH(R6+1)<>MONTH(R6),\"\",R6+1))","v":"2024-06-04"},{"$f":"IF(S6=\"\",\"\",IF(MONTH(S6+1)<>MONTH(S6),\"\",S6+1))","v":"2024-06-05"},{"$f":"IF(T6=\"\",\"\",IF(MONTH(T6+1)<>MONTH(T6),\"\",T6+1))","v":"2024-06-06"},"2024-06-07","2024-06-08",null,null,null,null,null,null,null,null,{"$f":"IF(AL5=\"\",\"\",IF(MONTH(AL5+1)<>MONTH(AL5),\"\",AL5+1))","v":"2024-05-05"},{"$f":"IF(AF6=\"\",\"\",IF(MONTH(AF6+1)<>MONTH(AF6),\"\",AF6+1))","v":"2024-05-06"},{"$f":"IF(AG6=\"\",\"\",IF(MONTH(AG6+1)<>MONTH(AG6),\"\",AG6+1))","v":"2024-05-07"},{"$f":"IF(AH6=\"\",\"\",IF(MONTH(AH6+1)<>MONTH(AH6),\"\",AH6+1))","v":"2024-05-08"},{"$f":"IF(AI6=\"\",\"\",IF(MONTH(AI6+1)<>MONTH(AI6),\"\",AI6+1))","v":"2024-05-09"},"2024-05-10","2024-05-11",null,{"$f":"IF(AT5=\"\",\"\",IF(MONTH(AT5+1)<>MONTH(AT5),\"\",AT5+1))","v":"2024-06-02"},{"$f":"IF(AN6=\"\",\"\",IF(MONTH(AN6+1)<>MONTH(AN6),\"\",AN6+1))","v":"2024-06-03"},{"$f":"IF(AO6=\"\",\"\",IF(MONTH(AO6+1)<>MONTH(AO6),\"\",AO6+1))","v":"2024-06-04"},{"$f":"IF(AP6=\"\",\"\",IF(MONTH(AP6+1)<>MONTH(AP6),\"\",AP6+1))","v":"2024-06-05"},{"$f":"IF(AQ6=\"\",\"\",IF(MONTH(AQ6+1)<>MONTH(AQ6),\"\",AQ6+1))","v":"2024-06-06"},"2024-06-07","2024-06-08"]
[null,{"$f":"IFERROR(INDEX(arr_holiday,SMALL(IF(arr_holidaydate=$E$3,ROW(arr_holidaydate)),ROW()-ROW($B$6))),\"\")","v":""},null,null,null,null,null,null,{"$f":"IF(O6=\"\",\"\",IF(MONTH(O6+1)<>MONTH(O6),\"\",O6+1))","v":"2024-05-12"},{"$f":"IF(I7=\"\",\"\",IF(MONTH(I7+1)<>MONTH(I7),\"\",I7+1))","v":"2024-05-13"},"2024-05-14","2024-05-15","2024-05-16","2024-05-17","2024-05-18",null,{"$f":"IF(W6=\"\",\"\",IF(MONTH(W6+1)<>MONTH(W6),\"\",W6+1))","v":"2024-06-09"},{"$f":"IF(Q7=\"\",\"\",IF(MONTH(Q7+1)<>MONTH(Q7),\"\",Q7+1))","v":"2024-06-10"},"2024-06-11","2024-06-12","2024-06-13","2024-06-14","2024-06-15",null,{"$f":"IFERROR(INDEX(arr_holiday,SMALL(IF(arr_holidaydate=$AB$3,ROW(arr_holidaydate)),ROW()-ROW($B$6))),\"\")","v":""},null,null,null,null,null,null,{"$f":"IF(AL6=\"\",\"\",IF(MONTH(AL6+1)<>MONTH(AL6),\"\",AL6+1))","v":"2024-05-12"},{"$f":"IF(AF7=\"\",\"\",IF(MONTH(AF7+1)<>MONTH(AF7),\"\",AF7+1))","v":"2024-05-13"},"2024-05-14","2024-05-15","2024-05-16","2024-05-17","2024-05-18",null,{"$f":"IF(AT6=\"\",\"\",IF(MONTH(AT6+1)<>MONTH(AT6),\"\",AT6+1))","v":"2024-06-09"},{"$f":"IF(AN7=\"\",\"\",IF(MONTH(AN7+1)<>MONTH(AN7),\"\",AN7+1))","v":"2024-06-10"},"2024-06-11","2024-06-12","2024-06-13","2024-06-14","2024-06-15"]
[null,{"$f":"IFERROR(INDEX(arr_holiday,SMALL(IF(arr_holidaydate=$E$3,ROW(arr_holidaydate)),ROW()-ROW($B$6))),\"\")","v":""},null,null,null,null,null,null,"2024-05-19","2024-05-20","2024-05-21","2024-05-22","2024-05-23","2024-05-24","2024-05-25",null,"2024-06-16","2024-06-17","2024-06-18","2024-06-19","2024-06-20","2024-06-21","2024-06-22",null,{"$f":"IFERROR(INDEX(arr_holiday,SMALL(IF(arr_holidaydate=$AB$3,ROW(arr_holidaydate)),ROW()-ROW($B$6))),\"\")","v":""},null,null,null,null,null,null,"2024-05-19","2024-05-20","2024-05-21","2024-05-22","2024-05-23","2024-05-24","2024-05-25",null,"2024-06-16","2024-06-17","2024-06-18","2024-06-19","2024-06-20","2024-06-21","2024-06-22"]
[null,{"$f":"IFERROR(INDEX(arr_holiday,SMALL(IF(arr_holidaydate=$E$3,ROW(arr_holidaydate)),ROW()-ROW($B$6))),\"\")","v":""},null,null,null,null,null,null,"2024-05-26","2024-05-27","2024-05-28","2024-05-29","2024-05-30","2024-05-31","",null,"2024-06-23","2024-06-24","2024-06-25","2024-06-26","2024-06-27","2024-06-28","2024-06-29",null,{"$f":"IFERROR(INDEX(arr_holiday,SMALL(IF(arr_holidaydate=$AB$3,ROW(arr_holidaydate)),ROW()-ROW($B$6))),\"\")","v":""},null,null,null,null,null,null,"2024-05-26","2024-05-27","2024-05-28","2024-05-29","2024-05-30","2024-05-31","",null,"2024-06-23","2024-06-24","2024-06-25","2024-06-26","2024-06-27","2024-06-28","2024-06-29"]
[null,{"$f":"IFERROR(INDEX(arr_event,SMALL(IF(arr_eventdate=$E$3,ROW(arr_eventdate)),ROW()-ROW($B$9))),\"\")","v":""},null,null,null,null,null,null,"","","","","","","",null,"2024-06-30","","","","","","",null,{"$f":"IFERROR(INDEX(arr_event,SMALL(IF(arr_eventdate=$AB$3,ROW(arr_eventdate)),ROW()-ROW($B$9))),\"\")","v":""},null,null,null,null,null,null,"","","","","","","",null,"2024-06-30","","","","","",""]
[null,{"$f":"IFERROR(INDEX(arr_event,SMALL(IF(arr_eventdate=$E$3,ROW(arr_eventdate)),ROW()-ROW($B$9))),\"\")","v":""},null,null,null,null,null,null,null,null,null,null,null,null,null,null,null,null,null,null,null,null,null,null,{"$f":"IFERROR(INDEX(arr_event,SMALL(IF(arr_eventdate=$AB$3,ROW(arr_eventdate)),ROW()-ROW($B$9))),\"\")","v":""}]
[null,{"$f":"IFERROR(INDEX(arr_event,SMALL(IF(arr_eventdate=$E$3,ROW(arr_eventdate)),ROW()-ROW($B$9))),\"\")","v":""},null,null,null,null,null,null,null,null,null,null,null,null,null,null,null,null,null,null,null,null,null,null,{"$f":"IFERROR(INDEX(arr_event,SMALL(IF(arr_eventdate=$AB$3,ROW(arr_eventdate)),ROW()-ROW($B$9))),\"\")","v":""}]
[null,"Reminders",null,null,null,null,null,null,"Appointments",null,null,null,null,null,null,null,"Notes",null,null,null,null,null,null,null,"Reminders",null,null,null,null,null,null,"Appointments",null,null,null,null,null,null,null,"Notes"]
[null,{"$f":"IFERROR(INDEX(arr_event,SMALL(IF(arr_eventdate=$E$3,ROW(arr_eventdate)),ROW()-ROW($B$13))),\"\")","v":""},null,null,null,null,7,":00",null,null,null,null,null,null,null,null,null,null,null,null,null,null,null,null,{"$f":"IFERROR(INDEX(arr_event,SMALL(IF(arr_eventdate=$E$3,ROW(arr_eventdate)),ROW()-ROW($B$13))),\"\")","v":""},null,null,null,null,7,":00"]
[null,"",null,null,null,null,null,":30",null,null,null,null,null,null,null,null,null,null,null,null,null,null,null,null,"",null,null,null,null,null,":30"]
[null,"",null,null,null,null,8,":00",null,null,null,null,null,null,null,null,null,null,null,null,null,null,null,null,"",null,null,null,null,8,":00"]
[null,"",null,null,null,null,null,":30",null,null,null,null,null,null,null,null,null,null,null,null,null,null,null,null,"",null,null,null,null,null,":30"]
[null,"",null,null,null,null,9,":00",null,null,null,null,null,null,null,null,null,null,null,null,null,null,null,null,"",null,null,null,null,9,":00"]
[null,"",null,null,null,null,null,":30",null,null,null,null,null,null,null,null,null,null,null,null,null,null,null,null,"",null,null,null,null,null,":30"]
[null,"",null,null,null,null,10,":00",null,null,null,null,null,null,null,null,null,null,null,null,null,null,null,null,"",null,null,null,null,10,":00"]
[null,"",null,null,null,null,null,":30",null,null,null,null,null,null,null,null,null,null,null,null,null,null,null,null,"",null,null,null,null,null,":30"]
[null,"From",null,"Actions Carried Forward",null,null,11,":00",null,null,null,null,null,null,null,null,null,null,null,null,null,null,null,null,"From",null,"Actions Carried Forward",null,null,11,":00"]
[null,{"$f":"IFERROR(INDEX(arr_event,SMALL(IF(arr_eventdate=$E$3,ROW(arr_eventdate)),ROW()-ROW($B$13))),\"\")","v":""},null,null,null,null,null,":30",null,null,null,null,null,null,null,null,null,null,null,null,null,null,null,null,{"$f":"IFERROR(INDEX(arr_event,SMALL(IF(arr_eventdate=$E$3,ROW(arr_eventdate)),ROW()-ROW($B$13))),\"\")","v":""},null,null,null,null,null,":30"]
[null,{"$f":"IFERROR(INDEX(arr_event,SMALL(IF(arr_eventdate=$E$3,ROW(arr_eventdate)),ROW()-ROW($B$13))),\"\")","v":""},null,null,null,null,12,":00",null,null,null,null,null,null,null,null,null,null,null,null,null,null,null,null,{"$f":"IFERROR(INDEX(arr_event,SMALL(IF(arr_eventdate=$E$3,ROW(arr_eventdate)),ROW()-ROW($B$13))),\"\")","v":""},null,null,null,null,12,":00"]
[null,{"$f":"IFERROR(INDEX(arr_event,SMALL(IF(arr_eventdate=$E$3,ROW(arr_eventdate)),ROW()-ROW($B$13))),\"\")","v":""},null,null,null,null,null,":30",null,null,null,null,null,null,null,null,null,null,null,null,null,null,null,null,{"$f":"IFERROR(INDEX(arr_event,SMALL(IF(arr_eventdate=$E$3,ROW(arr_eventdate)),ROW()-ROW($B$13))),\"\")","v":""},null,null,null,null,null,":30"]
[null,{"$f":"IFERROR(INDEX(arr_event,SMALL(IF(arr_eventdate=$E$3,ROW(arr_eventdate)),ROW()-ROW($B$13))),\"\")","v":""},null,null,null,null,1,":00",null,null,null,null,null,null,null,null,null,null,null,null,null,null,null,null,{"$f":"IFERROR(INDEX(arr_event,SMALL(IF(arr_eventdate=$E$3,ROW(arr_eventdate)),ROW()-ROW($B$13))),\"\")","v":""},null,null,null,null,1,":00"]
[null,{"$f":"IFERROR(INDEX(arr_event,SMALL(IF(arr_eventdate=$E$3,ROW(arr_eventdate)),ROW()-ROW($B$13))),\"\")","v":""},null,null,null,null,null,":30",null,null,null,null,null,null,null,null,null,null,null,null,null,null,null,null,{"$f":"IFERROR(INDEX(arr_event,SMALL(IF(arr_eventdate=$E$3,ROW(arr_eventdate)),ROW()-ROW($B$13))),\"\")","v":""},null,null,null,null,null,":30"]
[null,{"$f":"IFERROR(INDEX(arr_event,SMALL(IF(arr_eventdate=$E$3,ROW(arr_eventdate)),ROW()-ROW($B$13))),\"\")","v":""},null,null,null,null,2,":00",null,null,null,null,null,null,null,null,null,null,null,null,null,null,null,null,{"$f":"IFERROR(INDEX(arr_event,SMALL(IF(arr_eventdate=$E$3,ROW(arr_eventdate)),ROW()-ROW($B$13))),\"\")","v":""},null,null,null,null,2,":00"]
[null,{"$f":"IFERROR(INDEX(arr_event,SMALL(IF(arr_eventdate=$E$3,ROW(arr_eventdate)),ROW()-ROW($B$13))),\"\")","v":""},null,null,null,null,null,":30",null,null,null,null,null,null,null,null,null,null,null,null,null,null,null,null,{"$f":"IFERROR(INDEX(arr_event,SMALL(IF(arr_eventdate=$E$3,ROW(arr_eventdate)),ROW()-ROW($B$13))),\"\")","v":""},null,null,null,null,null,":30"]
[null,{"$f":"IFERROR(INDEX(arr_event,SMALL(IF(arr_eventdate=$E$3,ROW(arr_eventdate)),ROW()-ROW($B$13))),\"\")","v":""},null,null,null,null,3,":00",null,null,null,null,null,null,null,null,null,null,null,null,null,null,null,null,{"$f":"IFERROR(INDEX(arr_event,SMALL(IF(arr_eventdate=$E$3,ROW(arr_eventdate)),ROW()-ROW($B$13))),\"\")","v":""},null,null,null,null,3,":00"]
[null,null,null,null,null,null,null,":30",null,null,null,null,null,null,null,null,null,null,null,null,null,null,null,null,null,null,null,null,null,null,":30"]
[null,"$Amt",null,"Expenses",null,null,4,":00",null,null,null,null,null,null,null,null,null,null,null,null,null,null,null,null,"$Amt",null,"Expenses",null,null,4,":00"]
[null,null,null,null,null,null,null,":30",null,null,null,null,null,null,null,null,null,null,null,null,null,null,null,null,null,null,null,null,null,null,":30"]
[null,null,null,null,null,null,5,":00",null,null,null,null,null,null,null,null,null,null,null,null,null,null,null,null,null,null,null,null,null,5,":00"]
[null,null,null,null,null,null,null,":30",null,null,null,null,null,null,null,null,null,null,null,null,null,null,null,null,null,null,null,null,null,null,":30"]
[null,null,null,null,null,null,6,":00",null,null,null,null,null,null,null,null,null,null,null,null,null,null,null,null,null,null,null,null,null,6,":00"]
[null,null,null,null,null,null,null,":30",null,null,null,null,null,null,null,null,null,null,null,null,null,null,null,null,null,null,null,null,null,null,":30"]
[]
[null,"Planned cases for today",null,null,null,null,null,":30",null,null,null,null,null,null,null,null,null,null,null,null,null,null,null,null,"Planned cases for today",null,null,null,null,null,":30"]
[null,"Case",null,null,null,"Action",null,null,null,null,null,null,null,null,null,null,null,null,null,"Follow-up",null,null,null,null,"Case",null,null,null,"Action",null,null,null,null,null,null,null,null,null,null,null,null,null,"Follow-up"]

{"sheet":"Days27-28","index":15,"n_rows":40,"n_cols":46,"rows_kept":40,"cut":false,"hidden":false,"merged":[[56,24,56,27],[56,28,56,41],[56,42,56,45],[57,24,57,27],[57,28,57,41],[57,42,57,45],[52,42,52,45],[53,24,53,27],[53,28,53,41],[53,42,53,45],[54,24,54,27],[54,28,54,41],[54,42,54,45],[55,24,55,27],[55,28,55,41],[55,42,55,45],[48,42,48,45],[49,24,49,27],[49,28,49,41],[49,42,49,45],[50,24,50,27],[50,28,50,41],[50,42,50,45],[51,24,51,27],[51,28,51,41],[51,42,51,45],[44,42,44,45],[45,24,45,27],[45,28,45,41],[45,42,45,45],[46,24,46,27],[46,28,46,41],[46,42,46,45],[47,24,47,27],[47,28,47,41],[47,42,47,45],[40,42,40,45],[41,24,41,27],[41,28,41,41],[41,42,41,45],[42,24,42,27],[42,28,42,41],[42,42,42,45],[43,24,43,27],[43,28,43,41],[43,42,43,45],[57,1,57,4],[57,5,57,18],[57,19,57,22],[58,1,58,4],[58,5,58,18],[58,19,58,22],[29,24,29,25],[31,24,31,25],[31,26,31,27],[32,24,32,25],[32,26,32,27],[33,24,33,25],[33,26,33,27],[34,24,34,25],[34,26,34,27],[35,24,35,25],[35,26,35,27],[36,24,36,25],[36,26,36,27],[38,24,38,45],[39,24,39,27],[39,28,39,41],[39,42,39,45],[40,24,40,27],[0,32,0,33],[2,1,5,3],[2,4,3,7],[2,8,2,14],[2,16,2,22],[2,24,5,26],[2,27,3,30],[2,31,2,37],[29,1,29,2],[13,6,14,6],[13,29,14,29],[15,6,16,6],[15,29,16,29],[17,6,18,6],[17,29,18,29],[2,39,2,45],[4,4,5,6],[4,27,5,29],[6,5,6,6],[6,28,6,29],[12,1,12,4],[12,16,12,22],[12,24,12,27],[12,39,12,45],[22,24,22,25],[22,26,22,27],[23,1,23,2],[23,3,23,4],[23,6,24,6],[23,24,23,25],[23,26,23,27],[19,6,20,6],[19,29,20,29],[21,1,21,2],[21,3,21,4],[21,6,22,6],[21,24,21,25],[21,26,21,27],[21,29,22,29],[22,1,22,2],[22,3,22,4],[23,29,24,29],[24,1,24,2],[24,3,24,4],[24,24,24,25],[24,26,24,27],[25,1,25,2],[25,3,25,4],[25,6,26,6],[25,24,25,25],[25,26,25,27],[25,29,26,29],[26,1,26,2],[26,3,26,4],[26,24,26,25],[26,26,26,27],[27,1,27,2],[27,3,27,4],[27,6,28,6],[27,24,27,25],[27,26,27,27],[27,29,28,29],[28,1,28,2],[28,3,28,4],[28,24,28,25],[28,26,28,27],[29,3,29,4],[29,6,30,6],[29,26,29,27],[29,29,30,29],[31,6,32,6],[31,29,32,29],[33,6,34,6],[33,29,34,29],[35,6,36,6],[35,29,36,29],[40,5,40,18],[40,19,40,22],[41,5,41,18],[41,19,41,22],[42,5,42,18],[42,19,42,22],[40,28,40,41],[42,1,42,4],[43,1,43,4],[43,5,43,18],[43,19,43,22],[44,24,44,27],[44,28,44,41],[31,1,31,2],[31,3,31,4],[40,1,40,4],[41,1,41,4],[44,1,44,4],[44,5,44,18],[44,19,44,22],[45,1,45,4],[45,5,45,18],[45,19,45,22],[46,1,46,4],[46,5,46,18],[46,19,46,22],[47,1,47,4],[47,5,47,18],[47,19,47,22],[32,1,32,2],[32,3,32,4],[33,1,33,2],[33,3,33,4],[48,1,48,4],[48,5,48,18],[48,19,48,22],[49,1,49,4],[49,5,49,18],[49,19,49,22],[50,1,50,4],[50,5,50,18],[50,19,50,22],[51,1,51,4],[51,5,51,18],[51,19,51,22],[48,24,48,27],[48,28,48,41],[34,1,34,2],[34,3,34,4],[35,1,35,2],[35,3,35,4],[52,1,52,4],[52,5,52,18],[52,19,52,22],[53,1,53,4],[53,5,53,18],[53,19,53,22],[52,24,52,27],[52,28,52,41],[39,1,39,4],[39,5,39,18],[39,19,39,22],[58,24,58,27],[58,28,58,41],[58,42,58,45],[36,1,36,2],[36,3,36,4],[38,1,38,22],[54,1,54,4],[54,5,54,18],[54,19,54,22],[55,1,55,4],[55,5,55,18],[55,19,55,22],[56,1,56,4],[56,5,56,18],[56,19,56,22],[61,1,61,4],[61,5,61,18],[61,19,61,22],[61,24,61,27],[61,28,61,41],[61,42,61,45],[59,1,59,4],[59,5,59,18],[59,19,59,22],[59,24,59,27],[59,28,59,41],[59,42,59,45],[62,1,62,4],[62,5,62,18],[62,19,62,22],[62,24,62,27],[62,28,62,41],[62,42,62,45]]}
[]
[]
[null,{"$f":"DAY(E3)","v":26},null,null,{"$f":"'Days25-26'!AB3+1","v":"2024-05-26"},null,null,null,{"$f":"DATE(YEAR($E$3),MONTH($E$3),1)","v":"2024-05-01"},null,null,null,null,null,null,null,{"$f":"DATE(YEAR(I3+35),MONTH(I3+35),1)","v":"2024-06-01"},null,null,null,null,null,null,null,{"$f":"DAY(AB3)","v":27},null,null,{"$f":"E3+1","v":"2024-05-27"},null,null,null,{"$f":"DATE(YEAR(AB3),MONTH(AB3),1)","v":"2024-05-01"},null,null,null,null,null,null,null,{"$f":"DATE(YEAR(AF3+35),MONTH(AF3+35),1)","v":"2024-06-01"}]
[null,null,null,null,null,null,null,null,{"$f":"CHOOSE(1+MOD('Days1-2'!J1+1-2,7),\"Su\",\"M\",\"Tu\",\"W\",\"Th\",\"F\",\"Sa\")","v":"Su"},{"$f":"CHOOSE(1+MOD('Days1-2'!$J$1+2-2,7),\"Su\",\"M\",\"Tu\",\"W\",\"Th\",\"F\",\"Sa\")","v":"M"},{"$f":"CHOOSE(1+MOD('Days1-2'!$J$1+3-2,7),\"Su\",\"M\",\"Tu\",\"W\",\"Th\",\"F\",\"Sa\")","v":"Tu"},{"$f":"CHOOSE(1+MOD('Days1-2'!$J$1+4-2,7),\"Su\",\"M\",\"Tu\",\"W\",\"Th\",\"F\",\"Sa\")","v":"W"},{"$f":"CHOOSE(1+MOD('Days1-2'!$J$1+5-2,7),\"Su\",\"M\",\"Tu\",\"W\",\"Th\",\"F\",\"Sa\")","v":"Th"},{"$f":"CHOOSE(1+MOD('Days1-2'!$J$1+6-2,7),\"Su\",\"M\",\"Tu\",\"W\",\"Th\",\"F\",\"Sa\")","v":"F"},{"$f":"CHOOSE(1+MOD('Days1-2'!$J$1+7-2,7),\"Su\",\"M\",\"Tu\",\"W\",\"Th\",\"F\",\"Sa\")","v":"Sa"},null,{"$f":"CHOOSE(1+MOD('Days1-2'!J1+1-2,7),\"Su\",\"M\",\"Tu\",\"W\",\"Th\",\"F\",\"Sa\")","v":"Su"},{"$f":"CHOOSE(1+MOD('Days1-2'!J1+2-2,7),\"Su\",\"M\",\"Tu\",\"W\",\"Th\",\"F\",\"Sa\")","v":"M"},{"$f":"CHOOSE(1+MOD('Days1-2'!J1+3-2,7),\"Su\",\"M\",\"Tu\",\"W\",\"Th\",\"F\",\"Sa\")","v":"Tu"},{"$f":"CHOOSE(1+MOD('Days1-2'!J1+4-2,7),\"Su\",\"M\",\"Tu\",\"W\",\"Th\",\"F\",\"Sa\")","v":"W"},{"$f":"CHOOSE(1+MOD('Days1-2'!J1+5-2,7),\"Su\",\"M\",\"Tu\",\"W\",\"Th\",\"F\",\"Sa\")","v":"Th"},{"$f":"CHOOSE(1+MOD('Days1-2'!J1+6-2,7),\"Su\",\"M\",\"Tu\",\"W\",\"Th\",\"F\",\"Sa\")","v":"F"},{"$f":"CHOOSE(1+MOD('Days1-2'!J1+7-2,7),\"Su\",\"M\",\"Tu\",\"W\",\"Th\",\"F\",\"Sa\")","v":"Sa"},null,null,null,null,null,null,null,null,{"$f":"CHOOSE(1+MOD('Days1-2'!$J$1+1-2,7),\"Su\",\"M\",\"Tu\",\"W\",\"Th\",\"F\",\"Sa\")","v":"Su"},{"$f":"CHOOSE(1+MOD('Days1-2'!$J$1+2-2,7),\"Su\",\"M\",\"Tu\",\"W\",\"Th\",\"F\",\"Sa\")","v":"M"},{"$f":"CHOOSE(1+MOD('Days1-2'!$J$1+3-2,7),\"Su\",\"M\",\"Tu\",\"W\",\"Th\",\"F\",\"Sa\")","v":"Tu"},{"$f":"CHOOSE(1+MOD('Days1-2'!$J$1+4-2,7),\"Su\",\"M\",\"Tu\",\"W\",\"Th\",\"F\",\"Sa\")","v":"W"},{"$f":"CHOOSE(1+MOD('Days1-2'!$J$1+5-2,7),\"Su\",\"M\",\"Tu\",\"W\",\"Th\",\"F\",\"Sa\")","v":"Th"},{"$f":"CHOOSE(1+MOD('Days1-2'!$J$1+6-2,7),\"Su\",\"M\",\"Tu\",\"W\",\"Th\",\"F\",\"Sa\")","v":"F"},{"$f":"CHOOSE(1+MOD('Days1-2'!$J$1+7-2,7),\"Su\",\"M\",\"Tu\",\"W\",\"Th\",\"F\",\"Sa\")","v":"Sa"},null,{"$f":"CHOOSE(1+MOD('Days1-2'!$J$1+1-2,7),\"Su\",\"M\",\"Tu\",\"W\",\"Th\",\"F\",\"Sa\")","v":"Su"},{"$f":"CHOOSE(1+MOD('Days1-2'!$J$1+2-2,7),\"Su\",\"M\",\"Tu\",\"W\",\"Th\",\"F\",\"Sa\")","v":"M"},{"$f":"CHOOSE(1+MOD('Days1-2'!$J$1+3-2,7),\"Su\",\"M\",\"Tu\",\"W\",\"Th\",\"F\",\"Sa\")","v":"Tu"},{"$f":"CHOOSE(1+MOD('Days1-2'!$J$1+4-2,7),\"Su\",\"M\",\"Tu\",\"W\",\"Th\",\"F\",\"Sa\")","v":"W"},{"$f":"CHOOSE(1+MOD('Days1-2'!$J$1+5-2,7),\"Su\",\"M\",\"Tu\",\"W\",\"Th\",\"F\",\"Sa\")","v":"Th"},{"$f":"CHOOSE(1+MOD('Days1-2'!$J$1+6-2,7),\"Su\",\"M\",\"Tu\",\"W\",\"Th\",\"F\",\"Sa\")","v":"F"},{"$f":"CHOOSE(1+MOD('Days1-2'!$J$1+7-2,7),\"Su\",\"M\",\"Tu\",\"W\",\"Th\",\"F\",\"Sa\")","v":"Sa"}]
[null,null,null,null,{"$f":"INDEX({\"Sunday\",\"Monday\",\"Tuesday\",\"Wednesday\",\"Thursday\",\"Friday\",\"Saturday\"},WEEKDAY(E3))","v":"Sunday"},null,null,null,{"$f":"IF(WEEKDAY(I3,1)='Days1-2'!$J$1,I3,\"\")","v":""},{"$f":"IF(I5=\"\",IF(WEEKDAY(I3,1)=MOD('Days1-2'!$J$1,7)+1,I3,\"\"),I5+1)","v":""},{"$f":"IF(J5=\"\",IF(WEEKDAY(I3,1)=MOD('Days1-2'!$J$1+1,7)+1,I3,\"\"),J5+1)","v":""},{"$f":"IF(K5=\"\",IF(WEEKDAY(I3,1)=MOD('Days1-2'!$J$1+2,7)+1,I3,\"\"),K5+1)","v":"2024-05-01"},{"$f":"IF(L5=\"\",IF(WEEKDAY(I3,1)=MOD('Days1-2'!$J$1+3,7)+1,I3,\"\"),L5+1)","v":"2024-05-02"},{"$f":"IF(M5=\"\",IF(WEEKDAY(I3,1)=MOD('Days1-2'!$J$1+4,7)+1,I3,\"\"),M5+1)","v":"2024-05-03"},{"$f":"IF(N5=\"\",IF(WEEKDAY(I3,1)=MOD('Days1-2'!$J$1+5,7)+1,I3,\"\"),N5+1)","v":"2024-05-04"},null,{"$f":"IF(WEEKDAY(Q3,1)='Days1-2'!$J$1,Q3,\"\")","v":""},{"$f":"IF(Q5=\"\",IF(WEEKDAY(Q3,1)=MOD('Days1-2'!$J$1,7)+1,Q3,\"\"),Q5+1)","v":""},{"$f":"IF(R5=\"\",IF(WEEKDAY(Q3,1)=MOD('Days1-2'!$J$1+1,7)+1,Q3,\"\"),R5+1)","v":""},{"$f":"IF(S5=\"\",IF(WEEKDAY(Q3,1)=MOD('Days1-2'!$J$1+2,7)+1,Q3,\"\"),S5+1)","v":""},{"$f":"IF(T5=\"\",IF(WEEKDAY(Q3,1)=MOD('Days1-2'!$J$1+3,7)+1,Q3,\"\"),T5+1)","v":""},{"$f":"IF(U5=\"\",IF(WEEKDAY(Q3,1)=MOD('Days1-2'!$J$1+4,7)+1,Q3,\"\"),U5+1)","v":""},{"$f":"IF(V5=\"\",IF(WEEKDAY(Q3,1)=MOD('Days1-2'!$J$1+5,7)+1,Q3,\"\"),V5+1)","v":"2024-06-01"},null,null,null,null,{"$f":"INDEX({\"Sunday\",\"Monday\",\"Tuesday\",\"Wednesday\",\"Thursday\",\"Friday\",\"Saturday\"},WEEKDAY(AB3))","v":"Monday"},null,null,null,{"$f":"IF(WEEKDAY(AF3,1)='Days1-2'!$J$1,AF3,\"\")","v":""},{"$f":"IF(AF5=\"\",IF(WEEKDAY(AF3,1)=MOD('Days1-2'!$J$1,7)+1,AF3,\"\"),AF5+1)","v":""},{"$f":"IF(AG5=\"\",IF(WEEKDAY(AF3,1)=MOD('Days1-2'!$J$1+1,7)+1,AF3,\"\"),AG5+1)","v":""},{"$f":"IF(AH5=\"\",IF(WEEKDAY(AF3,1)=MOD('Days1-2'!$J$1+2,7)+1,AF3,\"\"),AH5+1)","v":"2024-05-01"},{"$f":"IF(AI5=\"\",IF(WEEKDAY(AF3,1)=MOD('Days1-2'!$J$1+3,7)+1,AF3,\"\"),AI5+1)","v":"2024-05-02"},{"$f":"IF(AJ5=\"\",IF(WEEKDAY(AF3,1)=MOD('Days1-2'!$J$1+4,7)+1,AF3,\"\"),AJ5+1)","v":"2024-05-03"},{"$f":"IF(AK5=\"\",IF(WEEKDAY(AF3,1)=MOD('Days1-2'!$J$1+5,7)+1,AF3,\"\"),AK5+1)","v":"2024-05-04"},null,{"$f":"IF(WEEKDAY(AN3,1)='Days1-2'!$J$1,AN3,\"\")","v":""},{"$f":"IF(AN5=\"\",IF(WEEKDAY(AN3,1)=MOD('Days1-2'!$J$1,7)+1,AN3,\"\"),AN5+1)","v":""},{"$f":"IF(AO5=\"\",IF(WEEKDAY(AN3,1)=MOD('Days1-2'!$J$1+1,7)+1,AN3,\"\"),AO5+1)","v":""},{"$f":"IF(AP5=\"\",IF(WEEKDAY(AN3,1)=MOD('Days1-2'!$J$1+2,7)+1,AN3,\"\"),AP5+1)","v":""},{"$f":"IF(AQ5=\"\",IF(WEEKDAY(AN3,1)=MOD('Days1-2'!$J$1+3,7)+1,AN3,\"\"),AQ5+1)","v":""},{"$f":"IF(AR5=\"\",IF(WEEKDAY(AN3,1)=MOD('Days1-2'!$J$1+4,7)+1,AN3,\"\"),AR5+1)","v":""},{"$f":"IF(AS5=\"\",IF(WEEKDAY(AN3,1)=MOD('Days1-2'!$J$1+5,7)+1,AN3,\"\"),AS5+1)","v":"2024-06-01"}]
[null,null,null,null,null,null,null,null,{"$f":"IF(O5=\"\",\"\",IF(MONTH(O5+1)<>MONTH(O5),\"\",O5+1))","v":"2024-05-05"},{"$f":"IF(I6=\"\",\"\",IF(MONTH(I6+1)<>MONTH(I6),\"\",I6+1))","v":"2024-05-06"},{"$f":"IF(J6=\"\",\"\",IF(MONTH(J6+1)<>MONTH(J6),\"\",J6+1))","v":"2024-05-07"},{"$f":"IF(K6=\"\",\"\",IF(MONTH(K6+1)<>MONTH(K6),\"\",K6+1))","v":"2024-05-08"},"2024-05-09","2024-05-10","2024-05-11",null,{"$f":"IF(W5=\"\",\"\",IF(MONTH(W5+1)<>MONTH(W5),\"\",W5+1))","v":"2024-06-02"},{"$f":"IF(Q6=\"\",\"\",IF(MONTH(Q6+1)<>MONTH(Q6),\"\",Q6+1))","v":"2024-06-03"},{"$f":"IF(R6=\"\",\"\",IF(MONTH(R6+1)<>MONTH(R6),\"\",R6+1))","v":"2024-06-04"},{"$f":"IF(S6=\"\",\"\",IF(MONTH(S6+1)<>MONTH(S6),\"\",S6+1))","v":"2024-06-05"},{"$f":"IF(T6=\"\",\"\",IF(MONTH(T6+1)<>MONTH(T6),\"\",T6+1))","v":"2024-06-06"},"2024-06-07","2024-06-08",null,null,null,null,null,null,null,null,{"$f":"IF(AL5=\"\",\"\",IF(MONTH(AL5+1)<>MONTH(AL5),\"\",AL5+1))","v":"2024-05-05"},{"$f":"IF(AF6=\"\",\"\",IF(MONTH(AF6+1)<>MONTH(AF6),\"\",AF6+1))","v":"2024-05-06"},{"$f":"IF(AG6=\"\",\"\",IF(MONTH(AG6+1)<>MONTH(AG6),\"\",AG6+1))","v":"2024-05-07"},{"$f":"IF(AH6=\"\",\"\",IF(MONTH(AH6+1)<>MONTH(AH6),\"\",AH6+1))","v":"2024-05-08"},{"$f":"IF(AI6=\"\",\"\",IF(MONTH(AI6+1)<>MONTH(AI6),\"\",AI6+1))","v":"2024-05-09"},"2024-05-10","2024-05-11",null,{"$f":"IF(AT5=\"\",\"\",IF(MONTH(AT5+1)<>MONTH(AT5),\"\",AT5+1))","v":"2024-06-02"},{"$f":"IF(AN6=\"\",\"\",IF(MONTH(AN6+1)<>MONTH(AN6),\"\",AN6+1))","v":"2024-06-03"},{"$f":"IF(AO6=\"\",\"\",IF(MONTH(AO6+1)<>MONTH(AO6),\"\",AO6+1))","v":"2024-06-04"},{"$f":"IF(AP6=\"\",\"\",IF(MONTH(AP6+1)<>MONTH(AP6),\"\",AP6+1))","v":"2024-06-05"},{"$f":"IF(AQ6=\"\",\"\",IF(MONTH(AQ6+1)<>MONTH(AQ6),\"\",AQ6+1))","v":"2024-06-06"},"2024-06-07","2024-06-08"]
[null,{"$f":"IFERROR(INDEX(arr_holiday,SMALL(IF(arr_holidaydate=$E$3,ROW(arr_holidaydate)),ROW()-ROW($B$6))),\"\")","v":""},null,null,null,null,null,null,{"$f":"IF(O6=\"\",\"\",IF(MONTH(O6+1)<>MONTH(O6),\"\",O6+1))","v":"2024-05-12"},{"$f":"IF(I7=\"\",\"\",IF(MONTH(I7+1)<>MONTH(I7),\"\",I7+1))","v":"2024-05-13"},"2024-05-14","2024-05-15","2024-05-16","2024-05-17","2024-05-18",null,{"$f":"IF(W6=\"\",\"\",IF(MONTH(W6+1)<>MONTH(W6),\"\",W6+1))","v":"2024-06-09"},{"$f":"IF(Q7=\"\",\"\",IF(MONTH(Q7+1)<>MONTH(Q7),\"\",Q7+1))","v":"2024-06-10"},"2024-06-11","2024-06-12","2024-06-13","2024-06-14","2024-06-15",null,{"$f":"IFERROR(INDEX(arr_holiday,SMALL(IF(arr_holidaydate=$AB$3,ROW(arr_holidaydate)),ROW()-ROW($B$6))),\"\")","v":"Memorial Day"},null,null,null,null,null,null,{"$f":"IF(AL6=\"\",\"\",IF(MONTH(AL6+1)<>MONTH(AL6),\"\",AL6+1))","v":"2024-05-12"},{"$f":"IF(AF7=\"\",\"\",IF(MONTH(AF7+1)<>MONTH(AF7),\"\",AF7+1))","v":"2024-05-13"},"2024-05-14","2024-05-15","2024-05-16","2024-05-17","2024-05-18",null,{"$f":"IF(AT6=\"\",\"\",IF(MONTH(AT6+1)<>MONTH(AT6),\"\",AT6+1))","v":"2024-06-09"},{"$f":"IF(AN7=\"\",\"\",IF(MONTH(AN7+1)<>MONTH(AN7),\"\",AN7+1))","v":"2024-06-10"},"2024-06-11","2024-06-12","2024-06-13","2024-06-14","2024-06-15"]
[null,{"$f":"IFERROR(INDEX(arr_holiday,SMALL(IF(arr_holidaydate=$E$3,ROW(arr_holidaydate)),ROW()-ROW($B$6))),\"\")","v":""},null,null,null,null,null,null,"2024-05-19","2024-05-20","2024-05-21","2024-05-22","2024-05-23","2024-05-24","2024-05-25",null,"2024-06-16","2024-06-17","2024-06-18","2024-06-19","2024-06-20","2024-06-21","2024-06-22",null,{"$f":"IFERROR(INDEX(arr_holiday,SMALL(IF(arr_holidaydate=$AB$3,ROW(arr_holidaydate)),ROW()-ROW($B$6))),\"\")","v":""},null,null,null,null,null,null,"2024-05-19","2024-05-20","2024-05-21","2024-05-22","2024-05-23","2024-05-24","2024-05-25",null,"2024-06-16","2024-06-17","2024-06-18","2024-06-19","2024-06-20","2024-06-21","2024-06-22"]
[null,{"$f":"IFERROR(INDEX(arr_holiday,SMALL(IF(arr_holidaydate=$E$3,ROW(arr_holidaydate)),ROW()-ROW($B$6))),\"\")","v":""},null,null,null,null,null,null,"2024-05-26","2024-05-27","2024-05-28","2024-05-29","2024-05-30","2024-05-31","",null,"2024-06-23","2024-06-24","2024-06-25","2024-06-26","2024-06-27","2024-06-28","2024-06-29",null,{"$f":"IFERROR(INDEX(arr_holiday,SMALL(IF(arr_holidaydate=$AB$3,ROW(arr_holidaydate)),ROW()-ROW($B$6))),\"\")","v":""},null,null,null,null,null,null,"2024-05-26","2024-05-27","2024-05-28","2024-05-29","2024-05-30","2024-05-31","",null,"2024-06-23","2024-06-24","2024-06-25","2024-06-26","2024-06-27","2024-06-28","2024-06-29"]
[null,{"$f":"IFERROR(INDEX(arr_event,SMALL(IF(arr_eventdate=$E$3,ROW(arr_eventdate)),ROW()-ROW($B$9))),\"\")","v":""},null,null,null,null,null,null,"","","","","","","",null,"2024-06-30","","","","","","",null,{"$f":"IFERROR(INDEX(arr_event,SMALL(IF(arr_eventdate=$AB$3,ROW(arr_eventdate)),ROW()-ROW($B$9))),\"\")","v":""},null,null,null,null,null,null,"","","","","","","",null,"2024-06-30","","","","","",""]
[null,{"$f":"IFERROR(INDEX(arr_event,SMALL(IF(arr_eventdate=$E$3,ROW(arr_eventdate)),ROW()-ROW($B$9))),\"\")","v":""},null,null,null,null,null,null,null,null,null,null,null,null,null,null,null,null,null,null,null,null,null,null,{"$f":"IFERROR(INDEX(arr_event,SMALL(IF(arr_eventdate=$AB$3,ROW(arr_eventdate)),ROW()-ROW($B$9))),\"\")","v":""}]
[null,{"$f":"IFERROR(INDEX(arr_event,SMALL(IF(arr_eventdate=$E$3,ROW(arr_eventdate)),ROW()-ROW($B$9))),\"\")","v":""},null,null,null,null,null,null,null,null,null,null,null,null,null,null,null,null,null,null,null,null,null,null,{"$f":"IFERROR(INDEX(arr_event,SMALL(IF(arr_eventdate=$AB$3,ROW(arr_eventdate)),ROW()-ROW($B$9))),\"\")","v":""}]
[null,"Reminders",null,null,null,null,null,null,"Appointments",null,null,null,null,null,null,null,"Notes",null,null,null,null,null,null,null,"Reminders",null,null,null,null,null,null,"Appointments",null,null,null,null,null,null,null,"Notes"]
[null,{"$f":"IFERROR(INDEX(arr_event,SMALL(IF(arr_eventdate=$E$3,ROW(arr_eventdate)),ROW()-ROW($B$13))),\"\")","v":""},null,null,null,null,7,":00",null,null,null,null,null,null,null,null,null,null,null,null,null,null,null,null,{"$f":"IFERROR(INDEX(arr_event,SMALL(IF(arr_eventdate=$E$3,ROW(arr_eventdate)),ROW()-ROW($B$13))),\"\")","v":""},null,null,null,null,7,":00"]
[null,"",null,null,null,null,null,":30",null,null,null,null,null,null,null,null,null,null,null,null,null,null,null,null,"",null,null,null,null,null,":30"]
[null,"",null,null,null,null,8,":00",null,null,null,null,null,null,null,null,null,null,null,null,null,null,null,null,"",null,null,null,null,8,":00"]
[null,"",null,null,null,null,null,":30",null,null,null,null,null,null,null,null,null,null,null,null,null,null,null,null,"",null,null,null,null,null,":30"]
[null,"",null,null,null,null,9,":00",null,null,null,null,null,null,null,null,null,null,null,null,null,null,null,null,"",null,null,null,null,9,":00"]
[null,"",null,null,null,null,null,":30",null,null,null,null,null,null,null,null,null,null,null,null,null,null,null,null,"",null,null,null,null,null,":30"]
[null,"",null,null,null,null,10,":00",null,null,null,null,null,null,null,null,null,null,null,null,null,null,null,null,"",null,null,null,null,10,":00"]
[null,"",null,null,null,null,null,":30",null,null,null,null,null,null,null,null,null,null,null,null,null,null,null,null,"",null,null,null,null,null,":30"]
[null,"From",null,"Actions Carried Forward",null,null,11,":00",null,null,null,null,null,null,null,null,null,null,null,null,null,null,null,null,"From",null,"Actions Carried Forward",null,null,11,":00"]
[null,{"$f":"IFERROR(INDEX(arr_event,SMALL(IF(arr_eventdate=$E$3,ROW(arr_eventdate)),ROW()-ROW($B$13))),\"\")","v":""},null,null,null,null,null,":30",null,null,null,null,null,null,null,null,null,null,null,null,null,null,null,null,{"$f":"IFERROR(INDEX(arr_event,SMALL(IF(arr_eventdate=$E$3,ROW(arr_eventdate)),ROW()-ROW($B$13))),\"\")","v":""},null,null,null,null,null,":30"]
[null,{"$f":"IFERROR(INDEX(arr_event,SMALL(IF(arr_eventdate=$E$3,ROW(arr_eventdate)),ROW()-ROW($B$13))),\"\")","v":""},null,null,null,null,12,":00",null,null,null,null,null,null,null,null,null,null,null,null,null,null,null,null,{"$f":"IFERROR(INDEX(arr_event,SMALL(IF(arr_eventdate=$E$3,ROW(arr_eventdate)),ROW()-ROW($B$13))),\"\")","v":""},null,null,null,null,12,":00"]
[null,{"$f":"IFERROR(INDEX(arr_event,SMALL(IF(arr_eventdate=$E$3,ROW(arr_eventdate)),ROW()-ROW($B$13))),\"\")","v":""},null,null,null,null,null,":30",null,null,null,null,null,null,null,null,null,null,null,null,null,null,null,null,{"$f":"IFERROR(INDEX(arr_event,SMALL(IF(arr_eventdate=$E$3,ROW(arr_eventdate)),ROW()-ROW($B$13))),\"\")","v":""},null,null,null,null,null,":30"]
[null,{"$f":"IFERROR(INDEX(arr_event,SMALL(IF(arr_eventdate=$E$3,ROW(arr_eventdate)),ROW()-ROW($B$13))),\"\")","v":""},null,null,null,null,1,":00",null,null,null,null,null,null,null,null,null,null,null,null,null,null,null,null,{"$f":"IFERROR(INDEX(arr_event,SMALL(IF(arr_eventdate=$E$3,ROW(arr_eventdate)),ROW()-ROW($B$13))),\"\")","v":""},null,null,null,null,1,":00"]
[null,{"$f":"IFERROR(INDEX(arr_event,SMALL(IF(arr_eventdate=$E$3,ROW(arr_eventdate)),ROW()-ROW($B$13))),\"\")","v":""},null,null,null,null,null,":30",null,null,null,null,null,null,null,null,null,null,null,null,null,null,null,null,{"$f":"IFERROR(INDEX(arr_event,SMALL(IF(arr_eventdate=$E$3,ROW(arr_eventdate)),ROW()-ROW($B$13))),\"\")","v":""},null,null,null,null,null,":30"]
[null,{"$f":"IFERROR(INDEX(arr_event,SMALL(IF(arr_eventdate=$E$3,ROW(arr_eventdate)),ROW()-ROW($B$13))),\"\")","v":""},null,null,null,null,2,":00",null,null,null,null,null,null,null,null,null,null,null,null,null,null,null,null,{"$f":"IFERROR(INDEX(arr_event,SMALL(IF(arr_eventdate=$E$3,ROW(arr_eventdate)),ROW()-ROW($B$13))),\"\")","v":""},null,null,null,null,2,":00"]
[null,{"$f":"IFERROR(INDEX(arr_event,SMALL(IF(arr_eventdate=$E$3,ROW(arr_eventdate)),ROW()-ROW($B$13))),\"\")","v":""},null,null,null,null,null,":30",null,null,null,null,null,null,null,null,null,null,null,null,null,null,null,null,{"$f":"IFERROR(INDEX(arr_event,SMALL(IF(arr_eventdate=$E$3,ROW(arr_eventdate)),ROW()-ROW($B$13))),\"\")","v":""},null,null,null,null,null,":30"]
[null,{"$f":"IFERROR(INDEX(arr_event,SMALL(IF(arr_eventdate=$E$3,ROW(arr_eventdate)),ROW()-ROW($B$13))),\"\")","v":""},null,null,null,null,3,":00",null,null,null,null,null,null,null,null,null,null,null,null,null,null,null,null,{"$f":"IFERROR(INDEX(arr_event,SMALL(IF(arr_eventdate=$E$3,ROW(arr_eventdate)),ROW()-ROW($B$13))),\"\")","v":""},null,null,null,null,3,":00"]
[null,null,null,null,null,null,null,":30",null,null,null,null,null,null,null,null,null,null,null,null,null,null,null,null,null,null,null,null,null,null,":30"]
[null,"$Amt",null,"Expenses",null,null,4,":00",null,null,null,null,null,null,null,null,null,null,null,null,null,null,null,null,"$Amt",null,"Expenses",null,null,4,":00"]
[null,null,null,null,null,null,null,":30",null,null,null,null,null,null,null,null,null,null,null,null,null,null,null,null,null,null,null,null,null,null,":30"]
[null,null,null,null,null,null,5,":00",null,null,null,null,null,null,null,null,null,null,null,null,null,null,null,null,null,null,null,null,null,5,":00"]
[null,null,null,null,null,null,null,":30",null,null,null,null,null,null,null,null,null,null,null,null,null,null,null,null,null,null,null,null,null,null,":30"]
[null,null,null,null,null,null,6,":00",null,null,null,null,null,null,null,null,null,null,null,null,null,null,null,null,null,null,null,null,null,6,":00"]
[null,null,null,null,null,null,null,":30",null,null,null,null,null,null,null,null,null,null,null,null,null,null,null,null,null,null,null,null,null,null,":30"]
[]
[null,"Planned cases for today",null,null,null,null,null,":30",null,null,null,null,null,null,null,null,null,null,null,null,null,null,null,null,"Planned cases for today",null,null,null,null,null,":30"]
[null,"Case",null,null,null,"Action",null,null,null,null,null,null,null,null,null,null,null,null,null,"Follow-up",null,null,null,null,"Case",null,null,null,"Action",null,null,null,null,null,null,null,null,null,null,null,null,null,"Follow-up"]

{"sheet":"Days29-30","index":16,"n_rows":40,"n_cols":46,"rows_kept":40,"cut":false,"hidden":false,"merged":[[56,24,56,27],[56,28,56,41],[56,42,56,45],[57,24,57,27],[57,28,57,41],[57,42,57,45],[52,42,52,45],[53,24,53,27],[53,28,53,41],[53,42,53,45],[54,24,54,27],[54,28,54,41],[54,42,54,45],[55,24,55,27],[55,28,55,41],[55,42,55,45],[48,42,48,45],[49,24,49,27],[49,28,49,41],[49,42,49,45],[50,24,50,27],[50,28,50,41],[50,42,50,45],[51,24,51,27],[51,28,51,41],[51,42,51,45],[44,42,44,45],[45,24,45,27],[45,28,45,41],[45,42,45,45],[46,24,46,27],[46,28,46,41],[46,42,46,45],[47,24,47,27],[47,28,47,41],[47,42,47,45],[40,42,40,45],[41,24,41,27],[41,28,41,41],[41,42,41,45],[42,24,42,27],[42,28,42,41],[42,42,42,45],[43,24,43,27],[43,28,43,41],[43,42,43,45],[57,1,57,4],[57,5,57,18],[57,19,57,22],[58,1,58,4],[58,5,58,18],[58,19,58,22],[29,24,29,25],[31,24,31,25],[31,26,31,27],[32,24,32,25],[32,26,32,27],[33,24,33,25],[33,26,33,27],[34,24,34,25],[34,26,34,27],[35,24,35,25],[35,26,35,27],[36,24,36,25],[36,26,36,27],[38,24,38,45],[39,24,39,27],[39,28,39,41],[39,42,39,45],[40,24,40,27],[0,32,0,33],[2,1,5,3],[2,4,3,7],[2,8,2,14],[2,16,2,22],[2,24,5,26],[2,27,3,30],[2,31,2,37],[29,1,29,2],[13,6,14,6],[13,29,14,29],[15,6,16,6],[15,29,16,29],[17,6,18,6],[17,29,18,29],[2,39,2,45],[4,4,5,6],[4,27,5,29],[6,5,6,6],[6,28,6,29],[12,1,12,4],[12,16,12,22],[12,24,12,27],[12,39,12,45],[22,24,22,25],[22,26,22,27],[23,1,23,2],[23,3,23,4],[23,6,24,6],[23,24,23,25],[23,26,23,27],[19,6,20,6],[19,29,20,29],[21,1,21,2],[21,3,21,4],[21,6,22,6],[21,24,21,25],[21,26,21,27],[21,29,22,29],[22,1,22,2],[22,3,22,4],[23,29,24,29],[24,1,24,2],[24,3,24,4],[24,24,24,25],[24,26,24,27],[25,1,25,2],[25,3,25,4],[25,6,26,6],[25,24,25,25],[25,26,25,27],[25,29,26,29],[26,1,26,2],[26,3,26,4],[26,24,26,25],[26,26,26,27],[27,1,27,2],[27,3,27,4],[27,6,28,6],[27,24,27,25],[27,26,27,27],[27,29,28,29],[28,1,28,2],[28,3,28,4],[28,24,28,25],[28,26,28,27],[29,3,29,4],[29,6,30,6],[29,26,29,27],[29,29,30,29],[31,6,32,6],[31,29,32,29],[33,6,34,6],[33,29,34,29],[35,6,36,6],[35,29,36,29],[40,5,40,18],[40,19,40,22],[41,5,41,18],[41,19,41,22],[42,5,42,18],[42,19,42,22],[40,28,40,41],[42,1,42,4],[43,1,43,4],[43,5,43,18],[43,19,43,22],[44,24,44,27],[44,28,44,41],[31,1,31,2],[31,3,31,4],[40,1,40,4],[41,1,41,4],[44,1,44,4],[44,5,44,18],[44,19,44,22],[45,1,45,4],[45,5,45,18],[45,19,45,22],[46,1,46,4],[46,5,46,18],[46,19,46,22],[47,1,47,4],[47,5,47,18],[47,19,47,22],[32,1,32,2],[32,3,32,4],[33,1,33,2],[33,3,33,4],[48,1,48,4],[48,5,48,18],[48,19,48,22],[49,1,49,4],[49,5,49,18],[49,19,49,22],[50,1,50,4],[50,5,50,18],[50,19,50,22],[51,1,51,4],[51,5,51,18],[51,19,51,22],[48,24,48,27],[48,28,48,41],[34,1,34,2],[34,3,34,4],[35,1,35,2],[35,3,35,4],[52,1,52,4],[52,5,52,18],[52,19,52,22],[53,1,53,4],[53,5,53,18],[53,19,53,22],[52,24,52,27],[52,28,52,41],[39,1,39,4],[39,5,39,18],[39,19,39,22],[58,24,58,27],[58,28,58,41],[58,42,58,45],[36,1,36,2],[36,3,36,4],[38,1,38,22],[54,1,54,4],[54,5,54,18],[54,19,54,22],[55,1,55,4],[55,5,55,18],[55,19,55,22],[56,1,56,4],[56,5,56,18],[56,19,56,22],[61,1,61,4],[61,5,61,18],[61,19,61,22],[61,24,61,27],[61,28,61,41],[61,42,61,45],[59,1,59,4],[59,5,59,18],[59,19,59,22],[59,24,59,27],[59,28,59,41],[59,42,59,45],[62,1,62,4],[62,5,62,18],[62,19,62,22],[62,24,62,27],[62,28,62,41],[62,42,62,45]]}
[]
[]
[null,{"$f":"DAY(E3)","v":28},null,null,{"$f":"'Days27-28'!AB3+1","v":"2024-05-28"},null,null,null,{"$f":"DATE(YEAR($E$3),MONTH($E$3),1)","v":"2024-05-01"},null,null,null,null,null,null,null,{"$f":"DATE(YEAR(I3+35),MONTH(I3+35),1)","v":"2024-06-01"},null,null,null,null,null,null,null,{"$f":"DAY(AB3)","v":29},null,null,{"$f":"E3+1","v":"2024-05-29"},null,null,null,{"$f":"DATE(YEAR(AB3),MONTH(AB3),1)","v":"2024-05-01"},null,null,null,null,null,null,null,{"$f":"DATE(YEAR(AF3+35),MONTH(AF3+35),1)","v":"2024-06-01"}]
[null,null,null,null,null,null,null,null,{"$f":"CHOOSE(1+MOD('Days1-2'!J1+1-2,7),\"Su\",\"M\",\"Tu\",\"W\",\"Th\",\"F\",\"Sa\")","v":"Su"},{"$f":"CHOOSE(1+MOD('Days1-2'!$J$1+2-2,7),\"Su\",\"M\",\"Tu\",\"W\",\"Th\",\"F\",\"Sa\")","v":"M"},{"$f":"CHOOSE(1+MOD('Days1-2'!$J$1+3-2,7),\"Su\",\"M\",\"Tu\",\"W\",\"Th\",\"F\",\"Sa\")","v":"Tu"},{"$f":"CHOOSE(1+MOD('Days1-2'!$J$1+4-2,7),\"Su\",\"M\",\"Tu\",\"W\",\"Th\",\"F\",\"Sa\")","v":"W"},{"$f":"CHOOSE(1+MOD('Days1-2'!$J$1+5-2,7),\"Su\",\"M\",\"Tu\",\"W\",\"Th\",\"F\",\"Sa\")","v":"Th"},{"$f":"CHOOSE(1+MOD('Days1-2'!$J$1+6-2,7),\"Su\",\"M\",\"Tu\",\"W\",\"Th\",\"F\",\"Sa\")","v":"F"},{"$f":"CHOOSE(1+MOD('Days1-2'!$J$1+7-2,7),\"Su\",\"M\",\"Tu\",\"W\",\"Th\",\"F\",\"Sa\")","v":"Sa"},null,{"$f":"CHOOSE(1+MOD('Days1-2'!J1+1-2,7),\"Su\",\"M\",\"Tu\",\"W\",\"Th\",\"F\",\"Sa\")","v":"Su"},{"$f":"CHOOSE(1+MOD('Days1-2'!J1+2-2,7),\"Su\",\"M\",\"Tu\",\"W\",\"Th\",\"F\",\"Sa\")","v":"M"},{"$f":"CHOOSE(1+MOD('Days1-2'!J1+3-2,7),\"Su\",\"M\",\"Tu\",\"W\",\"Th\",\"F\",\"Sa\")","v":"Tu"},{"$f":"CHOOSE(1+MOD('Days1-2'!J1+4-2,7),\"Su\",\"M\",\"Tu\",\"W\",\"Th\",\"F\",\"Sa\")","v":"W"},{"$f":"CHOOSE(1+MOD('Days1-2'!J1+5-2,7),\"Su\",\"M\",\"Tu\",\"W\",\"Th\",\"F\",\"Sa\")","v":"Th"},{"$f":"CHOOSE(1+MOD('Days1-2'!J1+6-2,7),\"Su\",\"M\",\"Tu\",\"W\",\"Th\",\"F\",\"Sa\")","v":"F"},{"$f":"CHOOSE(1+MOD('Days1-2'!J1+7-2,7),\"Su\",\"M\",\"Tu\",\"W\",\"Th\",\"F\",\"Sa\")","v":"Sa"},null,null,null,null,null,null,null,null,{"$f":"CHOOSE(1+MOD('Days1-2'!$J$1+1-2,7),\"Su\",\"M\",\"Tu\",\"W\",\"Th\",\"F\",\"Sa\")","v":"Su"},{"$f":"CHOOSE(1+MOD('Days1-2'!$J$1+2-2,7),\"Su\",\"M\",\"Tu\",\"W\",\"Th\",\"F\",\"Sa\")","v":"M"},{"$f":"CHOOSE(1+MOD('Days1-2'!$J$1+3-2,7),\"Su\",\"M\",\"Tu\",\"W\",\"Th\",\"F\",\"Sa\")","v":"Tu"},{"$f":"CHOOSE(1+MOD('Days1-2'!$J$1+4-2,7),\"Su\",\"M\",\"Tu\",\"W\",\"Th\",\"F\",\"Sa\")","v":"W"},{"$f":"CHOOSE(1+MOD('Days1-2'!$J$1+5-2,7),\"Su\",\"M\",\"Tu\",\"W\",\"Th\",\"F\",\"Sa\")","v":"Th"},{"$f":"CHOOSE(1+MOD('Days1-2'!$J$1+6-2,7),\"Su\",\"M\",\"Tu\",\"W\",\"Th\",\"F\",\"Sa\")","v":"F"},{"$f":"CHOOSE(1+MOD('Days1-2'!$J$1+7-2,7),\"Su\",\"M\",\"Tu\",\"W\",\"Th\",\"F\",\"Sa\")","v":"Sa"},null,{"$f":"CHOOSE(1+MOD('Days1-2'!$J$1+1-2,7),\"Su\",\"M\",\"Tu\",\"W\",\"Th\",\"F\",\"Sa\")","v":"Su"},{"$f":"CHOOSE(1+MOD('Days1-2'!$J$1+2-2,7),\"Su\",\"M\",\"Tu\",\"W\",\"Th\",\"F\",\"Sa\")","v":"M"},{"$f":"CHOOSE(1+MOD('Days1-2'!$J$1+3-2,7),\"Su\",\"M\",\"Tu\",\"W\",\"Th\",\"F\",\"Sa\")","v":"Tu"},{"$f":"CHOOSE(1+MOD('Days1-2'!$J$1+4-2,7),\"Su\",\"M\",\"Tu\",\"W\",\"Th\",\"F\",\"Sa\")","v":"W"},{"$f":"CHOOSE(1+MOD('Days1-2'!$J$1+5-2,7),\"Su\",\"M\",\"Tu\",\"W\",\"Th\",\"F\",\"Sa\")","v":"Th"},{"$f":"CHOOSE(1+MOD('Days1-2'!$J$1+6-2,7),\"Su\",\"M\",\"Tu\",\"W\",\"Th\",\"F\",\"Sa\")","v":"F"},{"$f":"CHOOSE(1+MOD('Days1-2'!$J$1+7-2,7),\"Su\",\"M\",\"Tu\",\"W\",\"Th\",\"F\",\"Sa\")","v":"Sa"}]
[null,null,null,null,{"$f":"INDEX({\"Sunday\",\"Monday\",\"Tuesday\",\"Wednesday\",\"Thursday\",\"Friday\",\"Saturday\"},WEEKDAY(E3))","v":"Tuesday"},null,null,null,{"$f":"IF(WEEKDAY(I3,1)='Days1-2'!$J$1,I3,\"\")","v":""},{"$f":"IF(I5=\"\",IF(WEEKDAY(I3,1)=MOD('Days1-2'!$J$1,7)+1,I3,\"\"),I5+1)","v":""},{"$f":"IF(J5=\"\",IF(WEEKDAY(I3,1)=MOD('Days1-2'!$J$1+1,7)+1,I3,\"\"),J5+1)","v":""},{"$f":"IF(K5=\"\",IF(WEEKDAY(I3,1)=MOD('Days1-2'!$J$1+2,7)+1,I3,\"\"),K5+1)","v":"2024-05-01"},{"$f":"IF(L5=\"\",IF(WEEKDAY(I3,1)=MOD('Days1-2'!$J$1+3,7)+1,I3,\"\"),L5+1)","v":"2024-05-02"},{"$f":"IF(M5=\"\",IF(WEEKDAY(I3,1)=MOD('Days1-2'!$J$1+4,7)+1,I3,\"\"),M5+1)","v":"2024-05-03"},{"$f":"IF(N5=\"\",IF(WEEKDAY(I3,1)=MOD('Days1-2'!$J$1+5,7)+1,I3,\"\"),N5+1)","v":"2024-05-04"},null,{"$f":"IF(WEEKDAY(Q3,1)='Days1-2'!$J$1,Q3,\"\")","v":""},{"$f":"IF(Q5=\"\",IF(WEEKDAY(Q3,1)=MOD('Days1-2'!$J$1,7)+1,Q3,\"\"),Q5+1)","v":""},{"$f":"IF(R5=\"\",IF(WEEKDAY(Q3,1)=MOD('Days1-2'!$J$1+1,7)+1,Q3,\"\"),R5+1)","v":""},{"$f":"IF(S5=\"\",IF(WEEKDAY(Q3,1)=MOD('Days1-2'!$J$1+2,7)+1,Q3,\"\"),S5+1)","v":""},{"$f":"IF(T5=\"\",IF(WEEKDAY(Q3,1)=MOD('Days1-2'!$J$1+3,7)+1,Q3,\"\"),T5+1)","v":""},{"$f":"IF(U5=\"\",IF(WEEKDAY(Q3,1)=MOD('Days1-2'!$J$1+4,7)+1,Q3,\"\"),U5+1)","v":""},{"$f":"IF(V5=\"\",IF(WEEKDAY(Q3,1)=MOD('Days1-2'!$J$1+5,7)+1,Q3,\"\"),V5+1)","v":"2024-06-01"},null,null,null,null,{"$f":"INDEX({\"Sunday\",\"Monday\",\"Tuesday\",\"Wednesday\",\"Thursday\",\"Friday\",\"Saturday\"},WEEKDAY(AB3))","v":"Wednesday"},null,null,null,{"$f":"IF(WEEKDAY(AF3,1)='Days1-2'!$J$1,AF3,\"\")","v":""},{"$f":"IF(AF5=\"\",IF(WEEKDAY(AF3,1)=MOD('Days1-2'!$J$1,7)+1,AF3,\"\"),AF5+1)","v":""},{"$f":"IF(AG5=\"\",IF(WEEKDAY(AF3,1)=MOD('Days1-2'!$J$1+1,7)+1,AF3,\"\"),AG5+1)","v":""},{"$f":"IF(AH5=\"\",IF(WEEKDAY(AF3,1)=MOD('Days1-2'!$J$1+2,7)+1,AF3,\"\"),AH5+1)","v":"2024-05-01"},{"$f":"IF(AI5=\"\",IF(WEEKDAY(AF3,1)=MOD('Days1-2'!$J$1+3,7)+1,AF3,\"\"),AI5+1)","v":"2024-05-02"},{"$f":"IF(AJ5=\"\",IF(WEEKDAY(AF3,1)=MOD('Days1-2'!$J$1+4,7)+1,AF3,\"\"),AJ5+1)","v":"2024-05-03"},{"$f":"IF(AK5=\"\",IF(WEEKDAY(AF3,1)=MOD('Days1-2'!$J$1+5,7)+1,AF3,\"\"),AK5+1)","v":"2024-05-04"},null,{"$f":"IF(WEEKDAY(AN3,1)='Days1-2'!$J$1,AN3,\"\")","v":""},{"$f":"IF(AN5=\"\",IF(WEEKDAY(AN3,1)=MOD('Days1-2'!$J$1,7)+1,AN3,\"\"),AN5+1)","v":""},{"$f":"IF(AO5=\"\",IF(WEEKDAY(AN3,1)=MOD('Days1-2'!$J$1+1,7)+1,AN3,\"\"),AO5+1)","v":""},{"$f":"IF(AP5=\"\",IF(WEEKDAY(AN3,1)=MOD('Days1-2'!$J$1+2,7)+1,AN3,\"\"),AP5+1)","v":""},{"$f":"IF(AQ5=\"\",IF(WEEKDAY(AN3,1)=MOD('Days1-2'!$J$1+3,7)+1,AN3,\"\"),AQ5+1)","v":""},{"$f":"IF(AR5=\"\",IF(WEEKDAY(AN3,1)=MOD('Days1-2'!$J$1+4,7)+1,AN3,\"\"),AR5+1)","v":""},{"$f":"IF(AS5=\"\",IF(WEEKDAY(AN3,1)=MOD('Days1-2'!$J$1+5,7)+1,AN3,\"\"),AS5+1)","v":"2024-06-01"}]
[null,null,null,null,null,null,null,null,{"$f":"IF(O5=\"\",\"\",IF(MONTH(O5+1)<>MONTH(O5),\"\",O5+1))","v":"2024-05-05"},{"$f":"IF(I6=\"\",\"\",IF(MONTH(I6+1)<>MONTH(I6),\"\",I6+1))","v":"2024-05-06"},{"$f":"IF(J6=\"\",\"\",IF(MONTH(J6+1)<>MONTH(J6),\"\",J6+1))","v":"2024-05-07"},{"$f":"IF(K6=\"\",\"\",IF(MONTH(K6+1)<>MONTH(K6),\"\",K6+1))","v":"2024-05-08"},"2024-05-09","2024-05-10","2024-05-11",null,{"$f":"IF(W5=\"\",\"\",IF(MONTH(W5+1)<>MONTH(W5),\"\",W5+1))","v":"2024-06-02"},{"$f":"IF(Q6=\"\",\"\",IF(MONTH(Q6+1)<>MONTH(Q6),\"\",Q6+1))","v":"2024-06-03"},{"$f":"IF(R6=\"\",\"\",IF(MONTH(R6+1)<>MONTH(R6),\"\",R6+1))","v":"2024-06-04"},{"$f":"IF(S6=\"\",\"\",IF(MONTH(S6+1)<>MONTH(S6),\"\",S6+1))","v":"2024-06-05"},{"$f":"IF(T6=\"\",\"\",IF(MONTH(T6+1)<>MONTH(T6),\"\",T6+1))","v":"2024-06-06"},"2024-06-07","2024-06-08",null,null,null,null,null,null,null,null,{"$f":"IF(AL5=\"\",\"\",IF(MONTH(AL5+1)<>MONTH(AL5),\"\",AL5+1))","v":"2024-05-05"},{"$f":"IF(AF6=\"\",\"\",IF(MONTH(AF6+1)<>MONTH(AF6),\"\",AF6+1))","v":"2024-05-06"},{"$f":"IF(AG6=\"\",\"\",IF(MONTH(AG6+1)<>MONTH(AG6),\"\",AG6+1))","v":"2024-05-07"},{"$f":"IF(AH6=\"\",\"\",IF(MONTH(AH6+1)<>MONTH(AH6),\"\",AH6+1))","v":"2024-05-08"},{"$f":"IF(AI6=\"\",\"\",IF(MONTH(AI6+1)<>MONTH(AI6),\"\",AI6+1))","v":"2024-05-09"},"2024-05-10","2024-05-11",null,{"$f":"IF(AT5=\"\",\"\",IF(MONTH(AT5+1)<>MONTH(AT5),\"\",AT5+1))","v":"2024-06-02"},{"$f":"IF(AN6=\"\",\"\",IF(MONTH(AN6+1)<>MONTH(AN6),\"\",AN6+1))","v":"2024-06-03"},{"$f":"IF(AO6=\"\",\"\",IF(MONTH(AO6+1)<>MONTH(AO6),\"\",AO6+1))","v":"2024-06-04"},{"$f":"IF(AP6=\"\",\"\",IF(MONTH(AP6+1)<>MONTH(AP6),\"\",AP6+1))","v":"2024-06-05"},{"$f":"IF(AQ6=\"\",\"\",IF(MONTH(AQ6+1)<>MONTH(AQ6),\"\",AQ6+1))","v":"2024-06-06"},"2024-06-07","2024-06-08"]
[null,{"$f":"IFERROR(INDEX(arr_holiday,SMALL(IF(arr_holidaydate=$E$3,ROW(arr_holidaydate)),ROW()-ROW($B$6))),\"\")","v":""},null,null,null,null,null,null,{"$f":"IF(O6=\"\",\"\",IF(MONTH(O6+1)<>MONTH(O6),\"\",O6+1))","v":"2024-05-12"},{"$f":"IF(I7=\"\",\"\",IF(MONTH(I7+1)<>MONTH(I7),\"\",I7+1))","v":"2024-05-13"},"2024-05-14","2024-05-15","2024-05-16","2024-05-17","2024-05-18",null,{"$f":"IF(W6=\"\",\"\",IF(MONTH(W6+1)<>MONTH(W6),\"\",W6+1))","v":"2024-06-09"},{"$f":"IF(Q7=\"\",\"\",IF(MONTH(Q7+1)<>MONTH(Q7),\"\",Q7+1))","v":"2024-06-10"},"2024-06-11","2024-06-12","2024-06-13","2024-06-14","2024-06-15",null,{"$f":"IFERROR(INDEX(arr_holiday,SMALL(IF(arr_holidaydate=$AB$3,ROW(arr_holidaydate)),ROW()-ROW($B$6))),\"\")","v":""},null,null,null,null,null,null,{"$f":"IF(AL6=\"\",\"\",IF(MONTH(AL6+1)<>MONTH(AL6),\"\",AL6+1))","v":"2024-05-12"},{"$f":"IF(AF7=\"\",\"\",IF(MONTH(AF7+1)<>MONTH(AF7),\"\",AF7+1))","v":"2024-05-13"},"2024-05-14","2024-05-15","2024-05-16","2024-05-17","2024-05-18",null,{"$f":"IF(AT6=\"\",\"\",IF(MONTH(AT6+1)<>MONTH(AT6),\"\",AT6+1))","v":"2024-06-09"},{"$f":"IF(AN7=\"\",\"\",IF(MONTH(AN7+1)<>MONTH(AN7),\"\",AN7+1))","v":"2024-06-10"},"2024-06-11","2024-06-12","2024-06-13","2024-06-14","2024-06-15"]
[null,{"$f":"IFERROR(INDEX(arr_holiday,SMALL(IF(arr_holidaydate=$E$3,ROW(arr_holidaydate)),ROW()-ROW($B$6))),\"\")","v":""},null,null,null,null,null,null,"2024-05-19","2024-05-20","2024-05-21","2024-05-22","2024-05-23","2024-05-24","2024-05-25",null,"2024-06-16","2024-06-17","2024-06-18","2024-06-19","2024-06-20","2024-06-21","2024-06-22",null,{"$f":"IFERROR(INDEX(arr_holiday,SMALL(IF(arr_holidaydate=$AB$3,ROW(arr_holidaydate)),ROW()-ROW($B$6))),\"\")","v":""},null,null,null,null,null,null,"2024-05-19","2024-05-20","2024-05-21","2024-05-22","2024-05-23","2024-05-24","2024-05-25",null,"2024-06-16","2024-06-17","2024-06-18","2024-06-19","2024-06-20","2024-06-21","2024-06-22"]
[null,{"$f":"IFERROR(INDEX(arr_holiday,SMALL(IF(arr_holidaydate=$E$3,ROW(arr_holidaydate)),ROW()-ROW($B$6))),\"\")","v":""},null,null,null,null,null,null,"2024-05-26","2024-05-27","2024-05-28","2024-05-29","2024-05-30","2024-05-31","",null,"2024-06-23","2024-06-24","2024-06-25","2024-06-26","2024-06-27","2024-06-28","2024-06-29",null,{"$f":"IFERROR(INDEX(arr_holiday,SMALL(IF(arr_holidaydate=$AB$3,ROW(arr_holidaydate)),ROW()-ROW($B$6))),\"\")","v":""},null,null,null,null,null,null,"2024-05-26","2024-05-27","2024-05-28","2024-05-29","2024-05-30","2024-05-31","",null,"2024-06-23","2024-06-24","2024-06-25","2024-06-26","2024-06-27","2024-06-28","2024-06-29"]
[null,{"$f":"IFERROR(INDEX(arr_event,SMALL(IF(arr_eventdate=$E$3,ROW(arr_eventdate)),ROW()-ROW($B$9))),\"\")","v":""},null,null,null,null,null,null,"","","","","","","",null,"2024-06-30","","","","","","",null,{"$f":"IFERROR(INDEX(arr_event,SMALL(IF(arr_eventdate=$AB$3,ROW(arr_eventdate)),ROW()-ROW($B$9))),\"\")","v":""},null,null,null,null,null,null,"","","","","","","",null,"2024-06-30","","","","","",""]
[null,{"$f":"IFERROR(INDEX(arr_event,SMALL(IF(arr_eventdate=$E$3,ROW(arr_eventdate)),ROW()-ROW($B$9))),\"\")","v":""},null,null,null,null,null,null,null,null,null,null,null,null,null,null,null,null,null,null,null,null,null,null,{"$f":"IFERROR(INDEX(arr_event,SMALL(IF(arr_eventdate=$AB$3,ROW(arr_eventdate)),ROW()-ROW($B$9))),\"\")","v":""}]
[null,{"$f":"IFERROR(INDEX(arr_event,SMALL(IF(arr_eventdate=$E$3,ROW(arr_eventdate)),ROW()-ROW($B$9))),\"\")","v":""},null,null,null,null,null,null,null,null,null,null,null,null,null,null,null,null,null,null,null,null,null,null,{"$f":"IFERROR(INDEX(arr_event,SMALL(IF(arr_eventdate=$AB$3,ROW(arr_eventdate)),ROW()-ROW($B$9))),\"\")","v":""}]
[null,"Reminders",null,null,null,null,null,null,"Appointments",null,null,null,null,null,null,null,"Notes",null,null,null,null,null,null,null,"Reminders",null,null,null,null,null,null,"Appointments",null,null,null,null,null,null,null,"Notes"]
[null,{"$f":"IFERROR(INDEX(arr_event,SMALL(IF(arr_eventdate=$E$3,ROW(arr_eventdate)),ROW()-ROW($B$13))),\"\")","v":""},null,null,null,null,7,":00",null,null,null,null,null,null,null,null,null,null,null,null,null,null,null,null,{"$f":"IFERROR(INDEX(arr_event,SMALL(IF(arr_eventdate=$E$3,ROW(arr_eventdate)),ROW()-ROW($B$13))),\"\")","v":""},null,null,null,null,7,":00"]
[null,"",null,null,null,null,null,":30",null,null,null,null,null,null,null,null,null,null,null,null,null,null,null,null,"",null,null,null,null,null,":30"]
[null,"",null,null,null,null,8,":00",null,null,null,null,null,null,null,null,null,null,null,null,null,null,null,null,"",null,null,null,null,8,":00"]
[null,"",null,null,null,null,null,":30",null,null,null,null,null,null,null,null,null,null,null,null,null,null,null,null,"",null,null,null,null,null,":30"]
[null,"",null,null,null,null,9,":00",null,null,null,null,null,null,null,null,null,null,null,null,null,null,null,null,"",null,null,null,null,9,":00"]
[null,"",null,null,null,null,null,":30",null,null,null,null,null,null,null,null,null,null,null,null,null,null,null,null,"",null,null,null,null,null,":30"]
[null,"",null,null,null,null,10,":00",null,null,null,null,null,null,null,null,null,null,null,null,null,null,null,null,"",null,null,null,null,10,":00"]
[null,"",null,null,null,null,null,":30",null,null,null,null,null,null,null,null,null,null,null,null,null,null,null,null,"",null,null,null,null,null,":30"]
[null,"From",null,"Actions Carried Forward",null,null,11,":00",null,null,null,null,null,null,null,null,null,null,null,null,null,null,null,null,"From",null,"Actions Carried Forward",null,null,11,":00"]
[null,{"$f":"IFERROR(INDEX(arr_event,SMALL(IF(arr_eventdate=$E$3,ROW(arr_eventdate)),ROW()-ROW($B$13))),\"\")","v":""},null,null,null,null,null,":30",null,null,null,null,null,null,null,null,null,null,null,null,null,null,null,null,{"$f":"IFERROR(INDEX(arr_event,SMALL(IF(arr_eventdate=$E$3,ROW(arr_eventdate)),ROW()-ROW($B$13))),\"\")","v":""},null,null,null,null,null,":30"]
[null,{"$f":"IFERROR(INDEX(arr_event,SMALL(IF(arr_eventdate=$E$3,ROW(arr_eventdate)),ROW()-ROW($B$13))),\"\")","v":""},null,null,null,null,12,":00",null,null,null,null,null,null,null,null,null,null,null,null,null,null,null,null,{"$f":"IFERROR(INDEX(arr_event,SMALL(IF(arr_eventdate=$E$3,ROW(arr_eventdate)),ROW()-ROW($B$13))),\"\")","v":""},null,null,null,null,12,":00"]
[null,{"$f":"IFERROR(INDEX(arr_event,SMALL(IF(arr_eventdate=$E$3,ROW(arr_eventdate)),ROW()-ROW($B$13))),\"\")","v":""},null,null,null,null,null,":30",null,null,null,null,null,null,null,null,null,null,null,null,null,null,null,null,{"$f":"IFERROR(INDEX(arr_event,SMALL(IF(arr_eventdate=$E$3,ROW(arr_eventdate)),ROW()-ROW($B$13))),\"\")","v":""},null,null,null,null,null,":30"]
[null,{"$f":"IFERROR(INDEX(arr_event,SMALL(IF(arr_eventdate=$E$3,ROW(arr_eventdate)),ROW()-ROW($B$13))),\"\")","v":""},null,null,null,null,1,":00",null,null,null,null,null,null,null,null,null,null,null,null,null,null,null,null,{"$f":"IFERROR(INDEX(arr_event,SMALL(IF(arr_eventdate=$E$3,ROW(arr_eventdate)),ROW()-ROW($B$13))),\"\")","v":""},null,null,null,null,1,":00"]
[null,{"$f":"IFERROR(INDEX(arr_event,SMALL(IF(arr_eventdate=$E$3,ROW(arr_eventdate)),ROW()-ROW($B$13))),\"\")","v":""},null,null,null,null,null,":30",null,null,null,null,null,null,null,null,null,null,null,null,null,null,null,null,{"$f":"IFERROR(INDEX(arr_event,SMALL(IF(arr_eventdate=$E$3,ROW(arr_eventdate)),ROW()-ROW($B$13))),\"\")","v":""},null,null,null,null,null,":30"]
[null,{"$f":"IFERROR(INDEX(arr_event,SMALL(IF(arr_eventdate=$E$3,ROW(arr_eventdate)),ROW()-ROW($B$13))),\"\")","v":""},null,null,null,null,2,":00",null,null,null,null,null,null,null,null,null,null,null,null,null,null,null,null,{"$f":"IFERROR(INDEX(arr_event,SMALL(IF(arr_eventdate=$E$3,ROW(arr_eventdate)),ROW()-ROW($B$13))),\"\")","v":""},null,null,null,null,2,":00"]
[null,{"$f":"IFERROR(INDEX(arr_event,SMALL(IF(arr_eventdate=$E$3,ROW(arr_eventdate)),ROW()-ROW($B$13))),\"\")","v":""},null,null,null,null,null,":30",null,null,null,null,null,null,null,null,null,null,null,null,null,null,null,null,{"$f":"IFERROR(INDEX(arr_event,SMALL(IF(arr_eventdate=$E$3,ROW(arr_eventdate)),ROW()-ROW($B$13))),\"\")","v":""},null,null,null,null,null,":30"]
[null,{"$f":"IFERROR(INDEX(arr_event,SMALL(IF(arr_eventdate=$E$3,ROW(arr_eventdate)),ROW()-ROW($B$13))),\"\")","v":""},null,null,null,null,3,":00",null,null,null,null,null,null,null,null,null,null,null,null,null,null,null,null,{"$f":"IFERROR(INDEX(arr_event,SMALL(IF(arr_eventdate=$E$3,ROW(arr_eventdate)),ROW()-ROW($B$13))),\"\")","v":""},null,null,null,null,3,":00"]
[null,null,null,null,null,null,null,":30",null,null,null,null,null,null,null,null,null,null,null,null,null,null,null,null,null,null,null,null,null,null,":30"]
[null,"$Amt",null,"Expenses",null,null,4,":00",null,null,null,null,null,null,null,null,null,null,null,null,null,null,null,null,"$Amt",null,"Expenses",null,null,4,":00"]
[null,null,null,null,null,null,null,":30",null,null,null,null,null,null,null,null,null,null,null,null,null,null,null,null,null,null,null,null,null,null,":30"]
[null,null,null,null,null,null,5,":00",null,null,null,null,null,null,null,null,null,null,null,null,null,null,null,null,null,null,null,null,null,5,":00"]
[null,null,null,null,null,null,null,":30",null,null,null,null,null,null,null,null,null,null,null,null,null,null,null,null,null,null,null,null,null,null,":30"]
[null,null,null,null,null,null,6,":00",null,null,null,null,null,null,null,null,null,null,null,null,null,null,null,null,null,null,null,null,null,6,":00"]
[null,null,null,null,null,null,null,":30",null,null,null,null,null,null,null,null,null,null,null,null,null,null,null,null,null,null,null,null,null,null,":30"]
[]
[null,"Planned cases for today",null,null,null,null,null,":30",null,null,null,null,null,null,null,null,null,null,null,null,null,null,null,null,"Planned cases for today",null,null,null,null,null,":30"]
[null,"Case",null,null,null,"Action",null,null,null,null,null,null,null,null,null,null,null,null,null,"Follow-up",null,null,null,null,"Case",null,null,null,"Action",null,null,null,null,null,null,null,null,null,null,null,null,null,"Follow-up"]