{"text_format":"1","workbook":"xlsx","n_sheets":15,"sheets":["Instructions","HistoryForm","Settings","Sheet1","Base","Final","Summary","Bank Dep","Pers Exp","433-A","Bus Exp","433-B","Assets","Other","ShadowSheet"],"not_rendered":{"charts":0,"images":10,"macros":1,"external_links":1,"defined_names":309,"comments":1,"pivot_tables":0},"unopened":[],"bounds":{"document_bytes":16777216,"sheet_cells":100000,"rows_first":2000,"rows_last":500,"rows_between":2000,"halvings":0,"cell_chars":16384,"cell_head_chars":4096},"cells_cut":0,"cells_raw":0,"read":"whole","date_system":"1900"}

{"sheet":"Instructions","index":0,"n_rows":298,"n_cols":14,"rows_kept":298,"cut":false,"hidden":true,"merged":[[297,11,303,15],[24,9,32,12],[62,10,68,14],[102,11,106,15],[151,12,159,16],[203,13,212,16],[250,12,254,16]]}
[2]
[]
[]
[]
[]
[]
{"$rows_left_out":293}
{"sheet":"HistoryForm","index":1,"n_rows":41,"n_cols":16,"rows_kept":41,"cut":false,"hidden":false,"merged":[[2,7,11,7]]}
[{"$f":"COUNTIF(D:D,\"?????\")","v":9},{"$f":"\"Issues to address before closing: \"&A1","v":"Issues to address before closing: 9"},false,null,"NoShow","NoShow",null,null,null,null,null,null,null,null,null,{"$f":"INDEX(CloseType[],MATCH(B2,ClosingTypes,0),3)","v":21}]
["D1","Fully Compliant"]
[{"$f":"IF(B3=\"\",\"\",MATCH(B3,ValidRequirements[Valid Requirements],0))+69","v":92},"History Note / Closing Summary",{"$f":"IF(B3=\"\",FALSE,TRUE)","v":true},{"$f":"IF(HistoryForm!B3=\"\",\"\",INDEX(ValidRequirements[],MATCH(B3,ValidRequirements[Valid Requirements],0),2))","v":"?????"},null," \n \n"]
[{"$f":"IF(B4=\"\",\"\",MATCH(B4,ValidRequirements[Valid Requirements],0))+69","v":111},"Taxpayer Rights must be documented",{"$f":"IF(B4=\"\",FALSE,TRUE)","v":true},{"$f":"IF(HistoryForm!B4=\"\",\"\",INDEX(ValidRequirements[],MATCH(B4,ValidRequirements[Valid Requirements],0),2))","v":"?????"},null," \n \n"]
[{"$f":"IF(B5=\"\",\"\",MATCH(B5,ValidRequirements[Valid Requirements],0))+69","v":72},"3rd party contacts must be documented",true,{"$f":"IF(HistoryForm!B5=\"\",\"\",INDEX(ValidRequirements[],MATCH(B5,ValidRequirements[Valid Requirements],0),2))","v":"?????"},null," \n \n"]
[{"$f":"IF(B6=\"\",\"\",MATCH(B6,ValidRequirements[Valid Requirements],0))+69","v":77},"All IDRS modules addressed",true,{"$f":"IF(HistoryForm!B6=\"\",\"\",INDEX(ValidRequirements[],MATCH(B6,ValidRequirements[Valid Requirements],0),2))","v":"?????"},null," \n \n"]
{"$rows_left_out":36}
{"sheet":"Settings","index":2,"n_rows":61,"n_cols":39,"rows_kept":61,"cut":false,"hidden":true,"merged":[[59,14,59,19],[60,14,60,19],[53,14,53,19],[54,14,54,19],[55,14,55,19],[56,14,56,19],[57,14,57,19],[58,14,58,19],[52,14,52,19],[41,14,41,19],[42,14,42,19],[43,14,43,19],[44,14,44,19],[45,14,45,19],[46,14,46,19],[47,14,47,19],[48,14,48,19],[49,14,49,19],[50,14,50,19],[51,14,51,19],[40,14,40,19],[35,14,35,19],[36,14,36,19],[37,14,37,19],[38,14,38,19],[39,14,39,19]]}
[]
[null,null,null,null,null,null,null,null,null,null,null,null,"Today:",null,null,941,"Filed","Balance",940,"Filed","Balance","1120 / 1065","Filed","Balance",1040,"Filed","Balance","Other","Filed","Balance",null,null,"Years","Months","Day"]
[null,null,null,null,"First Name","David",null,null,"Title","Revenue Officer",null,null,{"$f":"TODAY()","v":"2022-05-25"},null,null,{"$f":"YEAR(AG3)&TEXT(AK3,\"00\")","v":"202206"},false,null,{"$f":"YEAR($M$3)-1&\"12\"","v":"202112"},null,null,{"$f":"YEAR($M$3)-1&\"12\"","v":"202112"},null,null,{"$f":"YEAR($M$3)-1&\"12\"","v":"202112"},null,null,null,null,null,null,{"$f":"M3","v":"2022-05-25"},{"$f":"DATE(YEAR(AF3), MONTH(AF3), DAY(AF3))","v":"2022-05-25"},{"$f":"DATE(YEAR(AF3), MONTH(AF3), DAY(AF3))","v":"2022-05-25"},{"$f":"DATE(YEAR(AF3), MONTH(AF3), DAY(AF3))","v":"2022-05-25"},{"$f":"_xlfn.XLOOKUP(VALUE(MONTH(AH3)),$AL$3:$AL$14,$AM$3:$AM$14,\"No match\",0)","v":"2nd qtr."},{"$f":"_xlfn.XLOOKUP(AJ3,$AL$16:$AL$19,$AM$16:$AM$19,\"none\",0)","v":6},1,"1st qtr."]
[null,null,null,null,"Last Name","Collins",null,null,"Group Managers Name","George Cupp",null,null,null,null,null,"202103",null,null,{"$f":"YEAR($M$3)-2&\"12\"","v":"202012"},null,null,{"$f":"YEAR($M$3)-2&\"12\"","v":"202012"},null,null,{"$f":"YEAR($M$3)-2&\"12\"","v":"202012"},null,null,null,null,null,null,{"$f":"DATE(YEAR(AF3), MONTH(AF3)-3, DAY(AF3))","v":"2022-02-25"},{"$f":"DATE(YEAR(AF4), MONTH(AF4)-3, DAY(AF4))","v":"2021-11-25"},{"$f":"DATE(YEAR(AF4), MONTH(AF4), DAY(AF4))","v":"2022-02-25"},{"$f":"DATE(YEAR(AF4), MONTH(AF4), DAY(AF4))","v":"2022-02-25"},{"$f":"_xlfn.XLOOKUP(VALUE(MONTH(AH4)),$AL$3:$AL$14,$AM$3:$AM$14,\"No match\",0)","v":"1st qtr."},{"$f":"_xlfn.XLOOKUP(AJ4,$AL$16:$AL$19,$AM$16:$AM$19,\"none\",0)","v":3},2,"1st qtr."]
[null,null,null,null,"SEID","X2DNB",null,null,"Group Managers Email","George.Cupp@irs.gov",null,null,null,null,null,"202112",null,null,{"$f":"YEAR($M$3)-3&\"12\"","v":"201912"},null,null,{"$f":"YEAR($M$3)-3&\"12\"","v":"201912"},null,null,{"$f":"YEAR($M$3)-3&\"12\"","v":"201912"},null,null,null,null,null,null,{"$f":"DATE(YEAR(AF4), MONTH(AF4)-3, DAY(AF4))","v":"2021-11-25"},{"$f":"DATE(YEAR(AF5), MONTH(AF5)-3, DAY(AF5))","v":"2021-08-25"},{"$f":"DATE(YEAR(AF5), MONTH(AF5), DAY(AF5))","v":"2021-11-25"},{"$f":"DATE(YEAR(AF5), MONTH(AF5), DAY(AF5))","v":"2021-11-25"},{"$f":"_xlfn.XLOOKUP(VALUE(MONTH(AH5)),$AL$3:$AL$14,$AM$3:$AM$14,\"No match\",0)","v":"4th qtr."},12,3,"1st qtr."]
[null,null,null,null,"Address Line 1","5740 Uptain Rd, Ste 7800",null,null,"Group Secretary's Name","Paula Jeffreys",null,null,null,null,null,"202109",null,null,{"$f":"YEAR($M$3)-4&\"12\"","v":"201812"},null,null,{"$f":"YEAR($M$3)-4&\"12\"","v":"201812"},null,null,{"$f":"YEAR($M$3)-4&\"12\"","v":"201812"},null,null,null,null,null,null,"2021-08-25","2021-05-25","2021-08-25","2021-08-25","3rd qtr.",9,4,"2nd qtr."]
{"$rows_left_out":56}
{"sheet":"Sheet1","index":3,"n_rows":118,"n_cols":16,"rows_kept":118,"cut":false,"hidden":true,"merged":[]}
[]
[]
[]
[null,null,null,null,null,null,"Label",2," = ThisWorkbook.Sheets(\"Settings\").Range(\"P",4,"\")",null,{"$f":"G4&H4&I4&J4&K4","v":"Label2 = ThisWorkbook.Sheets(\"Settings\").Range(\"P4\")"}]
[null,null,null,null,null,null,"Label",3," = ThisWorkbook.Sheets(\"Settings\").Range(\"P",5,"\")",null,{"$f":"G5&H5&I5&J5&K5","v":"Label3 = ThisWorkbook.Sheets(\"Settings\").Range(\"P5\")"}]
[null,null,null,null,null,null,"Label",4," = ThisWorkbook.Sheets(\"Settings\").Range(\"P",6,"\")",null,{"$f":"G6&H6&I6&J6&K6","v":"Label4 = ThisWorkbook.Sheets(\"Settings\").Range(\"P6\")"}]
{"$rows_left_out":113}
{"sheet":"Base","index":4,"n_rows":121,"n_cols":29,"rows_kept":121,"cut":false,"hidden":true,"merged":[]}
["Defunct <$25k","Defunct >$25-100k","Defunct>$100k","Defunct>$250k","UTL/UTC <$25k","UTL/UTC >$25k","UTL/UTC >$100k","UTL/UTC >$250k","CNC/Hardship <$10k","CNC/Hardship $10-100k","CNC/Hardship>$100k","CNC/Hardship>$250k","Guaranteed IA","Streamline I","Streamline II","IBTF Express I","IBTF Express II","IBTF IA","Routine IA","PPIA","Fully Compliant","IB53"]
["History Note / Closing Summary","History Note / Closing Summary","History Note / Closing Summary","History Note / Closing Summary","History Note / Closing Summary","History Note / Closing Summary","History Note / Closing Summary","History Note / Closing Summary","History Note / Closing Summary","History Note / Closing Summary","History Note / Closing Summary","History Note / Closing Summary","History Note / Closing Summary","History Note / Closing Summary","History Note / Closing Summary","History Note / Closing Summary","History Note / Closing Summary","History Note / Closing Summary","History Note / Closing Summary","History Note / Closing Summary","History Note / Closing Summary","History Note / Closing Summary"]
["Taxpayer Rights must be documented","Taxpayer Rights must be documented","Taxpayer Rights must be documented","Taxpayer Rights must be documented","Taxpayer Rights must be documented","Taxpayer Rights must be documented","Taxpayer Rights must be documented","Taxpayer Rights must be documented","Taxpayer Rights must be documented","Taxpayer Rights must be documented","Taxpayer Rights must be documented","Taxpayer Rights must be documented","Taxpayer Rights must be documented","Taxpayer Rights must be documented","Taxpayer Rights must be documented","Taxpayer Rights must be documented","Taxpayer Rights must be documented","Taxpayer Rights must be documented","Taxpayer Rights must be documented","Taxpayer Rights must be documented","Taxpayer Rights must be documented","Taxpayer Rights must be documented",null,null,null,"Taxpayer Rights must be documented",{"$f":"IF(Z3=\"\",\"\",\"REQ'd\")","v":"REQ'd"},null,{"$f":"IF(AND(AA3=\"REQ'd\",AB3=\"\"),\"?????\",AB3)","v":"?????"}]
["3rd party contacts must be documented","3rd party contacts must be documented","3rd party contacts must be documented","3rd party contacts must be documented","3rd party contacts must be documented","3rd party contacts must be documented","3rd party contacts must be documented","3rd party contacts must be documented","3rd party contacts must be documented","3rd party contacts must be documented","3rd party contacts must be documented","3rd party contacts must be documented","3rd party contacts must be documented","3rd party contacts must be documented","3rd party contacts must be documented","3rd party contacts must be documented","3rd party contacts must be documented","3rd party contacts must be documented","3rd party contacts must be documented","3rd party contacts must be documented","3rd party contacts must be documented","3rd party contacts must be documented",null,null,null,"3rd party contacts must be documented",{"$f":"IF(Z4=\"\",\"\",\"REQ'd\")","v":"REQ'd"},null,{"$f":"IF(AND(AA4=\"REQ'd\",AB4=\"\"),\"?????\",AB4)","v":"?????"}]
["All IDRS modules addressed","All IDRS modules addressed","All IDRS modules addressed","All IDRS modules addressed","All IDRS modules addressed","All IDRS modules addressed","All IDRS modules addressed","All IDRS modules addressed","All IDRS modules addressed","All IDRS modules addressed","All IDRS modules addressed","All IDRS modules addressed","Type of tax is  Income Tax Only","Type of tax is  IMF, BMF Income, Out of business BMF","Type of tax is  IMF, BMF Income, Out of business BMF","Type of tax is  BMF Trust Fund","Type of tax is  BMF Trust Fund","Type of tax is  BMF Trust Fund","Type of tax is  IMF, BMF Income, Out of business BMF","CIS must be less than 12 months old","All IDRS modules addressed","All IDRS modules addressed",null,null,null,"Research should be commensurate with balance due and  document history as to why not completed.","REQ'd",null,"?????"]
["Make Field Call","Make Field Call","Make Field Call","Make Field Call","NFTL Filing","NFTL Filing","NFTL Filing","NFTL Filing","Make Field Call","NFTL Filing","NFTL Filing","NFTL Filing","Max Payment Term is 3 years & full pay within CSED","Max Payment Term is 72 months & within CSED","Max Payment Term is 72 months & within CSED","Max Payment Term is  24 months & within CSED","Max Payment Term is  24 months & within CSED","Max Payment Term is Within CSED","Max Payment Term is Within CSED","NFTL Filing","1040 INFO : Filing and current ES","Make Field Call",null,null,null,"Need to address levy sources","REQ'd",null,"?????"]
{"$rows_left_out":116}
{"sheet":"Final","index":5,"n_rows":34,"n_cols":17,"rows_kept":34,"cut":false,"hidden":true,"merged":[[13,12,14,12],[16,0,32,0],[16,1,16,2],[16,4,16,5],[33,4,33,5],[33,6,33,7],[0,4,0,6],[0,10,0,12],[0,13,0,15],[1,0,14,0],[1,1,1,3],[1,4,1,6],[7,1,7,3],[7,10,7,12],[13,10,14,10],[13,11,14,11]]}
[null,null,null,null,"433-A / S.E.",null,null,null,null,null,"Total Monthly Business Income ",null,null,"Total Monthly Business Expenses "]
["Self Employment","Total Monthly Business Income ",null,null,"Total Monthly Business Expenses",null,null,null,null,null,null,"Source ","Gross Monthly ",null,"Expense Items ","Actual Monthly ","Adjusted Monthly"]
[null,67,"Gross Receipts ",null,77,"Materials Purchased",null,null,null,null,25,"Gross Receipts from Sales/Services ",null,36,"Materials Purchased",null,0]
[null,68,"Gross Rental Income ",null,78,"Inventory Purchased",null,null,null,null,26,"Gross Rental Income ",null,37,"Inventory Purchased",null,0]
[null,69,"Interest ",null,79,"Gross Wages & Salaries",null,null,null,null,27,"Interest Income ",null,38,"Gross Wages & Salaries ",null,0]
[null,70,"Dividends ",null,80,"Rent",null,null,null,null,28,"Dividends ",null,39,"Rent ",null,0]
{"$rows_left_out":29}
{"sheet":"Summary","index":6,"n_rows":20,"n_cols":4,"rows_kept":20,"cut":false,"hidden":true,"merged":[]}
["PERSONAL","Personal$","BUSINESS","Business$"]
["Income:",{"$f":"IF(ISERROR(AVERAGE(B3:B7)),\"\",AVERAGE(B3:B7))","v":""},"Income",{"$f":"IF(ISERROR(AVERAGE(D3:D8)),\"\",AVERAGE(D3:D8))","v":""}]
["433-A",null,"433-B"]
["Bank statements",null,"433-A SE"]
["Tax Returns",null,"Bank Statements"]
["Paycheck stubs",null,"P&L's"]
{"$rows_left_out":15}
{"sheet":"Bank Dep","index":7,"n_rows":7,"n_cols":8,"rows_kept":7,"cut":false,"hidden":true,"merged":[[4,0,5,0],[4,2,5,2],[4,4,5,4],[4,6,5,6],[0,6,0,7],[4,1,5,1],[4,3,5,3],[4,5,5,5],[4,7,5,7],[0,2,0,3]]}
[null,"Average of selected accounts:",{"$f":"IF(ISERROR(SUMIF(A5:G5,TRUE,B5:H5)),0,SUMIF(A5:G5,TRUE,B5:H5))","v":0},null,{"$f":"SUMIF(A6:G6,TRUE,B5:H5)","v":0},{"$f":"COUNTIF(A6:G6,TRUE)","v":0}]
[]
[]
["Account:",null,"Account:",null,"Account:",null,"Account:"]
[true,{"$f":"IF(ISERROR(AVERAGE(B8:B25)),0,AVERAGE(B8:B25))","v":0},false,{"$f":"IF(ISERROR(AVERAGE(D8:D25)),0,AVERAGE(D8:D25))","v":0},true,{"$f":"IF(ISERROR(AVERAGE(F8:F25)),0,AVERAGE(F8:F25))","v":0},true,{"$f":"IF(ISERROR(AVERAGE(H8:H25)),0,AVERAGE(H8:H25))","v":0}]
[]
{"$rows_left_out":2}
{"sheet":"Pers Exp","index":8,"n_rows":15,"n_cols":12,"rows_kept":15,"cut":false,"hidden":true,"merged":[]}
["Item","Amount","Category",null,null,"Food, Clothing, and Misc.",0,null,null,null,"Food, Clothing, and Misc."]
[null,null,null,null,null,"Housing and Utilities",0,null,null,null,"Housing and Utilities",0]
[null,null,null,null,null,"Vehicle Ownership Costs",0,null,null,null,"Vehicle Ownership Costs",251]
[null,null,null,null,null,"Vehicle Operating Costs",0,null,null,null,"Vehicle Operating Costs",0]
[null,null,null,null,null,"Public Transportation",0,null,null,null,"Public Transportation",0]
[null,null,null,null,null,"Health Insurance ",0,null,null,null,"Health Insurance ",0]
{"$rows_left_out":10}
{"sheet":"433-A","index":9,"n_rows":34,"n_cols":80,"rows_kept":34,"cut":false,"hidden":true,"merged":[[16,1,32,1],[16,2,16,3],[16,5,16,6],[33,5,33,6],[33,7,33,8],[0,5,0,7],[0,52,1,53],[0,78,1,79],[1,1,14,1],[1,2,1,4],[1,5,1,7],[2,52,2,53],[2,78,2,79],[7,2,7,4]]}
["AAAAAAAABABF",null,null,null,null,"433-A / S.E.",null,null,null,null,null,null,null,null,null,null,null,null,null,null,null,null,null,null,null,null,null,null,null,null,null,null,null,null,null,null,null,null,null,null,null,null,null,null,null,null,null,null,null,null,null,null,{"$f":"SUM(BB5:BB32)","v":0},null,null,null,null,null,null,null,null,null,null,null,null,null,null,null,null,null,null,null,null,null,null,null,null,null,{"$f":"SUM(CB5:CB32)","v":0}]
[null,"Self Employment","Total Monthly Business Income ",null,null,"Total Monthly Business Expenses"]
[null,null,67,"Gross Receipts ",null,77,"Materials Purchased",null,null,null,{"$f":"\"Claims income from self-employment of \" & TEXT(E13,\"$* #,##0.00\") & \" with expenses of \" & TEXT(H14,\"$* #,##0.00\") & \" giving \" & TEXT(H15,\"$* #,##0.00\") & \" to taxpayer as business income\" & \".\"","v":"Claims income from self-employment of $0.00 with expenses of $0.00 giving $0.00 to taxpayer as business income."},null,null,null,null,null,null,null,null,null,null,null,null,null,null,null,null,null,null,null,null,null,null,null,null,null,null,null,null,null,null,null,null,null,null,null,null,null,null,null,null,null,"Self-Employment (Other)",null,null,null,null,null,null,null,null,null,null,null,null,null,null,null,null,null,null,null,null,null,null,null,null,null,"Personal (Other)"]
[null,null,68,"Gross Rental Income ",null,78,"Inventory Purchased",null,null,null,null,null,null,null,null,null,null,null,null,null,null,null,null,null,null,null,null,null,null,null,null,null,null,null,null,null,null,null,null,null,null,null,null,null,null,null,null,null,null,null,null,null,"Item","Amount",null,null,null,null,null,null,null,null,null,null,null,null,null,null,null,null,null,null,null,null,null,null,null,null,"Item","Amount"]
[null,null,69,"Interest ",null,79,"Gross Wages & Salaries"]
[null,null,70,"Dividends ",null,80,"Rent"]
{"$rows_left_out":29}
{"sheet":"Bus Exp","index":10,"n_rows":15,"n_cols":12,"rows_kept":15,"cut":false,"hidden":true,"merged":[]}
["Item","Amount","Category",null,null,"Materials Purchased",0,null,null,null,"Food, Clothing, and Misc."]
[null,null,null,null,null,"Inventory Purchased",0,null,null,null,"Housing and Utilities",0]
[null,null,null,null,null,"Gross Wages & Salaries",0,null,null,null,"Vehicle Ownership Costs",251]
[null,null,null,null,null,"Rent",0,null,null,null,"Vehicle Operating Costs",0]
[null,null,null,null,null,"Supplies",0,null,null,null,"Public Transportation",0]
[null,null,null,null,null,"Utilities/Telephone",0,null,null,null,"Health Insurance ",0]
{"$rows_left_out":10}
{"sheet":"433-B","index":11,"n_rows":32,"n_cols":8,"rows_kept":32,"cut":false,"hidden":true,"merged":[[1,1,1,3],[1,4,1,6],[8,1,8,3],[14,1,15,1],[14,2,15,2],[14,3,15,3]]}
[]
[null,"Total Monthly Business Income ",null,null,"Total Monthly Business Expenses "]
[null,null,"Source ","Gross Monthly ",null,"Expense Items ","Actual Monthly ","Adjusted Monthly"]
[null,25,"Gross Receipts from Sales/Services ",null,36,"Materials Purchased",null,{"$f":"G4","v":0}]
[null,26,"Gross Rental Income ",null,37,"Inventory Purchased",null,0]
[null,27,"Interest Income ",null,38,"Gross Wages & Salaries ",null,0]
{"$rows_left_out":27}
{"sheet":"Assets","index":12,"n_rows":53,"n_cols":33,"rows_kept":53,"cut":false,"hidden":true,"merged":[]}
["Total Assets:",{"$f":"SUM(Assets!B$3:$B50)","v":0},{"$f":"SUM(Assets!C$3:C50)","v":0},null,"Y"]
["Asset","FMV","Loan Balance","Equity","Use Forced Sale Value?"," Sale Value","Net Proceeds if Seized","Disposition",null,null,null,null,null,null,null,null,null,null,null,null,null,null,null,null,null,null,"Asset","FMV","Loan Balance","Equity","Forced Sale Value","Input Sale Value","Net Proceeds if Seized"]
[null,null,null,null,null,null,null,null,{"$f":"IF(A3=\"\",\"F\",\"T\")","v":"F"},null,null,null,null,null,null,null,null,null,null,null,null,null,null,null,null,null,null,{"$f":"B3","v":0},{"$f":"C3","v":0},{"$f":"IF(OR(B3=\"\",C3=\"\"),\"\",IF(B3-C3<1,\"None\",B3-C3))","v":""},{"$f":"(B3*0.6)","v":0},null,{"$f":"(B3*0.6)-C3","v":0}]
[null,null,null,null,null,null,null,null,{"$f":"IF(A4=\"\",\"F\",\"T\")","v":"F"}]
[null,null,null,null,null,null,null,null,"F"]
[null,null,null,null,null,null,null,null,"F"]
{"$rows_left_out":48}
{"sheet":"Other","index":13,"n_rows":24,"n_cols":26,"rows_kept":24,"cut":false,"hidden":true,"merged":[[0,0,0,2],[0,7,0,9],[0,14,0,16],[0,21,0,23]]}
["Item",null,null,null,null,null,null,"Item",null,null,null,null,null,null,"Item",null,null,null,null,null,null,"Item"]
[null,"Used Period",null,"Used Amount","Is value a #?",null,null,null,"Used Period",null,"Used Amount","Is value a #?",null,null,null,"Used Period",null,"Used Amount","Is value a #?",null,null,null,"Used Period",null,"Used Amount","Is value a #?"]
["Period1",{"$f":"IF(LEFT(A3,6)=\"Period\",TRUE,FALSE)","v":true},"Amount1",{"$f":"IF(LEFT(C3,6)=\"Amount\",TRUE,FALSE)","v":true},{"$f":"IF(ISNUMBER(C3),TRUE,FALSE)","v":false},null,null,"Period1",{"$f":"IF(LEFT(H3,6)=\"Period\",TRUE,FALSE)","v":true},"Amount1",{"$f":"IF(LEFT(J3,6)=\"Amount\",TRUE,FALSE)","v":true},{"$f":"IF(ISNUMBER(J3),TRUE,FALSE)","v":false},null,null,"Period1",{"$f":"IF(LEFT(O3,6)=\"Period\",TRUE,FALSE)","v":true},"Amount1",{"$f":"IF(LEFT(Q3,6)=\"Amount\",TRUE,FALSE)","v":true},{"$f":"IF(ISNUMBER(Q3),TRUE,FALSE)","v":false},null,null,"Period1",{"$f":"IF(LEFT(V3,6)=\"Period\",TRUE,FALSE)","v":true},"Amount1",{"$f":"IF(LEFT(X3,6)=\"Amount\",TRUE,FALSE)","v":true},{"$f":"IF(ISNUMBER(X3),TRUE,FALSE)","v":false}]
["Period2",true,"Amount2",{"$f":"IF(LEFT(C4,6)=\"Amount\",TRUE,FALSE)","v":true},false,null,null,"Period2",true,"Amount2",{"$f":"IF(LEFT(J4,6)=\"Amount\",TRUE,FALSE)","v":true},false,null,null,"Period2",true,"Amount2",{"$f":"IF(LEFT(Q4,6)=\"Amount\",TRUE,FALSE)","v":true},false,null,null,"Period2",true,"Amount2",{"$f":"IF(LEFT(X4,6)=\"Amount\",TRUE,FALSE)","v":true},false]
["Period3",true,"Amount3",true,false,null,null,"Period3",true,"Amount3",true,false,null,null,"Period3",true,"Amount3",true,false,null,null,"Period3",true,"Amount3",true,false]
["Period4",true,"Amount4",true,false,null,null,"Period4",true,"Amount4",true,false,null,null,"Period4",true,"Amount4",true,false,null,null,"Period4",true,"Amount4",true,false]
{"$rows_left_out":19}
{"sheet":"ShadowSheet","index":14,"n_rows":53,"n_cols":36,"rows_kept":53,"cut":false,"hidden":true,"merged":[]}
[{"$f":"SUMIF('Pers Exp'!C:C,'Pers Exp'!F1,'Pers Exp'!B:B)","v":0},"Food, Clothing, and Misc."]
[{"$f":"SUMIF('Pers Exp'!C:C,'Pers Exp'!F2,'Pers Exp'!B:B)","v":0},"Housing and Utilities",null,null,null,null,null,null,null,null,null,null,null,null,null,null,null,null,null,null,null,null,null,null,null,null,"Asset","FMV","Loan Balance","Equity","Use Forced Sale Value?","Sale Value"," Forced Sale Value","Net Proceeds if Seized","Disposition","Input Sale Value"]
[{"$f":"SUMIF('Pers Exp'!C:C,'Pers Exp'!F3,'Pers Exp'!B:B)","v":0},"Vehicle Ownership Costs",null,null,"Range(\"K",1,"\"",") = Sheets(\"ShadowSheet\").Range(\"B",1,").Value",{"$f":"E3&F3&G3&H3&I3&G3&J3","v":"Range(\"K1\") = Sheets(\"ShadowSheet\").Range(\"B1\").Value"},null,null,null,null,null,null,null,null,null,null,null,null,null,null,null,null,{"$f":"Assets!B3","v":0},{"$f":"Assets!C3","v":0},{"$f":"IF(AB3=\"\",\"\",AB3-AC3)","v":0},{"$f":"Assets!E3","v":0},{"$f":"IF(OR(AE3=0,AE3=\"0\",AE3=\"\",AE3=\"Y\"),AG3,AJ3)","v":0},{"$f":"AB3*0.6","v":0},{"$f":"IF(AND(AF3>AC3,AF3>0),AF3-AC3,0)","v":0},null,{"$f":"IF(AE3=\"N\",Assets!F3,\"\")","v":""}]
[{"$f":"SUMIF('Pers Exp'!C:C,'Pers Exp'!F4,'Pers Exp'!B:B)","v":0},"Vehicle Operating Costs",null,null,"Range(\"K",2,"\"",") = Sheets(\"ShadowSheet\").Range(\"B",2,").Value",{"$f":"E4&F4&G4&H4&I4&G4&J4","v":"Range(\"K2\") = Sheets(\"ShadowSheet\").Range(\"B2\").Value"},null,null,null,null,null,null,null,null,null,null,null,null,null,null,null,null,{"$f":"Assets!B4","v":0},{"$f":"Assets!C4","v":0},{"$f":"IF(AB4=\"\",\"\",AB4-AC4)","v":0},{"$f":"Assets!E4","v":0},{"$f":"IF(OR(AE4=0,AE4=\"0\",AE4=\"\",AE4=\"Y\"),AG4,AJ4)","v":0},{"$f":"AB4*0.6","v":0},{"$f":"IF(AND(AF4>AC4,AF4>0),AF4-AC4,0)","v":0}]
[{"$f":"SUMIF('Pers Exp'!C:C,'Pers Exp'!F5,'Pers Exp'!B:B)","v":0},"Public Transportation",null,null,"Range(\"K",3,"\"",") = Sheets(\"ShadowSheet\").Range(\"B",3,").Value","Range(\"K3\") = Sheets(\"ShadowSheet\").Range(\"B3\").Value",null,null,null,null,null,null,null,null,null,null,null,null,null,null,null,null,{"$f":"Assets!B5","v":0},{"$f":"Assets!C5","v":0},0,{"$f":"Assets!E5","v":0},0,0,0]
[{"$f":"SUMIF('Pers Exp'!C:C,'Pers Exp'!F6,'Pers Exp'!B:B)","v":0},"Health Insurance ",null,null,"Range(\"K",4,"\"",") = Sheets(\"ShadowSheet\").Range(\"B",4,").Value","Range(\"K4\") = Sheets(\"ShadowSheet\").Range(\"B4\").Value",null,null,null,null,null,null,null,null,null,null,null,null,null,null,null,null,{"$f":"Assets!B6","v":0},{"$f":"Assets!C6","v":0},0,{"$f":"Assets!E6","v":0},0,0,0]
{"$rows_left_out":47}